{"text_format":"1","workbook":"xlsx","n_sheets":9,"sheets":["MENU","TABLAS","Datos","TBC0011","TBC1217","TBC1829","TBC3059","TBC6099","TOTAL"],"not_rendered":{"charts":0,"images":30,"macros":1,"external_links":0,"defined_names":13,"comments":0,"pivot_tables":6},"unopened":[],"bounds":{"document_bytes":16777216,"sheet_cells":100000,"rows_first":2000,"rows_last":500,"rows_between":2000,"halvings":0,"cell_chars":16384,"cell_head_chars":4096},"cells_cut":0,"cells_raw":0,"read":"whole","date_system":"1900"}

{"sheet":"MENU","index":0,"n_rows":29,"n_cols":12,"rows_kept":29,"cut":false,"hidden":false,"merged":[[28,7,29,10],[26,7,27,10]]}
[]
[]
[]
[null,null,null,null,null,null,null,null,null,null,null,{"$f":"+TABLAS!A81","v":"1-2-3-T--------"}]
[null,null,null,null,null,null,null,null,null,null,null,{"$f":"+TABLAS!A117","v":"1-2-3-T--------"}]
[null,null,null,null,null,null,null,null,null,null,null,{"$f":"+TABLAS!A152","v":"1-2-3-T--------"}]
[null,null,null,null,null,null,null,null,null,null,null,{"$f":"+TABLAS!A190","v":"1-2-3-T--------"}]
[null,null,null,null,null,null,null,null,null,null,null,{"$f":"+TABLAS!A225","v":"1-2-3-T--------"}]
[null,null,null,null,null,null,null,null,null,null,null,{"$f":"+GETPIVOTDATA(\"Suma de total\",TABLAS!$A$242)","v":0}]
[]
[]
[]
[]
[]
[]
[]
[]
[]
[]
[]
[]
[]
[]
[]
[]
[]
[null,null,null,null,null,null,null,"CONTROL DE MESES"]
[]
[null,null,null,null,null,null,null,{"$f":"+TABLAS!A190","v":"1-2-3-T--------"}]

{"sheet":"TABLAS","index":1,"n_rows":244,"n_cols":232,"rows_kept":244,"cut":false,"hidden":true,"merged":[[224,0,224,1],[189,0,189,1],[116,0,116,1],[151,0,151,1],[11,3,11,6],[12,3,12,6],[13,3,13,6],[7,2,7,6],[8,3,8,6],[9,3,9,6],[10,3,10,6],[80,0,80,1]]}
[]
[]
[]
[]
[]
[]
[]
[null,null,"Valores",null,null,null,null,null,"Tabla",{"$f":"IF(I9=\"(Todas)\",\"CUSCO \",\"\")","v":""}]
[null,null,"RED","03 - LA CONVENCION",null,null,null,null,{"$f":"IF(MID(D9,1,2)=\"99\",\"(All)\",MID(D9,1,2))","v":"03"},{"$f":"IF(I9=\"(All)\",\" \",I9)","v":"03"},null,null,{"$f":"LEN(MID(D9,5,90))","v":14},null,{"$f":"IF(MID(D9,6,5)=\"(All)\",\"\",D9)","v":"03 - LA CONVENCION"}]
[null,null,"Micro RED","0399 - (All)",null,null,null,null,{"$f":"IF(MID(D10,3,2)=\"99\",\"(All)\",MID(D10,1,4))","v":"(All)"}," ",null,null,{"$f":"LEN(MID(D10,7,90))","v":6},null,{"$f":"IF(MID(D10,8,5)=\"(All)\",\"\",D10)","v":""}]
[null,null,"Establecimiento","999999999 - (All)",null,null,null,null,{"$f":"IF(OR(MID(D11,1,9)=\"999999999\",MID(D11,1,9)=\"000000000\"),\"(All)\",MID(D11,1,9))","v":"(All)"}," ",null,null,{"$f":"LEN(MID(D11,12,90))","v":6},null,{"$f":"IF(MID(D11,13,5)=\"(All)\",\"\",D11)","v":""},null,{"$f":"MID(O11,1,9)","v":""}]
[null,null,"Provincia","00 - (All)",null,null,null,null,{"$f":"IF(MID(D12,1,2)=\"00\",\"(All)\",MID(D12,1,2))","v":"(All)"}," ",null,null,{"$f":"LEN(MID(D12,6,90))","v":5},null,{"$f":"IF(MID(D12,6,5)=\"(All)\",\"\",D12)","v":""}]
[null,null,"Distrito","0000 - (All)",null,null,null,null,{"$f":"IF(OR(MID(D13,1,4)=\"0000\",MID(D13,3,2)=\"00\"),\"(All)\",MID(D13,1,4))","v":"(All)"}," ",null,null,{"$f":"LEN(MID(D13,8,90))","v":5},null,{"$f":"IF(MID(D13,8,5)=\"(All)\",\"\",D13)","v":""}]
[null,null,"Ejecutira","99 - (ALL)",null,null,null,null,{"$f":"IF(MID(D14,1,2)=\"99\",\"(All)\",MID(D14,1,2))","v":"(All)"}," ",null,null,{"$f":"LEN(MID(D14,5,90))","v":6},null,{"$f":"IF(MID(D14,6,5)=\"(All)\",\"\",D14)","v":""}]
[]
[null,null,"Año","2025",null,null,null,null,{"$f":"+D16","v":"2025"},{"$f":"IF(I16=\"(Todas)\",\" \",I16)","v":"2025"}]
[]
[]
[]
[null,1,1,1,0,0,0,0,0,0,0,0,0,{"$f":"SUM(B20:M20)","v":3}]
[null,{"$f":"IF(B20=1,\"ENERO\",\"\")","v":"ENERO"},{"$f":"IF(C20=1,\"FEBRERO\",\"\")","v":"FEBRERO"},{"$f":"IF(D20=1,\"MARZO\",\"\")","v":"MARZO"},{"$f":"IF(E20=1,\"ABRIL\",\"\")","v":""},{"$f":"IF(F20=1,\"MAYO\",\"\")","v":""},{"$f":"IF(G20=1,\"JUNIO\",\"\")","v":""},{"$f":"IF(H20=1,\"JULIO\",\"\")","v":""},{"$f":"IF(I20=1,\"AGOSTO\",\"\")","v":""},{"$f":"IF(J20=1,\"SETIEMBRE\",\"\")","v":""},{"$f":"IF(K20=1,\"OCTUBRE\",\"\")","v":""},{"$f":"IF(L20=1,\"NOVIEMBRE\",\"\")","v":""},{"$f":"IF(M20=1,\"DICIEMBRE\",\"\")","v":""},{"$f":"IF(B20=1,B21,IF(C20=1,C21,IF(D20=1,D21,IF(E20=1,E21,IF(F20=1,F21,IF(G20=1,G21,IF(H20=1,H21,IF(I20=1,I21,IF(J20=1,J21,IF(K20=1,K21,IF(L20=1,L21,IF(M20=1,M21,\"\"))))))))))))","v":"ENERO"}]
[null,null,null,null,null,null,null,null,null,null,null,null,null,{"$f":"IF(N20=1,N21,\"\")","v":""}]
[null,2,4,6,null,null,null,null,null,null,null,null,null,{"$f":"MIN(B23:M23)","v":2},{"$f":"MAX(B23:M23)","v":6},{"$f":"MAX(C23:N23)","v":6}]
[null,{"$f":"IF(B23=2,\"ENE\",\"\")","v":"ENE"},{"$f":"IF(C23=4,\"FEB\",\"\")","v":"FEB"},{"$f":"IF(D23=6,\"MAR\",\"\")","v":"MAR"},{"$f":"IF(E23=8,\"ABR\",\"\")","v":""},{"$f":"IF(F23=10,\"MAY\",\"\")","v":""},{"$f":"IF(G23=12,\"JUN\",\"\")","v":""},{"$f":"IF(H23=14,\"JUL\",\"\")","v":""},{"$f":"IF(I23=16,\"AGO\",\"\")","v":""},{"$f":"IF(J23=18,\"SET\",\"\")","v":""},{"$f":"IF(K23=20,\"OCT\",\"\")","v":""},{"$f":"IF(L23=22,\"NOV\",\"\")","v":""},{"$f":"IF(M23=24,\"DIC\",\"\")","v":""},{"$f":"IF(N23=B23,B24,IF(N23=C23,C24,IF(N23=D23,D24,IF(N23=E23,E24,IF(N23=F23,F24,IF(N23=G23,G24,IF(N23=H23,#REF!,IF(N23=I23,I24,IF(N23=J23,J24,IF(N23=K23,K24,IF(N23=L23,L24,IF(N23=M23,M24,\"\"))))))))))))","v":"ENE"},{"$f":"IF(O23=C23,C24,IF(O23=D23,D24,IF(O23=E23,E24,IF(O23=F23,F24,IF(O23=G23,G24,IF(O23=H23,H24,IF(O23=I23,I24,IF(O23=J23,J24,IF(O23=K23,K24,IF(O23=L23,L24,IF(O23=M23,M24,\"\")))))))))))","v":"MAR"},{"$f":"IF(P23=D23,D24,IF(P23=E23,E24,IF(P23=F23,F24,IF(P23=G23,G24,IF(P23=H23,H24,IF(P23=I23,I24,IF(P23=J23,J24,IF(P23=K23,K24,IF(P23=L23,L24,IF(P23=M23,M24,IF(P23=N23,N24,\"\")))))))))))","v":"MAR"}]
[null,null,null,null,null,null,null,null,null,null,null,null,null,{"$f":"CONCATENATE(N24,\" - \",O24)","v":"ENE - MAR"}]
[null,null,null,null,null,null,null,null,null,null,null,null,null,{"$f":"IF(N23=O23,N22,N25)","v":"ENE - MAR"}]
[]
[]
[]
[]
[]
[]
[]
[]
[]
[]
[]
[]
[]
[]
[]
[]
[]
[]
[]
[]
[]
[]
[]
["TUBERCU_0011"]
["ANNO",2025]
["cod_red","03"]
["codmic","(Todas)"]
["cod_prov","(Todas)"]
["coddist","(Todas)"]
["cod_estab","(Todas)"]
["cod_eje","(Todas)"]
[]
[null,"Valores"]
["Etiquetas de fila"," BAS001"," BAS002"," BAS003"," BAS004"," BAS005"," BAS006"," BAS007"," BAS008"," BAS009"," BAS010"," BAS011"," BAS012"," BAS013"," BAS014"," BAS015"," BAS016"," BAS017"," BAS018"," BAS019"," BAS020"," BAS021"," BAS022"," BAS023"," BAS024"," BAS025"," BAS026"," BAS027"," BAS028"," BAS029"," BAS030"," BAS031"," BAS032"," BAS033"," BAS034"," BAS035"," BAS036"," BAS037"," BAS038"," BAS039"," BAS040"," BAS041"," BAS042"," BAS043"," BAS044"," BAS045"," BAS046"," BAS047"," BAS048"," BAS049"," BAS050"," BAS051"," BAS052"," BAS053"," BAS054"," BAS055"," BAS056"," BAS057"," BAS058"," BAS059"," BAS060"," BAS061"," BAS062"," BAS063"," BAS064"," BAS065"," BAS066"," BAS067"," BAS068"," BAS069"," BAS070"," BAS071"," BAS072"," BAS073"," BAS074"," BAS075"," BAS076"," BAS077"," BAS078"," BAS079"," BAS080"," BAS081"," BAS082"," BAS083"," BAS084"," BAS085"," BAS086"," BAS087"," BAS088"," BAS089"," BAS090"," BAS091"," BAS092"," BAS093"," BAS094"," BAS095"," BAS096"," BAS097"," BAS098"," BAS099"," BAS100"," BAS101"," BAS102"," BAS103"," BAS104"," BAS105"," BAS106"," BAS107"," BAS108"," BAS109"," BAS110"," BAS111"," BAS112"," BAS113"," BAS114"," BAS115"," BAS116"," BAS117"," BAS118"," BAS119"," BAS120"," BAS121"," BAS122"," BAS123"," BAS124"," BAS125"," BAS126"," BAS127"," BAS128"," BAS129"," BAS130"," BAS131"," BAS132"," BAS133"," BAS134"," BAS135"," BAS136"," BAS137"," BAS138"," BAS139"," BAS140"," BAS141"," BAS142"," BAS143"," BAS144"," BAS145"," BAS146"," BAS147"," BAS148"," BAS149"," BAS150"," BAS151"," BAS152"," BAS153"," BAS154"," BAS155"," BAS156"," BAS157"," BAS158"," BAS159"," BAS160"," BAS161"," BAS162"," BAS163"," BAS164"," BAS165"," BAS166"," BAS167"," BAS168"," BAS169"," BAS170"," BAS171"," BAS172"," BAS173"," BAS174"," BAS175"," BAS176"," BAS177"," BAS178"," BAS179"," BAS180"," BAS181"," BAS182"," BAS183"," BAS184"," BAS185"," BAS186"," BAS187"," BAS188"," BAS189"," BAS190"," BAS191"," BAS192"," BAS193"," BAS194"," BAS195"," BAS196"," BAS197"," BAS198"," BAS199"," BAS200"," BAS201"," BAS202"," BAS203"," BAS204"," BAS205"," BAS206"," BAS207"," BAS208"," BAS209"," BAS210"," BAS211"," BAS212"," BAS213"," BAS214"," BAS215"," BAS216"," BAS217"," BAS218"," BAS219"," BAS220"," BAS221"," BAS222"," BAS223"," BAS224"," BAS225"," BAS226"," BAS227"," BAS228"," BAS229"," BAS230"]
[1,29,0,0,0,0,0,0,0,0,0,0,0,0,0,0,1,0,0,0,0,0,0,0,0,0,0,0,54,0,1,0,0,0,3,1,0,0,0,12,0,3,0,0,0,0,0,0,1,0,0,0,0,0,0,0,0,1,0,0,0,0,0,0,0,0,0,0,0,0,0,0,0,0,0,0,0,0,0,0,0,0,0,0,12,0,0,0,0,0,0,0,0,0,0,0,0,0,0,0,0,0,0,0,4,3,0,0,0,0,0,0,0,0,3,3,0,0,0,2,0,0,0,0,0,0,0,0,0,0,0,0,0,0,0,0,0,0,0,0,0,0,0,0,0,0,0,0,0,0,0,0,0,0,0,0,0,0,0,0,0,0,0,0,0,0,0,0,0,0,0,0,0,0,0,0,0,0,0,0,0,0,0,0,0,0,0,0,0,0,0,0,0,0,0,0,0,0,0,0,0,0,0,0,0,0,0,0,0,0,0,0,0,0,0,0,0,0,0,0,0,0,0,0,0,0,0,0,0,0,0]
[2,18,0,0,0,0,0,0,0,0,0,0,0,0,0,0,0,0,0,0,0,0,0,0,0,0,0,0,50,0,1,0,0,0,0,0,0,0,0,14,0,0,0,0,0,0,0,0,4,0,0,0,0,0,0,0,0,1,0,0,0,0,0,0,0,0,0,0,0,0,0,0,0,0,0,0,0,0,0,0,0,0,0,0,14,0,0,0,0,0,0,0,0,0,0,0,0,0,0,0,0,0,0,0,5,1,0,0,0,0,0,0,0,0,4,1,0,0,0,1,0,0,0,0,0,0,0,0,0,0,0,0,0,0,0,0,0,0,0,0,0,0,0,0,0,0,0,0,0,0,0,0,0,0,0,0,0,0,0,0,0,0,0,0,0,0,0,0,0,0,0,0,0,0,0,0,0,0,0,0,0,0,0,0,0,0,0,0,0,0,0,0,0,0,0,0,0,0,0,0,0,0,0,0,0,0,0,0,0,0,0,0,0,0,0,0,0,0,0,0,0,0,0,0,0,0,0,0,0,0,0]
[3,13,0,0,0,0,0,0,0,0,0,0,0,0,0,0,0,0,0,0,0,0,0,0,1,0,0,0,48,0,1,0,0,1,0,0,0,0,0,15,0,1,0,0,0,0,0,0,1,0,0,0,0,0,0,0,0,2,0,0,0,0,0,0,0,0,0,0,0,0,0,0,0,0,0,0,0,0,0,0,0,0,0,0,15,0,0,0,0,0,0,0,0,0,0,0,0,0,0,0,0,0,0,0,6,0,0,0,0,0,0,0,0,0,2,0,0,0,0,0,0,0,0,0,0,0,0,0,0,0,0,0,0,0,0,0,0,0,0,0,0,0,0,0,0,0,0,0,0,0,0,0,0,0,0,0,0,0,0,0,0,0,0,0,0,0,0,0,0,0,0,0,0,0,0,0,0,0,0,0,0,0,0,0,0,0,0,0,0,0,0,0,0,0,0,0,0,0,0,0,0,0,0,0,0,0,0,0,0,0,0,0,0,0,0,0,0,0,0,0,0,0,0,0,0,0,0,0,0,0,0]
["T",60,0,0,0,0,0,0,0,0,0,0,0,0,0,0,1,0,0,0,0,0,0,0,1,0,0,0,152,0,3,0,0,1,3,1,0,0,0,41,0,4,0,0,0,0,0,0,6,0,0,0,0,0,0,0,0,4,0,0,0,0,0,0,0,0,0,0,0,0,0,0,0,0,0,0,0,0,0,0,0,0,0,0,41,0,0,0,0,0,0,0,0,0,0,0,0,0,0,0,0,0,0,0,15,4,0,0,0,0,0,0,0,0,9,4,0,0,0,3,0,0,0,0,0,0,0,0,0,0,0,0,0,0,0,0,0,0,0,0,0,0,0,0,0,0,0,0,0,0,0,0,0,0,0,0,0,0,0,0,0,0,0,0,0,0,0,0,0,0,0,0,0,0,0,0,0,0,0,0,0,0,0,0,0,0,0,0,0,0,0,0,0,0,0,0,0,0,0,0,0,0,0,0,0,0,0,0,0,0,0,0,0,0,0,0,0,0,0,0,0,0,0,0,0,0,0,0,0,0,0]
[]
[]
[]
[]
[]
[]
[]
[]
[]
[]
[]
[]
[]
[]
["TOTAL"]
[{"$f":"COUNT(A61:A77)","v":3},{"$f":"SUM(B61:B77)","v":120},{"$f":"SUM(C61:C77)","v":0},0,0,0,0,0,0,0,0,0,0,0,0,0,2,0,0,0,0,0,0,0,2,0,0,0,304,0,6,0,0,2,6,2,0,0,0,82,0,8,0,0,0,0,0,0,12,0,0,0,0,0,0,0,0,8,0,0,0,0,0,0,0,0,{"$f":"SUM(BO61:BO77)","v":0},0,0,0,0,0,0,0,0,0,0,0,0,0,0,0,0,0,82,0,0,0,0,0,0,0,0,0,0,0,0,0,0,0,0,0,0,0,30,8,0,0,0,0,0,0,0,0,18,8,0,0,0,6,0,0,0,0,0,0,0,0,0,0,{"$f":"SUM(EA61:EA77)","v":0},0,0,0,0,0,0,0,0,0,0,0,0,0,0,0,0,0,0,0,0,0,0,0,0,0,0,0,0,0,0,0,0,0,0,0,0,0,0,0,0,0,0,0,0,0,0,0,0,0,0,0,0,0,0,0,0,0,0,0,0,0,0,0,{"$f":"SUM(GM61:GM77)","v":0},0,0,0,0,0,0,0,0,0,0,0,0,0,0,0,0,0,0,0,0,0,0,0,0,0,0,0,0,0,0,0,0,0,0,0,0,0]
[{"$f":"CONCATENATE(A61,\"-\",A62,\"-\",A63,\"-\",A64,\"-\",A65,\"-\",A66,\"-\",A67,\"-\",A68,\"-\",A69,\"-\",A70,\"-\",A71,\"-\",A72)","v":"1-2-3-T--------"}]
[null," BAS001"," BAS002"," BAS003"," BAS004"," BAS005"," BAS006"," BAS007"," BAS008"," BAS009"," BAS010"," BAS011"," BAS012"," BAS013"," BAS014"," BAS015"," BAS016"," BAS017"," BAS018"," BAS019"," BAS020"," BAS021"," BAS022"," BAS023"," BAS024"," BAS025"," BAS026"," BAS027"," BAS028"," BAS029"," BAS030"," BAS031"," BAS032"," BAS033"," BAS034"," BAS035"," BAS036"," BAS037"," BAS038"," BAS039"," BAS040"," BAS041"," BAS042"," BAS043"," BAS044"," BAS045"," BAS046"," BAS047"," BAS048"," BAS049"," BAS050"," BAS051"," BAS052"," BAS053"," BAS054"," BAS055"," BAS056"," BAS057"," BAS058"," BAS059"," BAS060"," BAS061"," BAS062"," BAS063"," BAS064"," BAS065"," BAS066"," BAS067"," BAS068"," BAS069"," BAS070"," BAS071"," BAS072"," BAS073"," BAS074"," BAS075"," BAS076"," BAS077"," BAS078"," BAS079"," BAS080"," BAS081"," BAS082"," BAS083"," BAS084"," BAS085"," BAS086"," BAS087"," BAS088"," BAS089"," BAS090"," BAS091"," BAS092"," BAS093"," BAS094"," BAS095"," BAS096"," BAS097"," BAS098"," BAS099"," BAS100"," BAS101"," BAS102"," BAS103"," BAS104"," BAS105"," BAS106"," BAS107"," BAS108"," BAS109"," BAS110"," BAS111"," BAS112"," BAS113"," BAS114"," BAS115"," BAS116"," BAS117"," BAS118"," BAS119"," BAS120"," BAS121"," BAS122"," BAS123"," BAS124"," BAS125"," BAS126"," BAS127"," BAS128"," BAS129"," BAS130"," BAS131"," BAS132"," BAS133"," BAS134"," BAS135"," BAS136"," BAS137"," BAS138"," BAS139"," BAS140"," BAS141"," BAS142"," BAS143"," BAS144"," BAS145"," BAS146"," BAS147"," BAS148"," BAS149"," BAS150"," BAS151"," BAS152"," BAS153"," BAS154"," BAS155"," BAS156"," BAS157"," BAS158"," BAS159"," BAS160"," BAS161"," BAS162"," BAS163"," BAS164"," BAS165"," BAS166"," BAS167"," BAS168"," BAS169"," BAS170"," BAS171"," BAS172"," BAS173"," BAS174"," BAS175"," BAS176"," BAS177"," BAS178"," BAS179"," BAS180"," BAS181"," BAS182"," BAS183"," BAS184"," BAS185"," BAS186"," BAS187"," BAS188"," BAS189"," BAS190"," BAS191"," BAS192"," BAS193"," BAS194"," BAS195"," BAS196"," BAS197"," BAS198"," BAS199"," BAS200"," BAS201"," BAS202"," BAS203"," BAS204"," BAS205"," BAS206"," BAS207"," BAS208"," BAS209"," BAS210"," BAS211"," BAS212"," BAS213"," BAS214"," BAS215"," BAS216"," BAS217"," BAS218"," BAS219"," BAS220"," BAS221"," BAS222"," BAS223"," BAS224"," BAS225"," BAS226"," BAS227"," BAS228"," BAS229"," BAS230"]
[null,{"$f":"IF(B82=B60,\"SI\",\"NO\")","v":"SI"},{"$f":"IF(C82=C60,\"SI\",\"NO\")","v":"SI"},"SI","SI","SI","SI","SI","SI","SI","SI","SI","SI","SI","SI","SI","SI","SI","SI","SI","SI","SI","SI","SI","SI","SI","SI","SI","SI","SI","SI","SI","SI","SI","SI","SI","SI","SI","SI","SI","SI","SI","SI","SI","SI","SI","SI","SI","SI","SI","SI","SI","SI","SI","SI","SI","SI","SI","SI","SI","SI","SI","SI","SI","SI","SI",{"$f":"IF(BO82=BO60,\"SI\",\"NO\")","v":"SI"},"SI","SI","SI","SI","SI","SI","SI","SI","SI","SI","SI","SI","SI","SI","SI","SI","SI","SI","SI","SI","SI","SI","SI","SI","SI","SI","SI","SI","SI","SI","SI","SI","SI","SI","SI","SI","SI","SI","SI","SI","SI","SI","SI","SI","SI","SI","SI","SI","SI","SI","SI","SI","SI","SI","SI","SI","SI","SI","SI","SI","SI","SI","SI",{"$f":"IF(EA82=EA60,\"SI\",\"NO\")","v":"SI"},"SI","SI","SI","SI","SI","SI","SI","SI","SI","SI","SI","SI","SI","SI","SI","SI","SI","SI","SI","SI","SI","SI","SI","SI","SI","SI","SI","SI","SI","SI","SI","SI","SI","SI","SI","SI","SI","SI","SI","SI","SI","SI","SI","SI","SI","SI","SI","SI","SI","SI","SI","SI","SI","SI","SI","SI","SI","SI","SI","SI","SI","SI","SI",{"$f":"IF(GM82=GM60,\"SI\",\"NO\")","v":"SI"},"SI","SI","SI","SI","SI","SI","SI","SI","SI","SI","SI","SI","SI","SI","SI","SI","SI","SI","SI","SI","SI","SI","SI","SI","SI","SI","SI","SI","SI","SI","SI","SI","SI","SI","SI","SI",{"$f":"IF(HW82=HX60,\"SI\",\"NO\")","v":"NO"}]
[]
[]
["TUBERCU_1217"]
["ANNO",2025]
["cod_red","03"]
["codmic","(Todas)"]
["cod_prov","(Todas)"]
["coddist","(Todas)"]
["cod_estab","(Todas)"]
["cod_eje","(Todas)"]
[]
[null,"Valores"]
["Etiquetas de fila"," BAS001"," BAS002"," BAS003"," BAS004"," BAS005"," BAS006"," BAS007"," BAS008"," BAS009"," BAS010"," BAS011"," BAS012"," BAS013"," BAS014"," BAS015"," BAS016"," BAS017"," BAS018"," BAS019"," BAS020"," BAS021"," BAS022"," BAS023"," BAS024"," BAS025"," BAS026"," BAS027"," BAS028"," BAS029"," BAS030"," BAS031"," BAS032"," BAS033"," BAS034"," BAS035"," BAS036"," BAS037"," BAS038"," BAS039"," BAS040"," BAS041"," BAS042"," BAS043"," BAS044"," BAS045"," BAS046"," BAS047"," BAS048"," BAS049"," BAS050"," BAS051"," BAS052"," BAS053"," BAS054"," BAS055"," BAS056"," BAS057"," BAS058"," BAS059"," BAS060"," BAS061"," BAS062"," BAS063"," BAS064"," BAS065"," BAS066"," BAS067"," BAS068"," BAS069"," BAS070"," BAS071"," BAS072"," BAS073"," BAS074"," BAS075"," BAS076"," BAS077"," BAS078"," BAS079"," BAS080"," BAS081"," BAS082"," BAS083"," BAS084"," BAS085"," BAS086"," BAS087"," BAS088"," BAS089"," BAS090"," BAS091"," BAS092"," BAS093"," BAS094"," BAS095"," BAS096"," BAS097"," BAS098"," BAS099"," BAS100"," BAS101"," BAS102"," BAS103"," BAS104"," BAS105"," BAS106"," BAS107"," BAS108"," BAS109"," BAS110"," BAS111"," BAS112"," BAS113"," BAS114"," BAS115"," BAS116"," BAS117"," BAS118"," BAS119"," BAS120"," BAS121"," BAS122"," BAS123"," BAS124"," BAS125"," BAS126"," BAS127"," BAS128"," BAS129"," BAS130"," BAS131"," BAS132"," BAS133"," BAS134"," BAS135"," BAS136"," BAS137"," BAS138"," BAS139"," BAS140"," BAS141"," BAS142"," BAS143"," BAS144"," BAS145"," BAS146"," BAS147"," BAS148"," BAS149"," BAS150"," BAS151"," BAS152"," BAS153"," BAS154"," BAS155"," BAS156"," BAS157"," BAS158"," BAS159"," BAS160"," BAS161"," BAS162"," BAS163"," BAS164"," BAS165"," BAS166"," BAS167"," BAS168"," BAS169"," BAS170"," BAS171"," BAS172"," BAS173"," BAS174"," BAS175"," BAS176"," BAS177"," BAS178"," BAS179"," BAS180"," BAS181"," BAS182"," BAS183"," BAS184"," BAS185"," BAS186"," BAS187"," BAS188"," BAS189"," BAS190"," BAS191"," BAS192"," BAS193"," BAS194"," BAS195"," BAS196"," BAS197"," BAS198"," BAS199"," BAS200"," BAS201"," BAS202"," BAS203"," BAS204"," BAS205"," BAS206"," BAS207"," BAS208"," BAS209"," BAS210"," BAS211"," BAS212"," BAS213"," BAS214"," BAS215"," BAS216"," BAS217"," BAS218"," BAS219"," BAS220"," BAS221"," BAS222"," BAS223"," BAS224"," BAS225"," BAS226"," BAS227"," BAS228"," BAS229"," BAS230"]
[1,44,0,0,0,0,0,0,0,0,0,0,0,0,1,1,0,0,0,0,0,0,0,0,0,0,0,0,4,0,1,0,0,0,0,0,0,0,0,1,0,0,0,0,0,0,0,1,0,0,0,0,0,0,0,0,0,0,0,0,0,0,0,0,0,0,0,0,0,0,0,0,0,0,0,0,0,0,0,0,0,0,0,0,1,0,0,0,0,0,0,0,0,0,0,0,0,0,0,0,0,0,0,0,11,0,0,0,0,0,0,0,0,0,7,0,0,0,0,1,0,0,0,0,0,0,0,0,0,0,0,0,0,0,0,0,0,0,0,0,0,0,0,0,0,0,0,0,0,0,0,0,0,0,0,0,0,0,0,0,0,0,0,0,0,0,0,0,0,0,0,0,0,0,0,0,0,0,0,0,0,0,0,0,0,0,0,0,0,0,0,0,0,0,0,0,0,0,0,0,0,0,0,0,0,0,0,0,0,0,0,0,0,0,0,0,0,0,0,0,0,0,0,0,0,0,0,0,0,0,0]
[2,52,0,0,0,0,0,0,0,0,0,0,0,0,0,0,0,0,0,0,0,0,0,0,0,0,0,0,0,0,0,0,0,0,0,0,0,0,0,1,0,0,0,0,0,0,0,0,2,0,0,0,0,0,0,0,0,0,0,0,0,0,0,0,0,0,0,0,0,0,0,0,0,0,0,0,0,0,0,0,0,0,0,0,1,0,0,0,0,0,0,0,0,0,0,0,0,0,0,0,0,0,0,0,18,0,0,0,0,0,0,0,0,0,20,0,0,0,0,0,0,0,0,0,0,0,0,0,0,0,0,0,0,0,0,0,0,0,0,0,0,0,0,0,0,0,0,0,0,0,0,0,0,0,0,0,0,0,0,0,0,0,0,0,0,0,0,0,0,0,0,0,0,0,0,0,0,0,0,0,0,0,0,0,0,0,0,0,0,0,0,0,0,0,0,0,0,0,0,0,0,0,0,0,0,0,0,0,0,0,0,0,0,0,0,0,0,0,0,0,0,0,0,0,0,0,0,0,0,0,0]
[3,58,0,0,0,0,0,0,0,0,0,0,0,0,0,0,0,0,0,0,0,0,0,0,0,0,0,0,27,0,1,0,0,0,0,0,0,0,0,1,0,0,0,0,0,0,0,0,0,0,0,0,0,0,0,0,0,1,0,0,0,0,0,0,0,0,0,0,0,0,0,0,0,0,0,0,0,0,0,0,0,0,0,0,1,0,0,0,0,0,0,0,0,0,0,0,0,0,0,0,0,0,0,0,12,1,0,0,0,0,0,0,0,0,10,1,0,0,0,0,0,0,0,0,0,0,0,0,0,0,0,0,0,0,0,0,0,0,0,0,0,0,0,0,0,0,0,0,0,0,0,0,0,0,0,0,0,0,0,0,0,0,0,0,0,0,0,0,0,0,0,0,0,0,0,0,0,0,0,0,0,0,0,0,0,0,0,0,0,0,0,0,0,0,0,0,0,0,0,0,0,0,0,0,0,0,0,0,0,0,0,0,0,0,0,0,0,0,0,0,0,0,0,0,0,0,0,0,0,0,0]
["T",154,0,0,0,0,0,0,0,0,0,0,0,0,1,1,0,0,0,0,0,0,0,0,0,0,0,0,31,0,2,0,0,0,0,0,0,0,0,3,0,0,0,0,0,0,0,1,2,0,0,0,0,0,0,0,0,1,0,0,0,0,0,0,0,0,0,0,0,0,0,0,0,0,0,0,0,0,0,0,0,0,0,0,3,0,0,0,0,0,0,0,0,0,0,0,0,0,0,0,0,0,0,0,41,1,0,0,0,0,0,0,0,0,37,1,0,0,0,1,0,0,0,0,0,0,0,0,0,0,0,0,0,0,0,0,0,0,0,0,0,0,0,0,0,0,0,0,0,0,0,0,0,0,0,0,0,0,0,0,0,0,0,0,0,0,0,0,0,0,0,0,0,0,0,0,0,0,0,0,0,0,0,0,0,0,0,0,0,0,0,0,0,0,0,0,0,0,0,0,0,0,0,0,0,0,0,0,0,0,0,0,0,0,0,0,0,0,0,0,0,0,0,0,0,0,0,0,0,0,0]
[]
[]
[]
[]
[]
[]
[]
[]
[]
[]
[]
[]
[]
[]
["TOTAL"]
[{"$f":"COUNT(A97:A113)","v":3},{"$f":"SUM(B97:B113)","v":308},{"$f":"SUM(C97:C113)","v":0},0,0,0,0,0,0,0,0,0,0,0,2,2,0,0,0,0,0,0,0,0,0,0,0,0,62,0,4,0,0,0,0,0,0,0,0,6,0,0,0,0,0,0,0,2,4,0,0,0,0,0,0,0,0,2,0,0,0,0,0,0,0,0,{"$f":"SUM(BO97:BO113)","v":0},0,0,0,0,0,0,0,0,0,0,0,0,0,0,0,0,0,6,0,0,0,0,0,0,0,0,0,0,0,0,0,0,0,0,0,0,0,82,2,0,0,0,0,0,0,0,0,74,2,0,0,0,2,0,0,0,0,0,0,0,0,0,0,{"$f":"SUM(EA97:EA113)","v":0},0,0,0,0,0,0,0,0,0,0,0,0,0,0,0,0,0,0,0,0,0,0,0,0,0,0,0,0,0,0,0,0,0,0,0,0,0,0,0,0,0,0,0,0,0,0,0,0,0,0,0,0,0,0,0,0,0,0,0,0,0,0,0,{"$f":"SUM(GM97:GM113)","v":0},0,0,0,0,0,0,0,0,0,0,0,0,0,0,0,0,0,0,0,0,0,0,0,0,0,0,0,0,0,0,0,0,0,0,0,0]
[{"$f":"CONCATENATE(A97,\"-\",A98,\"-\",A99,\"-\",A100,\"-\",A101,\"-\",A102,\"-\",A103,\"-\",A104,\"-\",A105,\"-\",A106,\"-\",A107,\"-\",A108)","v":"1-2-3-T--------"}]
[null," BAS001"," BAS002"," BAS003"," BAS004"," BAS005"," BAS006"," BAS007"," BAS008"," BAS009"," BAS010"," BAS011"," BAS012"," BAS013"," BAS014"," BAS015"," BAS016"," BAS017"," BAS018"," BAS019"," BAS020"," BAS021"," BAS022"," BAS023"," BAS024"," BAS025"," BAS026"," BAS027"," BAS028"," BAS029"," BAS030"," BAS031"," BAS032"," BAS033"," BAS034"," BAS035"," BAS036"," BAS037"," BAS038"," BAS039"," BAS040"," BAS041"," BAS042"," BAS043"," BAS044"," BAS045"," BAS046"," BAS047"," BAS048"," BAS049"," BAS050"," BAS051"," BAS052"," BAS053"," BAS054"," BAS055"," BAS056"," BAS057"," BAS058"," BAS059"," BAS060"," BAS061"," BAS062"," BAS063"," BAS064"," BAS065"," BAS066"," BAS067"," BAS068"," BAS069"," BAS070"," BAS071"," BAS072"," BAS073"," BAS074"," BAS075"," BAS076"," BAS077"," BAS078"," BAS079"," BAS080"," BAS081"," BAS082"," BAS083"," BAS084"," BAS085"," BAS086"," BAS087"," BAS088"," BAS089"," BAS090"," BAS091"," BAS092"," BAS093"," BAS094"," BAS095"," BAS096"," BAS097"," BAS098"," BAS099"," BAS100"," BAS101"," BAS102"," BAS103"," BAS104"," BAS105"," BAS106"," BAS107"," BAS108"," BAS109"," BAS110"," BAS111"," BAS112"," BAS113"," BAS114"," BAS115"," BAS116"," BAS117"," BAS118"," BAS119"," BAS120"," BAS121"," BAS122"," BAS123"," BAS124"," BAS125"," BAS126"," BAS127"," BAS128"," BAS129"," BAS130"," BAS131"," BAS132"," BAS133"," BAS134"," BAS135"," BAS136"," BAS137"," BAS138"," BAS139"," BAS140"," BAS141"," BAS142"," BAS143"," BAS144"," BAS145"," BAS146"," BAS147"," BAS148"," BAS149"," BAS150"," BAS151"," BAS152"," BAS153"," BAS154"," BAS155"," BAS156"," BAS157"," BAS158"," BAS159"," BAS160"," BAS161"," BAS162"," BAS163"," BAS164"," BAS165"," BAS166"," BAS167"," BAS168"," BAS169"," BAS170"," BAS171"," BAS172"," BAS173"," BAS174"," BAS175"," BAS176"," BAS177"," BAS178"," BAS179"," BAS180"," BAS181"," BAS182"," BAS183"," BAS184"," BAS185"," BAS186"," BAS187"," BAS188"," BAS189"," BAS190"," BAS191"," BAS192"," BAS193"," BAS194"," BAS195"," BAS196"," BAS197"," BAS198"," BAS199"," BAS200"," BAS201"," BAS202"," BAS203"," BAS204"," BAS205"," BAS206"," BAS207"," BAS208"," BAS209"," BAS210"," BAS211"," BAS212"," BAS213"," BAS214"," BAS215"," BAS216"," BAS217"," BAS218"," BAS219"," BAS220"," BAS221"," BAS222"," BAS223"," BAS224"," BAS225"," BAS226"," BAS227"," BAS228"," BAS229"," BAS230"]
[null,{"$f":"IF(B118=B96,\"SI\",\"NO\")","v":"SI"},{"$f":"IF(C118=C96,\"SI\",\"NO\")","v":"SI"},"SI","SI","SI","SI","SI","SI","SI","SI","SI","SI","SI","SI","SI","SI","SI","SI","SI","SI","SI","SI","SI","SI","SI","SI","SI","SI","SI","SI","SI","SI","SI","SI","SI","SI","SI","SI","SI","SI","SI","SI","SI","SI","SI","SI","SI","SI","SI","SI","SI","SI","SI","SI","SI","SI","SI","SI","SI","SI","SI","SI","SI","SI","SI",{"$f":"IF(BO118=BO96,\"SI\",\"NO\")","v":"SI"},"SI","SI","SI","SI","SI","SI","SI","SI","SI","SI","SI","SI","SI","SI","SI","SI","SI","SI","SI","SI","SI","SI","SI","SI","SI","SI","SI","SI","SI","SI","SI","SI","SI","SI","SI","SI","SI","SI","SI","SI","SI","SI","SI","SI","SI","SI","SI","SI","SI","SI","SI","SI","SI","SI","SI","SI","SI","SI","SI","SI","SI","SI","SI",{"$f":"IF(EA118=EA96,\"SI\",\"NO\")","v":"SI"},"SI","SI","SI","SI","SI","SI","SI","SI","SI","SI","SI","SI","SI","SI","SI","SI","SI","SI","SI","SI","SI","SI","SI","SI","SI","SI","SI","SI","SI","SI","SI","SI","SI","SI","SI","SI","SI","SI","SI","SI","SI","SI","SI","SI","SI","SI","SI","SI","SI","SI","SI","SI","SI","SI","SI","SI","SI","SI","SI","SI","SI","SI","SI",{"$f":"IF(GM118=GM96,\"SI\",\"NO\")","v":"SI"},"SI","SI","SI","SI","SI","SI","SI","SI","SI","SI","SI","SI","SI","SI","SI","SI","SI","SI","SI","SI","SI","SI","SI","SI","SI","SI","SI","SI","SI","SI","SI","SI","SI","SI","SI","SI"]
[]
["TUBERCU_1829"]
["ANNO",2025]
["cod_red","03"]
["codmic","(Todas)"]
["cod_prov","(Todas)"]
["coddist","(Todas)"]
["cod_estab","(Todas)"]
["cod_eje","(Todas)"]
[]
[null,"Valores"]
["Etiquetas de fila"," BAS001"," BAS002"," BAS003"," BAS004"," BAS005"," BAS006"," BAS007"," BAS008"," BAS009"," BAS010"," BAS011"," BAS012"," BAS013"," BAS014"," BAS015"," BAS016"," BAS017"," BAS018"," BAS019"," BAS020"," BAS021"," BAS022"," BAS023"," BAS024"," BAS025"," BAS026"," BAS027"," BAS028"," BAS029"," BAS030"," BAS031"," BAS032"," BAS033"," BAS034"," BAS035"," BAS036"," BAS037"," BAS038"," BAS039"," BAS040"," BAS041"," BAS042"," BAS043"," BAS044"," BAS045"," BAS046"," BAS047"," BAS048"," BAS049"," BAS050"," BAS051"," BAS052"," BAS053"," BAS054"," BAS055"," BAS056"," BAS057"," BAS058"," BAS059"," BAS060"," BAS061"," BAS062"," BAS063"," BAS064"," BAS065"," BAS066"," BAS067"," BAS068"," BAS069"," BAS070"," BAS071"," BAS072"," BAS073"," BAS074"," BAS075"," BAS076"," BAS077"," BAS078"," BAS079"," BAS080"," BAS081"," BAS082"," BAS083"," BAS084"," BAS085"," BAS086"," BAS087"," BAS088"," BAS089"," BAS090"," BAS091"," BAS092"," BAS093"," BAS094"," BAS095"," BAS096"," BAS097"," BAS098"," BAS099"," BAS100"," BAS101"," BAS102"," BAS103"," BAS104"," BAS105"," BAS106"," BAS107"," BAS108"," BAS109"," BAS110"," BAS111"," BAS112"," BAS113"," BAS114"," BAS115"," BAS116"," BAS117"," BAS118"," BAS119"," BAS120"," BAS121"," BAS122"," BAS123"," BAS124"," BAS125"," BAS126"," BAS127"," BAS128"," BAS129"," BAS130"," BAS131"," BAS132"," BAS133"," BAS134"," BAS135"," BAS136"," BAS137"," BAS138"," BAS139"," BAS140"," BAS141"," BAS142"," BAS143"," BAS144"," BAS145"," BAS146"," BAS147"," BAS148"," BAS149"," BAS150"," BAS151"," BAS152"," BAS153"," BAS154"," BAS155"," BAS156"," BAS157"," BAS158"," BAS159"," BAS160"," BAS161"," BAS162"," BAS163"," BAS164"," BAS165"," BAS166"," BAS167"," BAS168"," BAS169"," BAS170"," BAS171"," BAS172"," BAS173"," BAS174"," BAS175"," BAS176"," BAS177"," BAS178"," BAS179"," BAS180"," BAS181"," BAS182"," BAS183"," BAS184"," BAS185"," BAS186"," BAS187"," BAS188"," BAS189"," BAS190"," BAS191"," BAS192"," BAS193"," BAS194"," BAS195"," BAS196"," BAS197"," BAS198"," BAS199"," BAS200"," BAS201"," BAS202"," BAS203"," BAS204"," BAS205"," BAS206"," BAS207"," BAS208"," BAS209"," BAS210"," BAS211"," BAS212"," BAS213"," BAS214"," BAS215"," BAS216"," BAS217"," BAS218"," BAS219"," BAS220"," BAS221"," BAS222"," BAS223"," BAS224"," BAS225"," BAS226"," BAS227"," BAS228"," BAS229"," BAS230"]
[1,193,0,0,0,0,0,0,0,0,0,0,0,0,1,0,0,0,0,0,0,0,0,0,0,0,0,0,175,20,7,0,0,0,3,0,0,0,0,25,0,0,0,0,0,0,0,0,3,1,1,0,0,0,0,0,0,3,0,1,0,0,0,0,0,0,0,0,0,0,0,0,0,0,0,0,0,0,0,0,0,0,0,0,25,0,0,0,0,0,0,0,0,0,0,0,0,0,0,0,0,0,0,0,49,2,0,1,0,10,0,0,0,0,44,2,0,1,0,7,0,0,0,0,0,0,0,0,0,0,0,0,0,0,0,0,0,0,0,0,0,0,0,0,0,0,0,0,0,0,0,0,0,0,0,0,0,0,0,0,0,0,0,0,0,0,0,0,0,0,0,0,0,0,0,0,0,0,0,0,0,0,0,0,0,0,0,0,0,0,0,0,0,0,0,0,0,0,0,0,0,0,0,0,0,0,0,0,0,0,0,0,0,0,0,0,0,0,0,0,0,0,0,0,0,0,0,0,0,0,0]
[2,151,0,0,0,0,0,0,0,0,0,0,0,0,0,0,0,0,0,0,0,0,0,0,0,0,0,0,152,2,6,0,0,0,0,0,0,0,0,3,0,0,0,0,0,0,0,0,19,1,0,0,0,0,0,0,0,1,0,0,0,0,0,0,0,0,0,0,0,0,0,0,0,0,0,0,0,0,0,0,0,0,0,0,5,0,0,0,0,0,0,0,0,0,0,0,0,0,0,0,0,0,0,0,33,1,0,0,0,0,0,0,0,0,27,1,0,0,0,17,0,0,0,0,0,0,0,0,0,0,0,0,0,0,0,0,0,0,0,0,0,0,0,0,0,0,0,0,0,0,0,0,0,0,0,0,0,0,0,0,0,0,0,0,0,0,0,0,0,0,0,0,0,0,0,0,0,0,0,0,0,0,0,0,0,0,0,0,0,0,0,0,0,0,0,0,0,0,0,0,0,0,0,0,0,0,0,0,0,0,0,0,0,0,0,0,0,0,0,0,0,0,0,0,0,0,0,0,0,0,0]
[3,230,0,0,0,0,0,0,0,0,0,0,0,0,1,1,0,0,0,0,0,0,0,0,0,0,0,0,158,1,4,0,0,0,0,0,0,0,0,7,0,0,0,0,0,0,0,1,5,0,0,0,0,0,0,0,0,2,0,0,0,0,0,0,0,0,0,0,0,0,0,0,0,0,0,0,0,0,0,0,0,0,0,0,8,0,0,0,0,0,0,0,0,0,0,0,0,0,0,0,0,0,0,0,43,0,0,0,0,3,0,0,0,0,33,0,0,0,0,9,0,0,0,0,0,0,0,0,0,0,0,0,0,0,0,0,0,0,0,0,0,0,0,0,0,0,0,0,0,0,0,0,0,0,0,0,0,0,0,0,0,0,0,0,0,0,0,0,0,0,0,0,0,0,0,0,0,0,0,0,0,0,0,0,0,0,0,0,0,0,0,0,0,0,0,0,0,0,0,0,0,0,0,0,0,0,0,0,0,0,0,0,0,0,0,0,0,0,0,0,0,0,0,0,0,0,0,0,0,0,0]
["T",574,0,0,0,0,0,0,0,0,0,0,0,0,2,1,0,0,0,0,0,0,0,0,0,0,0,0,485,23,17,0,0,0,3,0,0,0,0,35,0,0,0,0,0,0,0,1,27,2,1,0,0,0,0,0,0,6,0,1,0,0,0,0,0,0,0,0,0,0,0,0,0,0,0,0,0,0,0,0,0,0,0,0,38,0,0,0,0,0,0,0,0,0,0,0,0,0,0,0,0,0,0,0,125,3,0,1,0,13,0,0,0,0,104,3,0,1,0,33,0,0,0,0,0,0,0,0,0,0,0,0,0,0,0,0,0,0,0,0,0,0,0,0,0,0,0,0,0,0,0,0,0,0,0,0,0,0,0,0,0,0,0,0,0,0,0,0,0,0,0,0,0,0,0,0,0,0,0,0,0,0,0,0,0,0,0,0,0,0,0,0,0,0,0,0,0,0,0,0,0,0,0,0,0,0,0,0,0,0,0,0,0,0,0,0,0,0,0,0,0,0,0,0,0,0,0,0,0,0,0]
[]
[]
[]
[]
[]
[]
[]
[]
[]
[]
[]
[]
[]
[]
["TOTAL"]
[{"$f":"COUNT(A132:A148)","v":3},{"$f":"SUM(B132:B148)","v":1148},{"$f":"SUM(C132:C148)","v":0},0,0,0,0,0,0,0,0,0,0,0,4,2,0,0,0,0,0,0,0,0,0,0,0,0,970,46,34,0,0,0,6,0,0,0,0,70,0,0,0,0,0,0,0,2,54,4,2,0,0,0,0,0,0,12,0,2,0,0,0,0,0,0,{"$f":"SUM(BO132:BO148)","v":0},0,0,0,0,0,0,0,0,0,0,0,0,0,0,0,0,0,76,0,0,0,0,0,0,0,0,0,0,0,0,0,0,0,0,0,0,0,250,6,0,2,0,26,0,0,0,0,208,6,0,2,0,66,0,0,0,0,0,0,0,0,0,0,{"$f":"SUM(EA132:EA148)","v":0},0,0,0,0,0,0,0,0,0,0,0,0,0,0,0,0,0,0,0,0,0,0,0,0,0,0,0,0,0,0,0,0,0,0,0,0,0,0,0,0,0,0,0,0,0,0,0,0,0,0,0,0,0,0,0,0,0,0,0,0,0,0,0,{"$f":"SUM(GM132:GM148)","v":0},0,0,0,0,0,0,0,0,0,0,0,0,0,0,0,0,0,0,0,0,0,0,0,0,0,0,0,0,0,0,0,0,0,0,0,0]
[{"$f":"CONCATENATE(A132,\"-\",A133,\"-\",A134,\"-\",A135,\"-\",A136,\"-\",A137,\"-\",A138,\"-\",A139,\"-\",A140,\"-\",A141,\"-\",A142,\"-\",A143)","v":"1-2-3-T--------"}]
[null," BAS001"," BAS002"," BAS003"," BAS004"," BAS005"," BAS006"," BAS007"," BAS008"," BAS009"," BAS010"," BAS011"," BAS012"," BAS013"," BAS014"," BAS015"," BAS016"," BAS017"," BAS018"," BAS019"," BAS020"," BAS021"," BAS022"," BAS023"," BAS024"," BAS025"," BAS026"," BAS027"," BAS028"," BAS029"," BAS030"," BAS031"," BAS032"," BAS033"," BAS034"," BAS035"," BAS036"," BAS037"," BAS038"," BAS039"," BAS040"," BAS041"," BAS042"," BAS043"," BAS044"," BAS045"," BAS046"," BAS047"," BAS048"," BAS049"," BAS050"," BAS051"," BAS052"," BAS053"," BAS054"," BAS055"," BAS056"," BAS057"," BAS058"," BAS059"," BAS060"," BAS061"," BAS062"," BAS063"," BAS064"," BAS065"," BAS066"," BAS067"," BAS068"," BAS069"," BAS070"," BAS071"," BAS072"," BAS073"," BAS074"," BAS075"," BAS076"," BAS077"," BAS078"," BAS079"," BAS080"," BAS081"," BAS082"," BAS083"," BAS084"," BAS085"," BAS086"," BAS087"," BAS088"," BAS089"," BAS090"," BAS091"," BAS092"," BAS093"," BAS094"," BAS095"," BAS096"," BAS097"," BAS098"," BAS099"," BAS100"," BAS101"," BAS102"," BAS103"," BAS104"," BAS105"," BAS106"," BAS107"," BAS108"," BAS109"," BAS110"," BAS111"," BAS112"," BAS113"," BAS114"," BAS115"," BAS116"," BAS117"," BAS118"," BAS119"," BAS120"," BAS121"," BAS122"," BAS123"," BAS124"," BAS125"," BAS126"," BAS127"," BAS128"," BAS129"," BAS130"," BAS131"," BAS132"," BAS133"," BAS134"," BAS135"," BAS136"," BAS137"," BAS138"," BAS139"," BAS140"," BAS141"," BAS142"," BAS143"," BAS144"," BAS145"," BAS146"," BAS147"," BAS148"," BAS149"," BAS150"," BAS151"," BAS152"," BAS153"," BAS154"," BAS155"," BAS156"," BAS157"," BAS158"," BAS159"," BAS160"," BAS161"," BAS162"," BAS163"," BAS164"," BAS165"," BAS166"," BAS167"," BAS168"," BAS169"," BAS170"," BAS171"," BAS172"," BAS173"," BAS174"," BAS175"," BAS176"," BAS177"," BAS178"," BAS179"," BAS180"," BAS181"," BAS182"," BAS183"," BAS184"," BAS185"," BAS186"," BAS187"," BAS188"," BAS189"," BAS190"," BAS191"," BAS192"," BAS193"," BAS194"," BAS195"," BAS196"," BAS197"," BAS198"," BAS199"," BAS200"," BAS201"," BAS202"," BAS203"," BAS204"," BAS205"," BAS206"," BAS207"," BAS208"," BAS209"," BAS210"," BAS211"," BAS212"," BAS213"," BAS214"," BAS215"," BAS216"," BAS217"," BAS218"," BAS219"," BAS220"," BAS221"," BAS222"," BAS223"," BAS224"," BAS225"," BAS226"," BAS227"," BAS228"," BAS229"," BAS230"]
[null,{"$f":"IF(B153=B131,\"SI\",\"NO\")","v":"SI"},{"$f":"IF(C153=C131,\"SI\",\"NO\")","v":"SI"},"SI","SI","SI","SI","SI","SI","SI","SI","SI","SI","SI","SI","SI","SI","SI","SI","SI","SI","SI","SI","SI","SI","SI","SI","SI","SI","SI","SI","SI","SI","SI","SI","SI","SI","SI","SI","SI","SI","SI","SI","SI","SI","SI","SI","SI","SI","SI","SI","SI","SI","SI","SI","SI","SI","SI","SI","SI","SI","SI","SI","SI","SI","SI",{"$f":"IF(BO153=BO131,\"SI\",\"NO\")","v":"SI"},"SI","SI","SI","SI","SI","SI","SI","SI","SI","SI","SI","SI","SI","SI","SI","SI","SI","SI","SI","SI","SI","SI","SI","SI","SI","SI","SI","SI","SI","SI","SI","SI","SI","SI","SI","SI","SI","SI","SI","SI","SI","SI","SI","SI","SI","SI","SI","SI","SI","SI","SI","SI","SI","SI","SI","SI","SI","SI","SI","SI","SI","SI","SI",{"$f":"IF(EA153=EA131,\"SI\",\"NO\")","v":"SI"},"SI","SI","SI","SI","SI","SI","SI","SI","SI","SI","SI","SI","SI","SI","SI","SI","SI","SI","SI","SI","SI","SI","SI","SI","SI","SI","SI","SI","SI","SI","SI","SI","SI","SI","SI","SI","SI","SI","SI","SI","SI","SI","SI","SI","SI","SI","SI","SI","SI","SI","SI","SI","SI","SI","SI","SI","SI","SI","SI","SI","SI","SI","SI",{"$f":"IF(GM153=GM131,\"SI\",\"NO\")","v":"SI"},"SI","SI","SI","SI","SI","SI","SI","SI","SI","SI","SI","SI","SI","SI","SI","SI","SI","SI","SI","SI","SI","SI","SI","SI","SI","SI","SI","SI","SI","SI","SI","SI","SI","SI","SI","SI"]
[]
[]
[]
[]
["TUBERCU_3059"]
["ANNO",2025]
["cod_red","03"]
["codmic","(Todas)"]
["cod_prov","(Todas)"]
["coddist","(Todas)"]
["cod_estab","(Todas)"]
["cod_eje","(Todas)"]
[]
[null,"Valores"]
["Etiquetas de fila"," BAS001"," BAS002"," BAS003"," BAS004"," BAS005"," BAS006"," BAS007"," BAS008"," BAS009"," BAS010"," BAS011"," BAS012"," BAS013"," BAS014"," BAS015"," BAS016"," BAS017"," BAS018"," BAS019"," BAS020"," BAS021"," BAS022"," BAS023"," BAS024"," BAS025"," BAS026"," BAS027"," BAS028"," BAS029"," BAS030"," BAS031"," BAS032"," BAS033"," BAS034"," BAS035"," BAS036"," BAS037"," BAS038"," BAS039"," BAS040"," BAS041"," BAS042"," BAS043"," BAS044"," BAS045"," BAS046"," BAS047"," BAS048"," BAS049"," BAS050"," BAS051"," BAS052"," BAS053"," BAS054"," BAS055"," BAS056"," BAS057"," BAS058"," BAS059"," BAS060"," BAS061"," BAS062"," BAS063"," BAS064"," BAS065"," BAS066"," BAS067"," BAS068"," BAS069"," BAS070"," BAS071"," BAS072"," BAS073"," BAS074"," BAS075"," BAS076"," BAS077"," BAS078"," BAS079"," BAS080"," BAS081"," BAS082"," BAS083"," BAS084"," BAS085"," BAS086"," BAS087"," BAS088"," BAS089"," BAS090"," BAS091"," BAS092"," BAS093"," BAS094"," BAS095"," BAS096"," BAS097"," BAS098"," BAS099"," BAS100"," BAS101"," BAS102"," BAS103"," BAS104"," BAS105"," BAS106"," BAS107"," BAS108"," BAS109"," BAS110"," BAS111"," BAS112"," BAS113"," BAS114"," BAS115"," BAS116"," BAS117"," BAS118"," BAS119"," BAS120"," BAS121"," BAS122"," BAS123"," BAS124"," BAS125"," BAS126"," BAS127"," BAS128"," BAS129"," BAS130"," BAS131"," BAS132"," BAS133"," BAS134"," BAS135"," BAS136"," BAS137"," BAS138"," BAS139"," BAS140"," BAS141"," BAS142"," BAS143"," BAS144"," BAS145"," BAS146"," BAS147"," BAS148"," BAS149"," BAS150"," BAS151"," BAS152"," BAS153"," BAS154"," BAS155"," BAS156"," BAS157"," BAS158"," BAS159"," BAS160"," BAS161"," BAS162"," BAS163"," BAS164"," BAS165"," BAS166"," BAS167"," BAS168"," BAS169"," BAS170"," BAS171"," BAS172"," BAS173"," BAS174"," BAS175"," BAS176"," BAS177"," BAS178"," BAS179"," BAS180"," BAS181"," BAS182"," BAS183"," BAS184"," BAS185"," BAS186"," BAS187"," BAS188"," BAS189"," BAS190"," BAS191"," BAS192"," BAS193"," BAS194"," BAS195"," BAS196"," BAS197"," BAS198"," BAS199"," BAS200"," BAS201"," BAS202"," BAS203"," BAS204"," BAS205"," BAS206"," BAS207"," BAS208"," BAS209"," BAS210"," BAS211"," BAS212"," BAS213"," BAS214"," BAS215"," BAS216"," BAS217"," BAS218"," BAS219"," BAS220"," BAS221"," BAS222"," BAS223"," BAS224"," BAS225"," BAS226"," BAS227"," BAS228"," BAS229"," BAS230"]
[1,590,0,0,3,1,0,0,0,1,0,0,0,0,5,4,1,0,0,0,0,0,0,0,1,0,0,0,285,22,15,0,0,2,5,0,0,0,0,4,0,0,0,0,0,0,0,4,5,1,4,0,0,0,0,0,0,3,0,5,0,0,0,0,0,0,0,0,0,0,0,0,0,0,0,0,0,0,0,0,0,0,0,0,4,0,0,0,0,0,0,0,0,0,0,0,0,0,0,0,0,0,0,0,175,2,1,0,0,24,0,0,0,0,155,2,1,0,0,19,0,0,0,0,4,0,0,0,0,0,0,0,0,0,0,0,0,0,0,0,0,0,0,0,0,0,0,0,0,0,0,0,0,0,0,0,0,0,0,0,0,0,0,0,0,0,0,0,0,0,0,0,0,0,0,0,0,0,0,0,0,0,0,0,0,0,0,0,0,0,0,0,0,0,0,0,0,0,0,0,0,0,0,0,0,0,0,0,0,0,0,0,0,0,0,0,0,0,0,0,0,0,0,0,0,0,0,0,0,0,0]
[2,525,0,0,0,0,0,0,0,1,0,0,0,0,1,1,2,1,0,0,0,0,0,0,4,0,0,0,311,26,11,0,0,3,0,0,0,0,0,3,0,0,0,0,0,0,0,1,27,0,0,0,0,0,0,0,0,1,0,0,0,0,0,0,0,0,0,0,0,0,0,0,0,0,0,0,0,0,0,0,0,0,0,0,3,0,0,0,0,0,0,0,0,0,0,0,0,0,0,0,0,0,0,0,153,1,0,0,0,0,0,0,0,0,139,2,0,0,0,25,0,0,0,0,0,0,0,0,0,0,0,0,0,0,0,0,0,0,0,0,0,0,0,0,0,0,0,0,0,0,0,0,0,0,0,0,0,0,0,0,0,0,0,0,0,0,0,0,0,0,0,0,0,0,0,0,0,0,0,0,0,0,0,0,0,0,0,0,0,0,0,0,0,0,0,0,0,0,0,0,0,0,0,0,0,0,0,0,0,0,0,0,0,0,0,0,0,0,0,0,0,0,0,0,0,0,0,0,0,0,0]
[3,785,0,0,0,0,0,0,0,2,0,0,0,0,3,2,3,0,0,0,0,0,0,0,2,0,0,0,349,27,13,0,0,3,0,0,0,0,0,1,1,0,0,0,0,0,0,2,16,0,21,0,0,0,0,0,0,8,0,20,0,0,0,0,0,0,0,0,0,0,0,0,0,0,0,0,0,0,0,0,0,0,0,0,2,1,0,0,0,0,0,0,0,0,0,0,0,0,0,0,0,0,0,0,184,0,1,2,0,10,0,0,0,1,162,0,0,2,0,19,0,0,0,1,0,0,0,0,0,0,0,0,0,0,0,0,0,0,0,0,0,0,0,0,0,0,0,0,0,0,0,0,0,0,0,0,0,0,0,0,0,0,0,0,0,0,0,0,0,0,0,0,0,0,0,0,0,0,0,0,0,0,0,0,0,0,0,0,0,0,0,0,0,0,0,0,0,0,0,0,0,0,0,0,0,0,0,0,0,0,0,0,0,0,0,0,0,0,0,0,0,0,0,0,0,0,0,0,0,0,0]
["T",1900,0,0,3,1,0,0,0,4,0,0,0,0,9,7,6,1,0,0,0,0,0,0,7,0,0,0,945,75,39,0,0,8,5,0,0,0,0,8,1,0,0,0,0,0,0,7,48,1,25,0,0,0,0,0,0,12,0,25,0,0,0,0,0,0,0,0,0,0,0,0,0,0,0,0,0,0,0,0,0,0,0,0,9,1,0,0,0,0,0,0,0,0,0,0,0,0,0,0,0,0,0,0,512,3,2,2,0,34,0,0,0,1,456,4,1,2,0,63,0,0,0,1,4,0,0,0,0,0,0,0,0,0,0,0,0,0,0,0,0,0,0,0,0,0,0,0,0,0,0,0,0,0,0,0,0,0,0,0,0,0,0,0,0,0,0,0,0,0,0,0,0,0,0,0,0,0,0,0,0,0,0,0,0,0,0,0,0,0,0,0,0,0,0,0,0,0,0,0,0,0,0,0,0,0,0,0,0,0,0,0,0,0,0,0,0,0,0,0,0,0,0,0,0,0,0,0,0,0,0]
[]
[]
[]
[]
[]
[]
[]
[]
[]
[]
[]
[]
[]
[]
["TOTAL"]
[{"$f":"COUNT(A170:A186)","v":3},{"$f":"SUM(B170:B186)","v":3800},{"$f":"SUM(C170:C186)","v":0},0,6,2,0,0,0,8,0,0,0,0,18,14,12,2,0,0,0,0,0,0,14,0,0,0,1890,150,78,0,0,16,10,0,0,0,0,16,2,0,0,0,0,0,0,14,96,2,50,0,0,0,0,0,0,24,0,50,0,0,0,0,0,0,{"$f":"SUM(BO170:BO186)","v":0},0,0,0,0,0,0,0,0,0,0,0,0,0,0,0,0,0,18,2,0,0,0,0,0,0,0,0,0,0,0,0,0,0,0,0,0,0,1024,6,4,4,0,68,0,0,0,2,912,8,2,4,0,126,0,0,0,2,8,0,0,0,0,0,{"$f":"SUM(EA170:EA186)","v":0},0,0,0,0,0,0,0,0,0,0,0,0,0,0,0,0,0,0,0,0,0,0,0,0,0,0,0,0,0,0,0,0,0,0,0,0,0,0,0,0,0,0,0,0,0,0,0,0,0,0,0,0,0,0,0,0,0,0,0,0,0,0,0,{"$f":"SUM(GM170:GM186)","v":0},0,0,0,0,0,0,0,0,0,0,0,0,0,0,0,0,0,0,0,0,0,0,0,0,0,0,0,0,0,0,0,0,0,0,0,0]
[{"$f":"CONCATENATE(A170,\"-\",A171,\"-\",A172,\"-\",A173,\"-\",A174,\"-\",A175,\"-\",A176,\"-\",A177,\"-\",A178,\"-\",A179,\"-\",A180,\"-\",A181)","v":"1-2-3-T--------"}]
[null," BAS001"," BAS002"," BAS003"," BAS004"," BAS005"," BAS006"," BAS007"," BAS008"," BAS009"," BAS010"," BAS011"," BAS012"," BAS013"," BAS014"," BAS015"," BAS016"," BAS017"," BAS018"," BAS019"," BAS020"," BAS021"," BAS022"," BAS023"," BAS024"," BAS025"," BAS026"," BAS027"," BAS028"," BAS029"," BAS030"," BAS031"," BAS032"," BAS033"," BAS034"," BAS035"," BAS036"," BAS037"," BAS038"," BAS039"," BAS040"," BAS041"," BAS042"," BAS043"," BAS044"," BAS045"," BAS046"," BAS047"," BAS048"," BAS049"," BAS050"," BAS051"," BAS052"," BAS053"," BAS054"," BAS055"," BAS056"," BAS057"," BAS058"," BAS059"," BAS060"," BAS061"," BAS062"," BAS063"," BAS064"," BAS065"," BAS066"," BAS067"," BAS068"," BAS069"," BAS070"," BAS071"," BAS072"," BAS073"," BAS074"," BAS075"," BAS076"," BAS077"," BAS078"," BAS079"," BAS080"," BAS081"," BAS082"," BAS083"," BAS084"," BAS085"," BAS086"," BAS087"," BAS088"," BAS089"," BAS090"," BAS091"," BAS092"," BAS093"," BAS094"," BAS095"," BAS096"," BAS097"," BAS098"," BAS099"," BAS100"," BAS101"," BAS102"," BAS103"," BAS104"," BAS105"," BAS106"," BAS107"," BAS108"," BAS109"," BAS110"," BAS111"," BAS112"," BAS113"," BAS114"," BAS115"," BAS116"," BAS117"," BAS118"," BAS119"," BAS120"," BAS121"," BAS122"," BAS123"," BAS124"," BAS125"," BAS126"," BAS127"," BAS128"," BAS129"," BAS130"," BAS131"," BAS132"," BAS133"," BAS134"," BAS135"," BAS136"," BAS137"," BAS138"," BAS139"," BAS140"," BAS141"," BAS142"," BAS143"," BAS144"," BAS145"," BAS146"," BAS147"," BAS148"," BAS149"," BAS150"," BAS151"," BAS152"," BAS153"," BAS154"," BAS155"," BAS156"," BAS157"," BAS158"," BAS159"," BAS160"," BAS161"," BAS162"," BAS163"," BAS164"," BAS165"," BAS166"," BAS167"," BAS168"," BAS169"," BAS170"," BAS171"," BAS172"," BAS173"," BAS174"," BAS175"," BAS176"," BAS177"," BAS178"," BAS179"," BAS180"," BAS181"," BAS182"," BAS183"," BAS184"," BAS185"," BAS186"," BAS187"," BAS188"," BAS189"," BAS190"," BAS191"," BAS192"," BAS193"," BAS194"," BAS195"," BAS196"," BAS197"," BAS198"," BAS199"," BAS200"," BAS201"," BAS202"," BAS203"," BAS204"," BAS205"," BAS206"," BAS207"," BAS208"," BAS209"," BAS210"," BAS211"," BAS212"," BAS213"," BAS214"," BAS215"," BAS216"," BAS217"," BAS218"," BAS219"," BAS220"," BAS221"," BAS222"," BAS223"," BAS224"," BAS225"," BAS226"," BAS227"," BAS228"," BAS229"," BAS230"]
[null,{"$f":"IF(B191=B169,\"SI\",\"NO\")","v":"SI"},{"$f":"IF(C191=C169,\"SI\",\"NO\")","v":"SI"},"SI","SI","SI","SI","SI","SI","SI","SI","SI","SI","SI","SI","SI","SI","SI","SI","SI","SI","SI","SI","SI","SI","SI","SI","SI","SI","SI","SI","SI","SI","SI","SI","SI","SI","SI","SI","SI","SI","SI","SI","SI","SI","SI","SI","SI","SI","SI","SI","SI","SI","SI","SI","SI","SI","SI","SI","SI","SI","SI","SI","SI","SI","SI",{"$f":"IF(BO191=BO169,\"SI\",\"NO\")","v":"SI"},"SI","SI","SI","SI","SI","SI","SI","SI","SI","SI","SI","SI","SI","SI","SI","SI","SI","SI","SI","SI","SI","SI","SI","SI","SI","SI","SI","SI","SI","SI","SI","SI","SI","SI","SI","SI","SI","SI","SI","SI","SI","SI","SI","SI","SI","SI","SI","SI","SI","SI","SI","SI","SI","SI","SI","SI","SI","SI","SI","SI","SI","SI","SI",{"$f":"IF(EA191=EA169,\"SI\",\"NO\")","v":"SI"},"SI","SI","SI","SI","SI","SI","SI","SI","SI","SI","SI","SI","SI","SI","SI","SI","SI","SI","SI","SI","SI","SI","SI","SI","SI","SI","SI","SI","SI","SI","SI","SI","SI","SI","SI","SI","SI","SI","SI","SI","SI","SI","SI","SI","SI","SI","SI","SI","SI","SI","SI","SI","SI","SI","SI","SI","SI","SI","SI","SI","SI","SI","SI",{"$f":"IF(GM191=GM169,\"SI\",\"NO\")","v":"SI"},"SI","SI","SI","SI","SI","SI","SI","SI","SI","SI","SI","SI","SI","SI","SI","SI","SI","SI","SI","SI","SI","SI","SI","SI","SI","SI","SI","SI","SI","SI","SI","SI","SI","SI","SI","SI"]
[]
["TUBERCU_6099"]
["ANNO",2025]
["cod_red","03"]
["codmic","(Todas)"]
["cod_prov","(Todas)"]
["coddist","(Todas)"]
["cod_estab","(Todas)"]
["cod_eje","(Todas)"]
[]
[null,"Valores"]
["Etiquetas de fila"," BAS001"," BAS002"," BAS003"," BAS004"," BAS005"," BAS006"," BAS007"," BAS008"," BAS009"," BAS010"," BAS011"," BAS012"," BAS013"," BAS014"," BAS015"," BAS016"," BAS017"," BAS018"," BAS019"," BAS020"," BAS021"," BAS022"," BAS023"," BAS024"," BAS025"," BAS026"," BAS027"," BAS028"," BAS029"," BAS030"," BAS031"," BAS032"," BAS033"," BAS034"," BAS035"," BAS036"," BAS037"," BAS038"," BAS039"," BAS040"," BAS041"," BAS042"," BAS043"," BAS044"," BAS045"," BAS046"," BAS047"," BAS048"," BAS049"," BAS050"," BAS051"," BAS052"," BAS053"," BAS054"," BAS055"," BAS056"," BAS057"," BAS058"," BAS059"," BAS060"," BAS061"," BAS062"," BAS063"," BAS064"," BAS065"," BAS066"," BAS067"," BAS068"," BAS069"," BAS070"," BAS071"," BAS072"," BAS073"," BAS074"," BAS075"," BAS076"," BAS077"," BAS078"," BAS079"," BAS080"," BAS081"," BAS082"," BAS083"," BAS084"," BAS085"," BAS086"," BAS087"," BAS088"," BAS089"," BAS090"," BAS091"," BAS092"," BAS093"," BAS094"," BAS095"," BAS096"," BAS097"," BAS098"," BAS099"," BAS100"," BAS101"," BAS102"," BAS103"," BAS104"," BAS105"," BAS106"," BAS107"," BAS108"," BAS109"," BAS110"," BAS111"," BAS112"," BAS113"," BAS114"," BAS115"," BAS116"," BAS117"," BAS118"," BAS119"," BAS120"," BAS121"," BAS122"," BAS123"," BAS124"," BAS125"," BAS126"," BAS127"," BAS128"," BAS129"," BAS130"," BAS131"," BAS132"," BAS133"," BAS134"," BAS135"," BAS136"," BAS137"," BAS138"," BAS139"," BAS140"," BAS141"," BAS142"," BAS143"," BAS144"," BAS145"," BAS146"," BAS147"," BAS148"," BAS149"," BAS150"," BAS151"," BAS152"," BAS153"," BAS154"," BAS155"," BAS156"," BAS157"," BAS158"," BAS159"," BAS160"," BAS161"," BAS162"," BAS163"," BAS164"," BAS165"," BAS166"," BAS167"," BAS168"," BAS169"," BAS170"," BAS171"," BAS172"," BAS173"," BAS174"," BAS175"," BAS176"," BAS177"," BAS178"," BAS179"," BAS180"," BAS181"," BAS182"," BAS183"," BAS184"," BAS185"," BAS186"," BAS187"," BAS188"," BAS189"," BAS190"," BAS191"," BAS192"," BAS193"," BAS194"," BAS195"," BAS196"," BAS197"," BAS198"," BAS199"," BAS200"," BAS201"," BAS202"," BAS203"," BAS204"," BAS205"," BAS206"," BAS207"," BAS208"," BAS209"," BAS210"," BAS211"," BAS212"," BAS213"," BAS214"," BAS215"," BAS216"," BAS217"," BAS218"," BAS219"," BAS220"," BAS221"," BAS222"," BAS223"," BAS224"," BAS225"," BAS226"," BAS227"," BAS228"," BAS229"," BAS230"]
[1,447,0,0,0,0,0,1,0,0,0,0,0,0,1,1,0,0,0,0,0,0,0,0,3,0,0,0,97,78,7,0,0,1,0,0,0,0,0,0,0,0,0,0,0,0,0,1,0,0,1,0,0,0,0,0,0,0,0,1,0,0,0,0,0,0,0,0,0,0,0,0,0,0,0,0,0,0,0,0,0,0,0,0,0,0,0,0,0,0,0,0,0,0,0,0,0,0,0,0,0,0,0,0,130,2,0,0,0,3,0,0,0,0,113,1,0,0,0,0,0,0,0,0,0,0,0,0,0,0,0,0,0,0,0,0,0,0,0,0,0,0,0,0,0,0,0,0,0,0,0,0,0,0,0,0,0,0,0,0,0,0,0,0,0,0,0,0,0,0,0,0,0,0,0,0,0,0,0,0,0,0,0,0,0,0,0,0,0,0,0,0,0,0,0,0,0,0,0,0,0,0,0,0,0,0,0,0,0,0,0,0,0,0,0,0,0,0,0,0,0,0,0,0,0,0,0,0,0,0,0]
[2,453,0,0,0,0,0,0,1,0,0,0,0,0,0,0,0,1,0,0,0,0,0,0,0,0,0,0,41,69,3,0,0,1,0,0,0,0,0,1,0,0,0,0,0,0,0,0,3,0,0,0,0,0,0,0,0,0,0,0,0,0,0,0,0,0,0,0,0,0,0,0,0,0,0,0,0,0,0,0,0,0,0,0,1,0,0,0,0,0,0,0,0,0,0,0,0,0,0,0,0,0,0,0,133,0,0,0,0,0,0,0,0,0,132,0,0,0,0,4,0,0,0,0,0,0,0,0,0,0,0,0,0,0,0,0,0,0,0,0,0,0,0,0,0,0,0,0,0,0,0,0,0,0,0,0,0,0,0,0,0,0,0,0,0,0,0,0,0,0,0,0,0,0,0,0,0,0,0,0,0,0,0,0,0,0,0,0,0,0,0,0,0,0,0,0,0,0,0,0,0,0,0,0,0,0,0,0,0,0,0,0,0,0,0,0,0,0,0,0,0,0,0,0,0,0,0,0,0,0,0]
[3,473,0,0,0,0,0,0,0,0,0,0,0,0,1,1,0,0,0,0,0,0,0,0,0,0,0,0,68,71,3,0,0,0,0,0,0,0,0,0,0,0,0,0,0,0,0,1,17,0,1,0,0,0,0,0,0,18,0,1,0,0,0,0,0,0,0,0,0,0,0,0,0,0,0,0,0,0,0,0,0,0,0,0,0,0,0,0,0,0,0,0,0,0,0,0,0,0,0,0,0,0,0,0,126,1,0,0,0,3,0,0,0,0,122,0,0,0,0,4,0,0,0,0,0,0,0,0,0,0,0,0,0,0,0,0,0,0,0,0,0,0,0,0,0,0,0,0,0,0,0,0,0,0,0,0,0,0,0,0,0,0,0,0,0,0,0,0,0,0,0,0,0,0,0,0,0,0,0,0,0,0,0,0,0,0,0,0,0,0,0,0,0,0,0,0,0,0,0,0,0,0,0,0,0,0,0,0,0,0,0,0,0,0,0,0,0,0,0,0,0,0,0,0,0,0,0,0,0,0,0]
["T",1373,0,0,0,0,0,1,1,0,0,0,0,0,2,2,0,1,0,0,0,0,0,0,3,0,0,0,206,218,13,0,0,2,0,0,0,0,0,1,0,0,0,0,0,0,0,2,20,0,2,0,0,0,0,0,0,18,0,2,0,0,0,0,0,0,0,0,0,0,0,0,0,0,0,0,0,0,0,0,0,0,0,0,1,0,0,0,0,0,0,0,0,0,0,0,0,0,0,0,0,0,0,0,389,3,0,0,0,6,0,0,0,0,367,1,0,0,0,8,0,0,0,0,0,0,0,0,0,0,0,0,0,0,0,0,0,0,0,0,0,0,0,0,0,0,0,0,0,0,0,0,0,0,0,0,0,0,0,0,0,0,0,0,0,0,0,0,0,0,0,0,0,0,0,0,0,0,0,0,0,0,0,0,0,0,0,0,0,0,0,0,0,0,0,0,0,0,0,0,0,0,0,0,0,0,0,0,0,0,0,0,0,0,0,0,0,0,0,0,0,0,0,0,0,0,0,0,0,0,0]
[]
[]
[]
[]
[]
[]
[]
[]
[]
[]
[]
[]
[]
[]
["TOTAL"]
[{"$f":"COUNT(A205:A221)","v":3},{"$f":"SUM(B205:B221)","v":2746},{"$f":"SUM(C205:C221)","v":0},0,0,0,0,2,2,0,0,0,0,0,4,4,0,2,0,0,0,0,0,0,6,0,0,0,412,436,26,0,0,4,0,0,0,0,0,2,0,0,0,0,0,0,0,4,40,0,4,0,0,0,0,0,0,36,0,4,0,0,0,0,0,0,{"$f":"SUM(BO205:BO221)","v":0},0,0,0,0,0,0,0,0,0,0,0,0,0,0,0,0,0,2,0,0,0,0,0,0,0,0,0,0,0,0,0,0,0,0,0,0,0,778,6,0,0,0,12,0,0,0,0,734,2,0,0,0,16,0,0,0,0,0,0,0,0,0,0,{"$f":"SUM(EA205:EA221)","v":0},0,0,0,0,0,0,0,0,0,0,0,0,0,0,0,0,0,0,0,0,0,0,0,0,0,0,0,0,0,0,0,0,0,0,0,0,0,0,0,0,0,0,0,0,0,0,0,0,0,0,0,0,0,0,0,0,0,0,0,0,0,0,0,{"$f":"SUM(GM205:GM221)","v":0},0,0,0,0,0,0,0,0,0,0,0,0,0,0,0,0,0,0,0,0,0,0,0,0,0,0,0,0,0,0,0,0,0,0,0,0]
[{"$f":"CONCATENATE(A205,\"-\",A206,\"-\",A207,\"-\",A208,\"-\",A209,\"-\",A210,\"-\",A211,\"-\",A212,\"-\",A213,\"-\",A214,\"-\",A215,\"-\",A216)","v":"1-2-3-T--------"}]
[null," BAS001"," BAS002"," BAS003"," BAS004"," BAS005"," BAS006"," BAS007"," BAS008"," BAS009"," BAS010"," BAS011"," BAS012"," BAS013"," BAS014"," BAS015"," BAS016"," BAS017"," BAS018"," BAS019"," BAS020"," BAS021"," BAS022"," BAS023"," BAS024"," BAS025"," BAS026"," BAS027"," BAS028"," BAS029"," BAS030"," BAS031"," BAS032"," BAS033"," BAS034"," BAS035"," BAS036"," BAS037"," BAS038"," BAS039"," BAS040"," BAS041"," BAS042"," BAS043"," BAS044"," BAS045"," BAS046"," BAS047"," BAS048"," BAS049"," BAS050"," BAS051"," BAS052"," BAS053"," BAS054"," BAS055"," BAS056"," BAS057"," BAS058"," BAS059"," BAS060"," BAS061"," BAS062"," BAS063"," BAS064"," BAS065"," BAS066"," BAS067"," BAS068"," BAS069"," BAS070"," BAS071"," BAS072"," BAS073"," BAS074"," BAS075"," BAS076"," BAS077"," BAS078"," BAS079"," BAS080"," BAS081"," BAS082"," BAS083"," BAS084"," BAS085"," BAS086"," BAS087"," BAS088"," BAS089"," BAS090"," BAS091"," BAS092"," BAS093"," BAS094"," BAS095"," BAS096"," BAS097"," BAS098"," BAS099"," BAS100"," BAS101"," BAS102"," BAS103"," BAS104"," BAS105"," BAS106"," BAS107"," BAS108"," BAS109"," BAS110"," BAS111"," BAS112"," BAS113"," BAS114"," BAS115"," BAS116"," BAS117"," BAS118"," BAS119"," BAS120"," BAS121"," BAS122"," BAS123"," BAS124"," BAS125"," BAS126"," BAS127"," BAS128"," BAS129"," BAS130"," BAS131"," BAS132"," BAS133"," BAS134"," BAS135"," BAS136"," BAS137"," BAS138"," BAS139"," BAS140"," BAS141"," BAS142"," BAS143"," BAS144"," BAS145"," BAS146"," BAS147"," BAS148"," BAS149"," BAS150"," BAS151"," BAS152"," BAS153"," BAS154"," BAS155"," BAS156"," BAS157"," BAS158"," BAS159"," BAS160"," BAS161"," BAS162"," BAS163"," BAS164"," BAS165"," BAS166"," BAS167"," BAS168"," BAS169"," BAS170"," BAS171"," BAS172"," BAS173"," BAS174"," BAS175"," BAS176"," BAS177"," BAS178"," BAS179"," BAS180"," BAS181"," BAS182"," BAS183"," BAS184"," BAS185"," BAS186"," BAS187"," BAS188"," BAS189"," BAS190"," BAS191"," BAS192"," BAS193"," BAS194"," BAS195"," BAS196"," BAS197"," BAS198"," BAS199"," BAS200"," BAS201"," BAS202"," BAS203"," BAS204"," BAS205"," BAS206"," BAS207"," BAS208"," BAS209"," BAS210"," BAS211"," BAS212"," BAS213"," BAS214"," BAS215"," BAS216"," BAS217"," BAS218"," BAS219"," BAS220"," BAS221"," BAS222"," BAS223"," BAS224"," BAS225"," BAS226"," BAS227"," BAS228"," BAS229"," BAS230"]
[null,{"$f":"IF(B226=B204,\"SI\",\"NO\")","v":"SI"},{"$f":"IF(C226=C204,\"SI\",\"NO\")","v":"SI"},"SI","SI","SI","SI","SI","SI","SI","SI","SI","SI","SI","SI","SI","SI","SI","SI","SI","SI","SI","SI","SI","SI","SI","SI","SI","SI","SI","SI","SI","SI","SI","SI","SI","SI","SI","SI","SI","SI","SI","SI","SI","SI","SI","SI","SI","SI","SI","SI","SI","SI","SI","SI","SI","SI","SI","SI","SI","SI","SI","SI","SI","SI","SI",{"$f":"IF(BO226=BO204,\"SI\",\"NO\")","v":"SI"},"SI","SI","SI","SI","SI","SI","SI","SI","SI","SI","SI","SI","SI","SI","SI","SI","SI","SI","SI","SI","SI","SI","SI","SI","SI","SI","SI","SI","SI","SI","SI","SI","SI","SI","SI","SI","SI","SI","SI","SI","SI","SI","SI","SI","SI","SI","SI","SI","SI","SI","SI","SI","SI","SI","SI","SI","SI","SI","SI","SI","SI","SI","SI",{"$f":"IF(EA226=EA204,\"SI\",\"NO\")","v":"SI"},"SI","SI","SI","SI","SI","SI","SI","SI","SI","SI","SI","SI","SI","SI","SI","SI","SI","SI","SI","SI","SI","SI","SI","SI","SI","SI","SI","SI","SI","SI","SI","SI","SI","SI","SI","SI","SI","SI","SI","SI","SI","SI","SI","SI","SI","SI","SI","SI","SI","SI","SI","SI","SI","SI","SI","SI","SI","SI","SI","SI","SI","SI","SI",{"$f":"IF(GM226=GM204,\"SI\",\"NO\")","v":"SI"},"SI","SI","SI","SI","SI","SI","SI","SI","SI","SI","SI","SI","SI","SI","SI","SI","SI","SI","SI","SI","SI","SI","SI","SI","SI","SI","SI","SI","SI","SI","SI","SI","SI","SI","SI","SI"]
[]
[]
[]
[]
[]
["POBLACION GENERAL"]
["anno","2025"]
["cod_red","03"]
["codmic","(Todas)"]
["cod_prov","(Todas)"]
["coddist","(Todas)"]
["cod_estab","(Todas)"]
["cod_eje","(Todas)"]
[]
["Valores"]
["Suma de total","Suma de emay15"]
[0,0]

{"sheet":"Datos","index":2,"n_rows":454,"n_cols":32,"rows_kept":454,"cut":false,"hidden":true,"merged":[]}
[]
[]
[]
[]
[]
[]
[]
[]
[null,"ANO",null,"MESES",null,"COD_RED","DESC_RED","CONCATENAR",null,"COD_RED","COD_MIC","DESC_MICRO","CONCATENAR",null,"COD_ESTAB","DESC_ESTAB","COD_RED","COD_MIC","COD_PROV","COD_DIST","REDMIC","CONCATENAR",null,"COD_PROV","DESC_PROV","CONCATENAR",null,"COD_PROV","COD_DIST","DESC_DIST","PROVDIST","CONCATENAR"]
[null,2025,null,"01-Enero",null,"00","NO TIENE ASIGNADO NINGUNA RED",{"$f":"CONCATENATE(F10,\" - \",G10)","v":"00 - NO TIENE ASIGNADO NINGUNA RED"},null,"00","00","NO PERTENECE A NINGUNA MICRORED                                                                     ",{"$f":"CONCATENATE(J10,K10,\" - \",L10)","v":"0000 - NO PERTENECE A NINGUNA MICRORED                                                                     "},null,"000000000","(All)","00","00",null,null,{"$f":"CONCATENATE(Q10,R10)","v":"0000"},{"$f":"CONCATENATE(O10,\" - \",P10)","v":"000000000 - (All)"},null,"00","(All)",{"$f":"CONCATENATE(X10,\" - \",Y10)","v":"00 - (All)"},null,"01","00","(All)",{"$f":"CONCATENATE(AB10,AC10)","v":"0100"},{"$f":"CONCATENATE(AB10,AC10,\" - \",AD10)","v":"0100 - (All)"}]
[null,null,null,"02-Febrero",null,"01","CUSCO SUR",{"$f":"CONCATENATE(F11,\" - \",G11)","v":"01 - CUSCO SUR"},null,"00","99","(All)","0099 - (All)",1,"000002289","HOSPITAL DE APOYO DEPARTAMENTAL CUSCO","00","00","01","01",{"$f":"CONCATENATE(Q11,R11)","v":"0000"},{"$f":"CONCATENATE(O11,\" - \",P11)","v":"000002289 - HOSPITAL DE APOYO DEPARTAMENTAL CUSCO"},null,"01","CUSCO",{"$f":"CONCATENATE(X11,\" - \",Y11)","v":"01 - CUSCO"},null,"01","01","CUSCO",{"$f":"CONCATENATE(AB11,AC11)","v":"0101"},{"$f":"CONCATENATE(AB11,AC11,\" - \",AD11)","v":"0101 - CUSCO"}]
[null,null,null,"03-Marzo",null,"02","CUSCO NORTE","02 - CUSCO NORTE",null,"01","00","NO PERTENECE A NINGUNA MICRORED                                                                     ","0100 - NO PERTENECE A NINGUNA MICRORED                                                                     ",{"$f":"+N11+1","v":2},"000002305","ANTONIO LORENA DEL CUSCO","00","00","01","06","0000","000002305 - ANTONIO LORENA DEL CUSCO",null,"02","ACOMAYO",{"$f":"CONCATENATE(X12,\" - \",Y12)","v":"02 - ACOMAYO"},null,"01","02","CCORCA","0102","0102 - CCORCA"]
[null,null,null,"04-Abril",null,"03","LA CONVENCION","03 - LA CONVENCION",null,"01","16","CUSCO                                                                                               ","0116 - CUSCO                                                                                               ",{"$f":"+N12+1","v":3},"999999999","(All)","00","99",null,null,"0099","999999999 - (All)",null,"03","ANTA","03 - ANTA",null,"01","03","POROY","0103","0103 - POROY"]
[null,null,null,"05-Mayo",null,"04","CANAS-CANCHIS-ESPINAR","04 - CANAS-CANCHIS-ESPINAR",null,"01","03","PARURO                                                                                              ","0103 - PARURO                                                                                              ",null,"000025210","TUPAC AMARU","01","00","01","05","0100","000025210 - TUPAC AMARU",null,"04","CALCA","04 - CALCA",null,"01","04","SAN JERONIMO","0104","0104 - SAN JERONIMO"]
[null,null,null,"06-Junio",null,"05","KIMBIRI PICHARI","05 - KIMBIRI PICHARI",null,"01","06","PAUCARTAMBO                                                                                         ","0106 - PAUCARTAMBO                                                                                         ",{"$f":"+N13+1","v":4},"000000000","(All)","01","03",null,null,"0103","000000000 - (All)",null,"05","CANAS","05 - CANAS",null,"01","05","SAN SEBASTIAN","0105","0105 - SAN SEBASTIAN"]
[null,null,null,"07-Julio",null,"06","CHUMBIVILCAS","06 - CHUMBIVILCAS",null,"01","12","URCOS                                                                                               ","0112 - URCOS                                                                                               ",null,"000002499","PARURO","01","03","10","01","0103","000002499 - PARURO",null,"06","CANCHIS","06 - CANCHIS",null,"01","06","SANTIAGO","0106","0106 - SANTIAGO"]
[null,null,null,"08-Agosto",null,"99","(All)","99 - (All)",null,"01","13","ACOMAYO                                                                                             ","0113 - ACOMAYO                                                                                             ",{"$f":"+N15+1","v":5},"000002500","ACCHA","01","03","10","02","0103","000002500 - ACCHA",null,"07","CHUMBIVILCAS","07 - CHUMBIVILCAS",null,"01","07","SAYLLA","0107","0107 - SAYLLA"]
[null,null,null,"09-Setiembre",null,null,null,null,null,"01","15","OCONGATE                                                                                            ","0115 - OCONGATE                                                                                            ",6,"000002501","CCAPI","01","03","10","03","0103","000002501 - CCAPI",null,"08","ESPINAR","08 - ESPINAR",null,"01","08","WANCHAQ","0108","0108 - WANCHAQ"]
[null,null,null,"10-Octubre",null,null,null,null,null,"01","99","(All)","0199 - (All)",7,"000002502","CCOYABAMBA","01","03","10","03","0103","000002502 - CCOYABAMBA",null,"09","LA CONVENCION","09 - LA CONVENCION",null,"02","00","(All)","0200","0200 - (All)"]
[null,null,null,"11-Noviembre",null,"EJECUTORAS",null,null,null,"02","01","BELEMPAMPA                                                                                          ","0201 - BELEMPAMPA                                                                                          ",8,"000002503","COLCHA","01","03","10","04","0103","000002503 - COLCHA",null,"10","PARURO","10 - PARURO",null,"02","01","ACOMAYO","0201","0201 - ACOMAYO"]
[null,null,null,"12-Diciembre",null,"COD_RED","DESC_RED","CONCATENAR",null,"02","02","WANCHAQ                                                                                             ","0202 - WANCHAQ                                                                                             ",9,"000006978","CCOCHIRIHUAY","01","03","10","04","0103","000006978 - CCOCHIRIHUAY",null,"11","PAUCARTAMBO","11 - PAUCARTAMBO",null,"02","02","ACOPIA","0202","0202 - ACOPIA"]
[null,null,null,null,null,"01","HOSPITAL REGIONAL CUSCO",{"$f":"CONCATENATE(F22,\" - \",G22)","v":"01 - HOSPITAL REGIONAL CUSCO"},null,"02","03","ANTA                                                                                                ","0203 - ANTA                                                                                                ",10,"000002504","HUANOQUITE","01","03","10","05","0103","000002504 - HUANOQUITE",null,"12","QUISPICANCHI","12 - QUISPICANCHI",null,"02","03","ACOS","0203","0203 - ACOS"]
[null,null,null,null,null,"02","HOSPITAL ANTONIO LORENA",{"$f":"CONCATENATE(F23,\" - \",G23)","v":"02 - HOSPITAL ANTONIO LORENA"},null,"02","04","LIMATAMBO                                                                                           ","0204 - LIMATAMBO                                                                                           ",11,"000002505","OMACHA","01","03","10","06","0103","000002505 - OMACHA",null,"13","URUBAMBA","13 - URUBAMBA",null,"02","04","MOSOC LLACTA","0204","0204 - MOSOC LLACTA"]
[null,null,null,null,null,"03","CUSCO NORTE","03 - CUSCO NORTE",null,"02","05","PISAC                                                                                               ","0205 - PISAC                                                                                               ",12,"000002506","ANTAPALLPA","01","03","10","06","0103","000002506 - ANTAPALLPA",null,null,null,null,null,"02","05","POMACANCHI","0205","0205 - POMACANCHI"]
[null,null,null,null,null,"04","CUSCO SUR","04 - CUSCO SUR",null,"02","06","CALCA                                                                                               ","0206 - CALCA                                                                                               ",13,"000007147","PUESTO DE SALUD DE HUASQUILLAY","01","03","10","06","0103","000007147 - PUESTO DE SALUD DE HUASQUILLAY",null,null,null,null,null,"02","06","RONDOCAN","0206","0206 - RONDOCAN"]
[null,null,null,null,null,"05","LA CONVENCION","05 - LA CONVENCION",null,"02","07","URUBAMBA                                                                                            ","0207 - URUBAMBA                                                                                            ",14,"000012924","SAHUA SAHUA","01","03","10","06","0103","000012924 - SAHUA SAHUA",null,null,null,null,null,"02","07","SANGARARA","0207","0207 - SANGARARA"]
[null,null,null,null,null,"06","HOSPITAL QUILLABAMBA","06 - HOSPITAL QUILLABAMBA",null,"02","08","YANATILE                                                                                            ","0208 - YANATILE                                                                                            ",15,"000002507","PACCARECTAMBO","01","03","10","07","0103","000002507 - PACCARECTAMBO",null,null,null,null,null,"03","00","(All)","0300","0300 - (All)"]
[null,null,null,null,null,"07","CANAS CANCHIS ESPINAR","07 - CANAS CANCHIS ESPINAR",null,"02","09","SIETE CUARTONES                                                                                     ","0209 - SIETE CUARTONES                                                                                     ",16,"000002509","YAURISQUE","01","03","10","09","0103","000002509 - YAURISQUE",null,null,null,null,null,"03","01","ANTA","0301","0301 - ANTA"]
[null,null,null,null,null,"08","HOSPITAL SICUANI","08 - HOSPITAL SICUANI",null,"02","99","(All)","0299 - (All)",17,"000000000","(All)","01","06",null,null,"0106","000000000 - (All)",null,null,null,null,null,"03","02","ANCAHUASI","0302","0302 - ANCAHUASI"]
[null,null,null,null,null,"09","HOSPITAL ESPINAR","09 - HOSPITAL ESPINAR",null,"03","00","NO PERTENECE A NINGUNA MICRORED                                                                     ","0300 - NO PERTENECE A NINGUNA MICRORED                                                                     ",null,"000002520","HUANCARANI","01","06","11","05","0106","000002520 - HUANCARANI",null,null,null,null,null,"03","03","CACHIMAYO","0303","0303 - CACHIMAYO"]
[null,null,null,null,null,"10","KIMBIRI PICHARI","10 - KIMBIRI PICHARI",null,"03","01","SANTA ANA                                                                                           ","0301 - SANTA ANA                                                                                           ",{"$f":"+N29+1","v":18},"000002521","PILCOPATA","01","06","11","06","0106","000002521 - PILCOPATA",null,null,null,null,null,"03","04","CHINCHAYPUJIO","0304","0304 - CHINCHAYPUJIO"]
[null,null,null,null,null,"11","CHUMBIVILCAS","11 - CHUMBIVILCAS",null,"03","02","MARANURA                                                                                            ","0302 - MARANURA                                                                                            ",19,"000002522","PATRIA","01","06","11","06","0106","000002522 - PATRIA",null,null,null,null,null,"03","05","HUAROCONDO","0305","0305 - HUAROCONDO"]
[null,null,null,null,null,"99","(ALL)",{"$f":"CONCATENATE(F33,\" - \",G33)","v":"99 - (ALL)"},null,"03","03","QUELLOUNO                                                                                           ","0303 - QUELLOUNO                                                                                           ",20,"000002510","PAUCARTAMBO","01","06","11","01","0106","000002510 - PAUCARTAMBO",null,null,null,null,null,"03","06","LIMATAMBO","0306","0306 - LIMATAMBO"]
[null,null,null,null,null,null,null,null,null,"03","04","KITENI                                                                                              ","0304 - KITENI                                                                                              ",21,"000002511","MOLLOMARCA","01","06","11","01","0106","000002511 - MOLLOMARCA",null,null,null,null,null,"03","07","MOLLEPATA","0307","0307 - MOLLEPATA"]
[null,null,null,null,null,null,null,null,null,"03","05","KAMISEA                                                                                             ","0305 - KAMISEA                                                                                             ",22,"000010077","PAUCARTAMBO -ESSALUD","01","06","11","01","0106","000010077 - PAUCARTAMBO -ESSALUD",null,null,null,null,null,"03","08","PUCYURA","0308","0308 - PUCYURA"]
[null,null,null,null,null,"SECTORES",null,null,null,"03","06","PUCYURA                                                                                             ","0306 - PUCYURA                                                                                             ",23,"000033777","MENTAL COMUNITARIO VIRGEN DEL ROSARIO","01","06","11","01","0106","000033777 - MENTAL COMUNITARIO VIRGEN DEL ROSARIO",null,null,null,null,null,"03","09","ZURITE","0309","0309 - ZURITE"]
[null,null,null,null,null,"COD_SECTOR","DESC_RED","CONCATENAR",null,"03","07","PALMA REAL","0307 - PALMA REAL",24,"000002512","CAICAY","01","06","11","02","0106","000002512 - CAICAY",null,null,null,null,null,"04","00","(All)","0400","0400 - (All)"]
[null,null,null,null,null,"1","GORE",{"$f":"CONCATENATE(F38,\" - \",G38)","v":"1 - GORE"},null,"03","99","(All)","0399 - (All)",25,"000002513","HUASAC","01","06","11","02","0106","000002513 - HUASAC",null,null,null,null,null,"04","01","CALCA","0401","0401 - CALCA"]
[null,null,null,null,null,"2","ESSALUD",{"$f":"CONCATENATE(F39,\" - \",G39)","v":"2 - ESSALUD"},null,"04","00","NO PERTENECE A NINGUNA MICRORED                                                                     ","0400 - NO PERTENECE A NINGUNA MICRORED                                                                     ",26,"000002514","CHALLABAMBA","01","06","11","03","0106","000002514 - CHALLABAMBA",null,null,null,null,null,"04","02","COYA","0402","0402 - COYA"]
[null,null,null,null,null,"3","OTROS",{"$f":"CONCATENATE(F40,\" - \",G40)","v":"3 - OTROS"},null,"04","01","YANAOCA                                                                                             ","0401 - YANAOCA                                                                                             ",27,"000002516","COLQUEPATA","01","06","11","04","0106","000002516 - COLQUEPATA",null,null,null,null,null,"04","03","LAMAY","0403","0403 - LAMAY"]
[null,null,null,null,null,"99","(ALL)",{"$f":"CONCATENATE(F41,\" - \",G41)","v":"99 - (ALL)"},null,"04","02","EL DESCANSO                                                                                         ","0402 - EL DESCANSO                                                                                         ",28,"000002517","PICHIHUA COLQUEPATA","01","06","11","04","0106","000002517 - PICHIHUA COLQUEPATA",null,null,null,null,null,"04","04","LARES","0404","0404 - LARES"]
[null,null,null,null,null,null,null,null,null,"04","03","COMBAPATA                                                                                           ","0403 - COMBAPATA                                                                                           ",29,"000002518","VIZCOCHONI","01","06","11","04","0106","000002518 - VIZCOCHONI",null,null,null,null,null,"04","05","PISAC","0405","0405 - PISAC"]
[null,null,null,null,null,null,null,null,null,"04","04","TECHO OBRERO                                                                                        ","0404 - TECHO OBRERO                                                                                        ",30,"000002519","AYRE","01","06","11","04","0106","000002519 - AYRE",null,null,null,null,null,"04","06","SAN SALVADOR","0406","0406 - SAN SALVADOR"]
[null,null,null,null,null,null,null,null,null,"04","05","PAMPAPHALLA                                                                                         ","0405 - PAMPAPHALLA                                                                                         ",31,"000006979","TOCRA","01","06","11","04","0106","000006979 - TOCRA",null,null,null,null,null,"04","07","TARAY","0407","0407 - TARAY"]
[null,null,null,null,null,null,null,null,null,"04","06","YAURI                                                                                               ","0406 - YAURI                                                                                               ",32,"000000000","(All)","01","12",null,null,"0112","000000000 - (All)",null,null,null,null,null,"04","08","YANATILE","0408","0408 - YANATILE"]
[null,null,null,null,null,null,null,null,null,"04","99","(All)","0499 - (All)",null,"000002523","URCOS","01","12","12","01","0112","000002523 - URCOS",null,null,null,null,null,"05","00","(All)","0500","0500 - (All)"]
[null,null,null,null,null,null,null,null,null,"05","00","NO PERTENECE A NINGUNA MICRORED                                                                     ","0500 - NO PERTENECE A NINGUNA MICRORED                                                                     ",{"$f":"+N45+1","v":33},"000026385","ESSALUD-URCOS","01","12","12","01","0112","000026385 - ESSALUD-URCOS",null,null,null,null,null,"05","01","YANAOCA","0501","0501 - YANAOCA"]
[null,null,null,null,null,null,null,null,null,"05","01","KIMBIRI                                                                                             ","0501 - KIMBIRI                                                                                             ",34,"000002525","ANDAHUAYLILLAS","01","12","12","02","0112","000002525 - ANDAHUAYLILLAS",null,null,null,null,null,"05","02","CHECCA","0502","0502 - CHECCA"]
[null,null,null,null,null,null,null,null,null,"05","02","PICHARI                                                                                             ","0502 - PICHARI                                                                                             ",35,"000008911","HUARA HUARA","01","12","12","05","0112","000008911 - HUARA HUARA",null,null,null,null,null,"05","03","KUNTURKANKI","0503","0503 - KUNTURKANKI"]
[null,null,null,null,null,null,null,null,null,"05","99","(All)","0599 - (All)",36,"000002530","CUSIPATA","01","12","12","06","0112","000002530 - CUSIPATA",null,null,null,null,null,"05","04","LANGUI","0504","0504 - LANGUI"]
[null,null,null,null,null,null,null,null,null,"06","00","NO PERTENECE A NINGUNA MICRORED                                                                     ","0600 - NO PERTENECE A NINGUNA MICRORED                                                                     ",37,"000006980","CHILLIHUANI","01","12","12","06","0112","000006980 - CHILLIHUANI",null,null,null,null,null,"05","05","LAYO","0505","0505 - LAYO"]
[null,null,null,null,null,null,null,null,null,"06","09","SANTO TOMAS                                                                                         ","0609 - SANTO TOMAS                                                                                         ",38,"000002532","HUARO","01","12","12","07","0112","000002532 - HUARO",null,null,null,null,null,"05","06","PAMPAMARCA","0506","0506 - PAMPAMARCA"]
[null,null,null,null,null,null,null,null,null,"06","01","LIVITACA                                                                                            ","0601 - LIVITACA                                                                                            ",39,"000002533","URPAY","01","12","12","07","0112","000002533 - URPAY",null,null,null,null,null,"05","07","QUEHUE","0507","0507 - QUEHUE"]
[null,null,null,null,null,null,null,null,null,"06","99","(All)","0699 - (All)",40,"000011747","POSTA MEDICA POLICIAL PUCUTO","01","12","12","07","0112","000011747 - POSTA MEDICA POLICIAL PUCUTO",null,null,null,null,null,"05","08","TUPAC AMARU","0508","0508 - TUPAC AMARU"]
[null,null,null,null,null,null,null,null,null,"99","99","(All)","9999 - (All)",41,"000030708","MENTAL COMUNITARIO HUARO","01","12","12","07","0112","000030708 - MENTAL COMUNITARIO HUARO",null,null,null,null,null,"06","00","(All)","0600","0600 - (All)"]
[null,null,null,null,null,null,null,null,null,null,null,null,null,42,"000002534","LUCRE","01","12","12","08","0112","000002534 - LUCRE",null,null,null,null,null,"06","01","SICUANI","0601","0601 - SICUANI"]
[null,null,null,null,null,null,null,null,null,null,null,null,null,43,"000002537","OROPESA","01","12","12","11","0112","000002537 - OROPESA",null,null,null,null,null,"06","02","CHECACUPE","0602","0602 - CHECACUPE"]
[null,null,null,null,null,null,null,null,null,null,null,null,null,44,"000002538","QUIQUIJANA","01","12","12","12","0112","000002538 - QUIQUIJANA",null,null,null,null,null,"06","03","COMBAPATA","0603","0603 - COMBAPATA"]
[null,null,null,null,null,null,null,null,null,null,null,null,null,45,"000002539","CCOLCA","01","12","12","12","0112","000002539 - CCOLCA",null,null,null,null,null,"06","04","MARANGANI","0604","0604 - MARANGANI"]
[null,null,null,null,null,null,null,null,null,null,null,null,null,46,"000000000","(All)","01","13",null,null,"0113","000000000 - (All)",null,null,null,null,null,"06","05","PITUMARCA","0605","0605 - PITUMARCA"]
[null,null,null,null,null,null,null,null,null,null,null,null,null,null,"000002317","ACOMAYO","01","13","02","01","0113","000002317 - ACOMAYO",null,null,null,null,null,"06","06","SAN PABLO","0606","0606 - SAN PABLO"]
[null,null,null,null,null,null,null,null,null,null,null,null,null,{"$f":"+N60+1","v":47},"000010076","ACOMAYO - ESSALUD","01","13","02","01","0113","000010076 - ACOMAYO - ESSALUD",null,null,null,null,null,"06","07","SAN PEDRO","0607","0607 - SAN PEDRO"]
[null,null,null,null,null,null,null,null,null,null,null,null,null,48,"000002318","ACOPIA","01","13","02","02","0113","000002318 - ACOPIA",null,null,null,null,null,"06","08","TINTA","0608","0608 - TINTA"]
[null,null,null,null,null,null,null,null,null,null,null,null,null,49,"000002319","ACOS","01","13","02","03","0113","000002319 - ACOS",null,null,null,null,null,"07","00","(All)","0700","0700 - (All)"]
[null,null,null,null,null,null,null,null,null,null,null,null,null,50,"000002321","POMACANCHI","01","13","02","05","0113","000002321 - POMACANCHI",null,null,null,null,null,"07","01","SANTO TOMAS","0701","0701 - SANTO TOMAS"]
[null,null,null,null,null,null,null,null,null,null,null,null,null,51,"000002322","SAN JUAN DE POMACANCHI","01","13","02","05","0113","000002322 - SAN JUAN DE POMACANCHI",null,null,null,null,null,"07","02","CAPACMARCA","0702","0702 - CAPACMARCA"]
[null,null,null,null,null,null,null,null,null,null,null,null,null,52,"000012926","SANTA LUCIA","01","13","02","05","0113","000012926 - SANTA LUCIA",null,null,null,null,null,"07","03","CHAMACA","0703","0703 - CHAMACA"]
[null,null,null,null,null,null,null,null,null,null,null,null,null,53,"000002324","PUESTO DE SALUD SANGARARA","01","13","02","07","0113","000002324 - PUESTO DE SALUD SANGARARA",null,null,null,null,null,"07","04","COLQUEMARCA","0704","0704 - COLQUEMARCA"]
[null,null,null,null,null,null,null,null,null,null,null,null,null,54,"000002325","PUESTO DE SALUD MARCACONGA","01","13","02","07","0113","000002325 - PUESTO DE SALUD MARCACONGA",null,null,null,null,null,"07","05","LIVITACA","0705","0705 - LIVITACA"]
[null,null,null,null,null,null,null,null,null,null,null,null,null,55,"000002508","PILLPINTO","01","13","10","08","0113","000002508 - PILLPINTO",null,null,null,null,null,"07","06","LLUSCO","0706","0706 - LLUSCO"]
[null,null,null,null,null,null,null,null,null,null,null,null,null,56,"000000000","(All)","01","15",null,null,"0115","000000000 - (All)",null,null,null,null,null,"07","07","QUIÑOTA","0707","0707 - QUIÑOTA"]
[null,null,null,null,null,null,null,null,null,null,null,null,null,null,"000002526","QUINCE MIL","01","15","12","03","0115","000002526 - QUINCE MIL",null,null,null,null,null,"07","08","VELILLE","0708","0708 - VELILLE"]
[null,null,null,null,null,null,null,null,null,null,null,null,null,{"$f":"+N71+1","v":57},"000002527","CCARHUAYO","01","15","12","04","0115","000002527 - CCARHUAYO",null,null,null,null,null,"08","00","(All)","0800","0800 - (All)"]
[null,null,null,null,null,null,null,null,null,null,null,null,null,58,"000002524","PAMPACAMARA","01","15","12","05","0115","000002524 - PAMPACAMARA",null,null,null,null,null,"08","01","ESPINAR","0801","0801 - ESPINAR"]
[null,null,null,null,null,null,null,null,null,null,null,null,null,59,"000002528","CCATCCA","01","15","12","05","0115","000002528 - CCATCCA",null,null,null,null,null,"08","02","CONDOROMA",{"$f":"CONCATENATE(AB75,AC75)","v":"0802"},{"$f":"CONCATENATE(AB75,AC75,\" - \",AD75)","v":"0802 - CONDOROMA"}]
[null,null,null,null,null,null,null,null,null,null,null,null,null,60,"000002529","KCAURY","01","15","12","05","0115","000002529 - KCAURY",null,null,null,null,null,"08","03","COPORAQUE","0803","0803 - COPORAQUE"]
[null,null,null,null,null,null,null,null,null,null,null,null,null,{"$f":"+N76+1","v":61},"000012931","CHICHINA","01","15","12","05","0115","000012931 - CHICHINA",null,null,null,null,null,"08","04","OCORURO","0804","0804 - OCORURO"]
[null,null,null,null,null,null,null,null,null,null,null,null,null,62,"000016335","CCAPANA","01","15","12","05","0115","000016335 - CCAPANA",null,null,null,null,null,"08","05","PALLPATA","0805","0805 - PALLPATA"]
[null,null,null,null,null,null,null,null,null,null,null,null,null,63,"000002535","MARCAPATA","01","15","12","09","0115","000002535 - MARCAPATA",null,null,null,null,null,"08","06","PICHIGUA","0806","0806 - PICHIGUA"]
[null,null,null,null,null,null,null,null,null,null,null,null,null,64,"000007110","INCACANCHA","01","15","12","09",{"$f":"CONCATENATE(Q80,R80)","v":"0115"},{"$f":"CONCATENATE(O80,\" - \",P80)","v":"000007110 - INCACANCHA"},null,null,null,null,null,"08","07","SUYCKUTAMBO","0807","0807 - SUYCKUTAMBO"]
[null,null,null,null,null,null,null,null,null,null,null,null,null,65,"000002536","OCONGATE","01","15","12","10","0115","000002536 - OCONGATE",null,null,null,null,null,"08","08","ALTO PICHIGUA","0808","0808 - ALTO PICHIGUA"]
[null,null,null,null,null,null,null,null,null,null,null,null,null,66,"000006977","TINKI","01","15","12","10","0115","000006977 - TINKI",null,null,null,null,null,"09","00","(All)","0900","0900 - (All)"]
[null,null,null,null,null,null,null,null,null,null,null,null,null,67,"000000000","(All)","01","16",null,null,"0116","000000000 - (All)",null,null,null,null,null,"09","01","SANTA ANA","0901","0901 - SANTA ANA"]
[null,null,null,null,null,null,null,null,null,null,null,null,null,null,"000002300","SAN JERONIMO","01","16","01","04","0116","000002300 - SAN JERONIMO",null,null,null,null,null,"09","02","ECHARATE","0902","0902 - ECHARATE"]
[null,null,null,null,null,null,null,null,null,null,null,null,null,{"$f":"+N83+1","v":68},"000007699","CONCHACALLE","01","16","01","04","0116","000007699 - CONCHACALLE",null,null,null,null,null,"09","03","HUAYOPATA","0903","0903 - HUAYOPATA"]
[null,null,null,null,null,null,null,null,null,null,null,null,null,69,"000018926","ESTABLECIMIENTO PENITENCIARIO CUSCO VARONES","01","16","01","04","0116","000018926 - ESTABLECIMIENTO PENITENCIARIO CUSCO VARONES",null,null,null,null,null,"09","04","MARANURA","0904","0904 - MARANURA"]
[null,null,null,null,null,null,null,null,null,null,null,null,null,70,"000021187","ESTABLECIMIENTO PENITENCIARIO CUSCO MUJERES","01","16","01","04","0116","000021187 - ESTABLECIMIENTO PENITENCIARIO CUSCO MUJERES",null,null,null,null,null,"09","05","OCOBAMBA","0905","0905 - OCOBAMBA"]
[null,null,null,null,null,null,null,null,null,null,null,null,null,71,"000030727","PATRÓN SAN SEBASTIAN","01","16","01","04","0116","000030727 - PATRÓN SAN SEBASTIAN",null,null,null,null,null,"09","06","QUELLOUNO","0906","0906 - QUELLOUNO"]
[null,null,null,null,null,null,null,null,null,null,null,null,null,72,"000002301","SAN SEBASTIAN","01","16","01","05","0116","000002301 - SAN SEBASTIAN",null,null,null,null,null,"09","07","KIMBIRI","0907","0907 - KIMBIRI"]
[null,null,null,null,null,null,null,null,null,null,null,null,null,73,"000002303","SANTA ROSA","01","16","01","05","0116","000002303 - SANTA ROSA",null,null,null,null,null,"09","08","SANTA TERESA","0908","0908 - SANTA TERESA"]
[null,null,null,null,null,null,null,null,null,null,null,null,null,74,"000010065","SAN SEBASTIAN ESSALUD","01","16","01","05","0116","000010065 - SAN SEBASTIAN ESSALUD",null,null,null,null,null,"09","09","VILCABAMBA","0909","0909 - VILCABAMBA"]
[null,null,null,null,null,null,null,null,null,null,null,null,null,75,"000011743","POLICIAL \"SANTA ROSA\"  CUSCO","01","16","01","05","0116","000011743 - POLICIAL \"SANTA ROSA\"  CUSCO",null,null,null,null,null,"09","10","PICHARI","0910","0910 - PICHARI"]
[null,null,null,null,null,null,null,null,null,null,null,null,null,76,"000026181","MENTAL SAN SEBASTIAN","01","16","01","05","0116","000026181 - MENTAL SAN SEBASTIAN",null,null,null,null,null,"09","11","INKAWASI                                ","0911","0911 - INKAWASI                                "]
[null,null,null,null,null,null,null,null,null,null,null,null,null,77,"000002314","SAYLLA","01","16","01","07","0116","000002314 - SAYLLA",null,null,null,null,null,"09","12","VILLA VIRGEN","0912","0912 - VILLA VIRGEN"]
[null,null,null,null,null,null,null,null,null,null,null,null,null,78,"000002323","RONDOCAN","01","16","02","06","0116","000002323 - RONDOCAN",null,null,null,null,null,"09","13","VILLA KINTIARINA","0913","0913 - VILLA KINTIARINA"]
[null,null,null,null,null,null,null,null,null,null,null,null,null,79,"999999999","(All)","01","99",null,null,"0199","999999999 - (All)",null,null,null,null,null,"09","14","MEGANTONI","0914","0914 - MEGANTONI"]
[null,null,null,null,null,null,null,null,null,null,null,null,null,null,"000000000","(All)","02","01",null,null,"0201","000000000 - (All)",null,null,null,null,null,"09","15","KUMPIRUSHIATO","0915","0915 - KUMPIRUSHIATO"]
[null,null,null,null,null,null,null,null,null,null,null,null,null,null,"000002292","INDEPENDENCIA","02","01","01","01","0201","000002292 - INDEPENDENCIA",null,null,null,null,null,"09","16","CIELO PUNCO","0916","0916 - CIELO PUNCO"]
[null,null,null,null,null,null,null,null,null,null,null,null,null,{"$f":"+N96+1","v":80},"000002297","CCORCCA","02","01","01","02","0201","000002297 - CCORCCA",null,null,null,null,null,"09","17","MANITEA","0917","0917 - MANITEA"]
[null,null,null,null,null,null,null,null,null,null,null,null,null,81,"000002306","BELEMPAMPA","02","01","01","06","0201","000002306 - BELEMPAMPA",null,null,null,null,null,"09","18","UNION ASHANINKA","0918","0918 - UNION ASHANINKA"]
[null,null,null,null,null,null,null,null,null,null,null,null,null,82,"000002308","ZARZUELA ALTA","02","01","01","06","0201","000002308 - ZARZUELA ALTA",null,null,null,null,null,"09","00","(All)","0900","0900 - (All)"]
[null,null,null,null,null,null,null,null,null,null,null,null,null,83,"000002309","DIGNIDAD NACIONAL","02","01","01","06","0201","000002309 - DIGNIDAD NACIONAL",null,null,null,null,null,"10","01","PARURO","1001","1001 - PARURO"]
[null,null,null,null,null,null,null,null,null,null,null,null,null,84,"000002313","OCCOPATA","02","01","01","06","0201","000002313 - OCCOPATA",null,null,null,null,null,"10","02","ACCHA","1002","1002 - ACCHA"]
[null,null,null,null,null,null,null,null,null,null,null,null,null,85,"000010920","QUINTA BRIGADA DE MONTAÑA","02","01","01","06","0201","000010920 - QUINTA BRIGADA DE MONTAÑA",null,null,null,null,null,"10","03","CCAPI","1003","1003 - CCAPI"]
[null,null,null,null,null,null,null,null,null,null,null,null,null,86,"000026182","MENTAL SANTIAGO","02","01","01","06","0201","000026182 - MENTAL SANTIAGO",null,null,null,null,null,"10","04","COLCHA","1004","1004 - COLCHA"]
[null,null,null,null,null,null,null,null,null,null,null,null,null,87,"000034933","SANTIAGO ESSALUD","02","01","01","06","0201","000034933 - SANTIAGO ESSALUD",null,null,null,null,null,"10","05","HUANOQUITE","1005","1005 - HUANOQUITE"]
[null,null,null,null,null,null,null,null,null,null,null,null,null,88,"000023721","EJERCITO-PERUANO 5TA BM","02","01","01","06","0201","000023721 - EJERCITO-PERUANO 5TA BM",null,null,null,null,null,"10","06","OMACHA","1006","1006 - OMACHA"]
[null,null,null,null,null,null,null,null,null,null,null,null,null,null,"000000000","(All)","02","02",null,null,"0202","000000000 - (All)",null,null,null,null,null,"10","07","PACCARITAMBO","1007","1007 - PACCARITAMBO"]
[null,null,null,null,null,null,null,null,null,null,null,null,null,{"$f":"+N107+1","v":89},"000034419","MENTAL COMUNITARIO CUSCO","02","02","01","01","0202","000034419 - MENTAL COMUNITARIO CUSCO",null,null,null,null,null,"10","08","PILLPINTO","1008","1008 - PILLPINTO"]
[null,null,null,null,null,null,null,null,null,null,null,null,null,90,"000002302","CCORAO","02","02","01","05","0202","000002302 - CCORAO",null,null,null,null,null,"10","09","YAURISQUE","1009","1009 - YAURISQUE"]
[null,null,null,null,null,null,null,null,null,null,null,null,null,91,"000002307","MANCO CAPAC","02","02","01","06","0202","000002307 - MANCO CAPAC",null,null,null,null,null,"11","00","(All)","1100","1100 - (All)"]
[null,null,null,null,null,null,null,null,null,null,null,null,null,92,"000002310","CHOCCO","02","02","01","06","0202","000002310 - CHOCCO",null,null,null,null,null,"11","01","PAUCARTAMBO","1101","1101 - PAUCARTAMBO"]
[null,null,null,null,null,null,null,null,null,null,null,null,null,93,"000002315","WANCHAQ","02","02","01","08","0202","000002315 - WANCHAQ",null,null,null,null,null,"11","02","CAICAY","1102","1102 - CAICAY"]
[null,null,null,null,null,null,null,null,null,null,null,null,null,94,"000002316","TTIO","02","02","01","08","0202","000002316 - TTIO",null,null,null,null,null,"11","03","CHALLABAMBA","1103","1103 - CHALLABAMBA"]
[null,null,null,null,null,null,null,null,null,null,null,null,null,95,"000010041","ADOLFO GUEVARA VELASCO","02","02","01","08","0202","000010041 - ADOLFO GUEVARA VELASCO",null,null,null,null,null,"11","04","COLQUEPATA","1104","1104 - COLQUEPATA"]
[null,null,null,null,null,null,null,null,null,null,null,null,null,96,"000026183","METROPOLITANO","02","02","01","08","0202","000026183 - METROPOLITANO",null,null,null,null,null,"11","05","HUANCARANI","1105","1105 - HUANCARANI"]
[null,null,null,null,null,null,null,null,null,null,null,null,null,null,"000030730","PATRON SANTIAGO","02","02","01","08","0202","000030730 - PATRON SANTIAGO",null,null,null,null,null,"11","06","KOSÑIPATA","1106","1106 - KOSÑIPATA"]
[null,null,null,null,null,null,null,null,null,null,null,null,null,{"$f":"+N116+1","v":97},"000000000","(All)","02","03",null,null,"0203","000000000 - (All)",null,null,null,null,null,"12","00","(All)","1200","1200 - (All)"]
[null,null,null,null,null,null,null,null,null,null,null,null,null,98,"000002326","ANTA","02","03","03","01","0203","000002326 - ANTA",null,null,null,null,null,"12","01","URCOS","1201","1201 - URCOS"]
[null,null,null,null,null,null,null,null,null,null,null,null,null,99,"000002328","COMPONE","02","03","03","01","0203","000002328 - COMPONE",null,null,null,null,null,"12","02","ANDAHUAYLILLAS","1202","1202 - ANDAHUAYLILLAS"]
[null,null,null,null,null,null,null,null,null,null,null,null,null,100,"000002329","CONCHACALLA","02","03","03","01","0203","000002329 - CONCHACALLA",null,null,null,null,null,"12","03","CAMANTI","1203","1203 - CAMANTI"]
[null,null,null,null,null,null,null,null,null,null,null,null,null,101,"000027790","MENTAL COMUNITARIO ANTA","02","03","03","01","0203","000027790 - MENTAL COMUNITARIO ANTA",null,null,null,null,null,"12","04","CCARHUAYO","1204","1204 - CCARHUAYO"]
[null,null,null,null,null,null,null,null,null,null,null,null,null,102,"000029514","ESSALUD ANTA","02","03","03","01","0203","000029514 - ESSALUD ANTA",null,null,null,null,null,"12","05","CCATCA","1205","1205 - CCATCA"]
[null,null,null,null,null,null,null,null,null,null,null,null,null,103,"000002330","ANCAHUASI","02","03","03","02","0203","000002330 - ANCAHUASI",null,null,null,null,null,"12","06","CUSIPATA","1206","1206 - CUSIPATA"]
[null,null,null,null,null,null,null,null,null,null,null,null,null,104,"000002331","CACHIMAYO","02","03","03","03","0203","000002331 - CACHIMAYO",null,null,null,null,null,"12","07","HUARO","1207","1207 - HUARO"]
[null,null,null,null,null,null,null,null,null,null,null,null,null,105,"000006972","PANTIPATA","02","03","03","04","0203","000006972 - PANTIPATA",null,null,null,null,null,"12","08","LUCRE","1208","1208 - LUCRE"]
[null,null,null,null,null,null,null,null,null,null,null,null,null,106,"000036240","CHINCHAYPUJIO","02","03","03","04","0203","000036240 - CHINCHAYPUJIO",null,null,null,null,null,"12","09","MARCAPATA","1209","1209 - MARCAPATA"]
[null,null,null,null,null,null,null,null,null,null,null,null,null,107,"000035838","PARCCOTICA","02","03","03","04","0203","000035838 - PARCCOTICA",null,null,null,null,null,"12","10","OCONGATE","1210","1210 - OCONGATE"]
[null,null,null,null,null,null,null,null,null,null,null,null,null,108,"000002333","HUAROCONDO","02","03","03","05","0203","000002333 - HUAROCONDO",null,null,null,null,null,"12","11","OROPESA","1211","1211 - OROPESA"]
[null,null,null,null,null,null,null,null,null,null,null,null,null,109,"000002334","HUAYLLACOCHA","02","03","03","05","0203","000002334 - HUAYLLACOCHA",null,null,null,null,null,"12","12","QUIQUIJANA","1212","1212 - QUIQUIJANA"]
[null,null,null,null,null,null,null,null,null,null,null,null,null,110,"000002339","PUCYURA ANTA","02","03","03","08","0203","000002339 - PUCYURA ANTA",null,null,null,null,null,"13","00","(All)","1300","1300 - (All)"]
[null,null,null,null,null,null,null,null,null,null,null,null,null,null,"000002340","ZURITE","02","03","03","09","0203","000002340 - ZURITE",null,null,null,null,null,"13","01","URUBAMBA","1301","1301 - URUBAMBA"]
[null,null,null,null,null,null,null,null,null,null,null,null,null,{"$f":"+N131+1","v":111},"000002327","CHACAN","02","03","03","01","0203","000002327 - CHACAN",null,null,null,null,null,"13","02","CHINCHERO","1302","1302 - CHINCHERO"]
[null,null,null,null,null,null,null,null,null,null,null,null,null,112,"000000000","(All)","02","04",null,null,"0204","000000000 - (All)",null,null,null,null,null,"13","03","HUAYLLABAMBA","1303","1303 - HUAYLLABAMBA"]
[null,null,null,null,null,null,null,null,null,null,null,null,null,113,"000002336","LIMATAMBO","02","04","03","06","0204","000002336 - LIMATAMBO",null,null,null,null,null,"13","04","MACHUPICCHU","1304","1304 - MACHUPICCHU"]
[null,null,null,null,null,null,null,null,null,null,null,null,null,114,"000002337","PAMPACONGA","02","04","03","06","0204","000002337 - PAMPACONGA",null,null,null,null,null,"13","05","MARAS","1305","1305 - MARAS"]
[null,null,null,null,null,null,null,null,null,null,null,null,null,115,"000010761","URATARI","02","04","03","06","0204","000010761 - URATARI",null,null,null,null,null,"13","06","OLLANTAYTAMBO","1306","1306 - OLLANTAYTAMBO"]
[null,null,null,null,null,null,null,null,null,null,null,null,null,null,"000002338","MOLLEPATA","02","04","03","07","0204","000002338 - MOLLEPATA",null,null,null,null,null,"13","07","YUCAY",{"$f":"CONCATENATE(AB138,AC138)","v":"1307"},"1307 - YUCAY"]
[null,null,null,null,null,null,null,null,null,null,null,null,null,{"$f":"+N137+1","v":116},"000021061","HUAMANPATA","02","04","03","07","0204","000021061 - HUAMANPATA",null,null,null,null,null,"00","00","(All)",{"$f":"CONCATENATE(AB139,AC139)","v":"0000"},"0000 - (All)"]
[null,null,null,null,null,null,null,null,null,null,null,null,null,117,"000000000","(All)","02","05",null,null,"0205","000000000 - (All)"]
[null,null,null,null,null,null,null,null,null,null,null,null,null,{"$f":"+N140+1","v":118},"000002343","COYA","02","05","04","02","0205","000002343 - COYA"]
[null,null,null,null,null,null,null,null,null,null,null,null,null,119,"000002344","LAMAY","02","05","04","03","0205","000002344 - LAMAY"]
[null,null,null,null,null,null,null,null,null,null,null,null,null,120,"000006975","SAYLLAFAYA","02","05","04","03","0205","000006975 - SAYLLAFAYA"]
[null,null,null,null,null,null,null,null,null,null,null,null,null,121,"000007145","HUAMA","02","05","04","03","0205","000007145 - HUAMA"]
[null,null,null,null,null,null,null,null,null,null,null,null,null,122,"000007146","POQUES","02","05","04","03","0205","000007146 - POQUES"]
[null,null,null,null,null,null,null,null,null,null,null,null,null,123,"000036012","HUARQUI","02","05","04","03","0205","000036012 - HUARQUI"]
[null,null,null,null,null,null,null,null,null,null,null,null,null,124,"000002348","PISAC","02","05","04","05","0205","000002348 - PISAC"]
[null,null,null,null,null,null,null,null,null,null,null,null,null,125,"000002349","CUYO CHICO","02","05","04","05","0205","000002349 - CUYO CHICO"]
[null,null,null,null,null,null,null,null,null,null,null,null,null,126,"000002350","CUYO GRANDE","02","05","04","05","0205","000002350 - CUYO GRANDE"]
[null,null,null,null,null,null,null,null,null,null,null,null,null,127,"000002351","QUELLO QUELLO","02","05","04","05",{"$f":"CONCATENATE(Q150,R150)","v":"0205"},{"$f":"CONCATENATE(O150,\" - \",P150)","v":"000002351 - QUELLO QUELLO"}]
[null,null,null,null,null,null,null,null,null,null,null,null,null,128,"000002352","SAN SALVADOR","02","05","04","06","0205","000002352 - SAN SALVADOR"]
[null,null,null,null,null,null,null,null,null,null,null,null,null,129,"000036087","TIRACANCHA","02","05","04","06","0205","000036087 - TIRACANCHA"]
[null,null,null,null,null,null,null,null,null,null,null,null,null,null,"000002353","TARAY","02","05","04","07","0205","000002353 - TARAY"]
[null,null,null,null,null,null,null,null,null,null,null,null,null,{"$f":"+N152+1","v":130},"000002354","HUANCALLE","02","05","04","07","0205","000002354 - HUANCALLE"]
[null,null,null,null,null,null,null,null,null,null,null,null,null,131,"000000000","(All)","02","06",null,null,"0206","000000000 - (All)"]
[null,null,null,null,null,null,null,null,null,null,null,null,null,132,"000002341","CALCA","02","06","04","01","0206","000002341 - CALCA"]
[null,null,null,null,null,null,null,null,null,null,null,null,null,133,"000010069","ESSALUD CALCA","02","06","04","01","0206","000010069 - ESSALUD CALCA"]
[null,null,null,null,null,null,null,null,null,null,null,null,null,134,"000010759","HUARAN","02","06","04","01","0206","000010759 - HUARAN"]
[null,null,null,null,null,null,null,null,null,null,null,null,null,135,"000010762","ACCHA ALTA - PAMPALLACTA","02","06","04","01","0206","000010762 - ACCHA ALTA - PAMPALLACTA"]
[null,null,null,null,null,null,null,null,null,null,null,null,null,136,"000026273","MENTAL COMUNITARIO VIRGEN ASUNTA DE CALCA","02","06","04","01","0206","000026273 - MENTAL COMUNITARIO VIRGEN ASUNTA DE CALCA"]
[null,null,null,null,null,null,null,null,null,null,null,null,null,137,"000002342","AMPARAES","02","06","04","04","0206","000002342 - AMPARAES"]
[null,null,null,null,null,null,null,null,null,null,null,null,null,138,"000002345","CCACHIN","02","06","04","04","0206","000002345 - CCACHIN"]
[null,null,null,null,null,null,null,null,null,null,null,null,null,139,"000002346","CHOQUECANCHA","02","06","04","04","0206","000002346 - CHOQUECANCHA"]
[null,null,null,null,null,null,null,null,null,null,null,null,null,140,"000002347","LARES","02","06","04","04","0206","000002347 - LARES"]
[null,null,null,null,null,null,null,null,null,null,null,null,null,141,"000002361","SUYO","02","06","04","04","0206","000002361 - SUYO"]
[null,null,null,null,null,null,null,null,null,null,null,null,null,142,"000007144","PATABAMBA","02","06","04","07","0206","000007144 - PATABAMBA"]
[null,null,null,null,null,null,null,null,null,null,null,null,null,143,"000002515","PAROBAMBA","02","06","11","03","0206","000002515 - PAROBAMBA"]
[null,null,null,null,null,null,null,null,null,null,null,null,null,144,"000007143","OTOCANI","02","06","11","03","0206","000007143 - OTOCANI"]
[null,null,null,null,null,null,null,null,null,null,null,null,null,145,"000000000","(All)","02","07",null,null,"0207","000000000 - (All)"]
[null,null,null,null,null,null,null,null,null,null,null,null,null,146,"000002540","URUBAMBA","02","07","13","01","0207","000002540 - URUBAMBA"]
[null,null,null,null,null,null,null,null,null,null,null,null,null,147,"000002541","YANAHUARA","02","07","13","01","0207","000002541 - YANAHUARA"]
[null,null,null,null,null,null,null,null,null,null,null,null,null,148,"000010060","CAS URUBAMBA -ESSALUD","02","07","13","01","0207","000010060 - CAS URUBAMBA -ESSALUD"]
[null,null,null,null,null,null,null,null,null,null,null,null,null,149,"000030666","MENTAL COMUNITARIO URUBAMBA","02","07","13","01","0207","000030666 - MENTAL COMUNITARIO URUBAMBA"]
[null,null,null,null,null,null,null,null,null,null,null,null,null,150,"000035851","URUBAMBA - ESSALUD","02","07","13","01","0207","000035851 - URUBAMBA - ESSALUD"]
[null,null,null,null,null,null,null,null,null,null,null,null,null,151,"000002543","CHINCHERO","02","07","13","02","0207","000002543 - CHINCHERO"]
[null,null,null,null,null,null,null,null,null,null,null,null,null,152,"000002544","OCCOTUAN","02","07","13","02","0207","000002544 - OCCOTUAN"]
[null,null,null,null,null,null,null,null,null,null,null,null,null,153,"000002545","HUAYLLABAMBA","02","07","13","03","0207","000002545 - HUAYLLABAMBA"]
[null,null,null,null,null,null,null,null,null,null,null,null,null,154,"000002546","MACHUPICCHU","02","07","13","04","0207","000002546 - MACHUPICCHU"]
[null,null,null,null,null,null,null,null,null,null,null,null,null,155,"000002547","COLLPANI","02","07","13","04","0207","000002547 - COLLPANI"]
[null,null,null,null,null,null,null,null,null,null,null,null,null,156,"000006974","CAMINO INCA HUAYLLABAMBA","02","07","13","04","0207","000006974 - CAMINO INCA HUAYLLABAMBA"]
[null,null,null,null,null,null,null,null,null,null,null,null,null,157,"000010073","MACHU PICCHU - ESSALUD","02","07","13","04","0207","000010073 - MACHU PICCHU - ESSALUD"]
[null,null,null,null,null,null,null,null,null,null,null,null,null,158,"000002548","MARAS","02","07","13","05","0207","000002548 - MARAS"]
[null,null,null,null,null,null,null,null,null,null,null,null,null,159,"000010758","CRUZPATA","02","07","13","05","0207","000010758 - CRUZPATA"]
[null,null,null,null,null,null,null,null,null,null,null,null,null,160,"000002549","OLLANTAYTAMBO","02","07","13","06","0207","000002549 - OLLANTAYTAMBO"]
[null,null,null,null,null,null,null,null,null,null,null,null,null,161,"000002550","CHILLCA","02","07","13","06","0207","000002550 - CHILLCA"]
[null,null,null,null,null,null,null,null,null,null,null,null,null,162,"000010760","PATACANCHA","02","07","13","06","0207","000010760 - PATACANCHA"]
[null,null,null,null,null,null,null,null,null,null,null,null,null,163,"000002551","YUCAY","02","07","13","07","0207","000002551 - YUCAY"]
[null,null,null,null,null,null,null,null,null,null,null,null,null,164,"000000000","(All)","02","08",null,null,"0208","000000000 - (All)"]
[null,null,null,null,null,null,null,null,null,null,null,null,null,165,"000002355","LA QUEBRADA","02","08","04","08","0208","000002355 - LA QUEBRADA"]
[null,null,null,null,null,null,null,null,null,null,null,null,null,166,"000002356","CCORIMAYO","02","08","04","08","0208","000002356 - CCORIMAYO"]
[null,null,null,null,null,null,null,null,null,null,null,null,null,167,"000002357","COLCCA YANATILE","02","08","04","08","0208","000002357 - COLCCA YANATILE"]
[null,null,null,null,null,null,null,null,null,null,null,null,null,168,"000002358","MUYUPAY","02","08","04","08","0208","000002358 - MUYUPAY"]
[null,null,null,null,null,null,null,null,null,null,null,null,null,169,"000002359","PUTUCUSI","02","08","04","08","0208","000002359 - PUTUCUSI"]
[null,null,null,null,null,null,null,null,null,null,null,null,null,170,"000002360","QUESQUENTO","02","08","04","08","0208","000002360 - QUESQUENTO"]
[null,null,null,null,null,null,null,null,null,null,null,null,null,171,"000002362","HUACHIBAMBA","02","08","04","08","0208","000002362 - HUACHIBAMBA"]
[null,null,null,null,null,null,null,null,null,null,null,null,null,172,"000006971","COMBAPATA YANATILE","02","08","04","08","0208","000006971 - COMBAPATA YANATILE"]
[null,null,null,null,null,null,null,null,null,null,null,null,null,173,"000006973","BELLAVISTA","02","08","04","08","0208","000006973 - BELLAVISTA"]
[null,null,null,null,null,null,null,null,null,null,null,null,null,174,"000007142","CHANCAMAYO","02","08","04","08","0208","000007142 - CHANCAMAYO"]
[null,null,null,null,null,null,null,null,null,null,null,null,null,175,"000002464","VERSALLES","02","08","09","05","0208","000002464 - VERSALLES"]
[null,null,null,null,null,null,null,null,null,null,null,null,null,176,"000002467","PUENTE SANTIAGO","02","08","09","06","0208","000002467 - PUENTE SANTIAGO"]
[null,null,null,null,null,null,null,null,null,null,null,null,null,177,"000000000","(All)","02","09",null,null,"0209","000000000 - (All)"]
[null,null,null,null,null,null,null,null,null,null,null,null,null,178,"000002290","SAN PEDRO CUSCO","02","09","01","01","0209","000002290 - SAN PEDRO CUSCO"]
[null,null,null,null,null,null,null,null,null,null,null,null,null,179,"000002291","SIETE CUARTONES","02","09","01","01","0209","000002291 - SIETE CUARTONES"]
[null,null,null,null,null,null,null,null,null,null,null,null,null,180,"000002293","MIRAFLORES","02","09","01","01","0209","000002293 - MIRAFLORES"]
[null,null,null,null,null,null,null,null,null,null,null,null,null,{"$f":"+N204+1","v":181},"000002294","PICCHU LA RINCONADA","02","09","01","01","0209","000002294 - PICCHU LA RINCONADA"]
[null,null,null,null,null,null,null,null,null,null,null,null,null,182,"000002295","BUENA VISTA","02","09","01","01","0209","000002295 - BUENA VISTA"]
[null,null,null,null,null,null,null,null,null,null,null,null,null,183,"000002299","POROY","02","09","01","03","0209","000002299 - POROY"]
[null,null,null,null,null,null,null,null,null,null,null,null,null,184,"999999999","(All)","02","99",null,null,"0299","999999999 - (All)"]
[null,null,null,null,null,null,null,null,null,null,null,null,null,185,"000002421","QUILLABAMBA","03","00","09","01","0300","000002421 - QUILLABAMBA"]
[null,null,null,null,null,null,null,null,null,null,null,null,null,186,"000000000","(All)","03","01",null,null,"0301","000000000 - (All)"]
[null,null,null,null,null,null,null,null,null,null,null,null,null,187,"000002422","HUAYANAY","03","01","09","01","0301","000002422 - HUAYANAY"]
[null,null,null,null,null,null,null,null,null,null,null,null,null,188,"000002423","IDMA","03","01","09","01","0301","000002423 - IDMA"]
[null,null,null,null,null,null,null,null,null,null,null,null,null,189,"000002424","POTRERO","03","01","09","01","0301","000002424 - POTRERO"]
[null,null,null,null,null,null,null,null,null,null,null,null,null,190,"000008910","SANTA ANA","03","01","09","01","0301","000008910 - SANTA ANA"]
[null,null,null,null,null,null,null,null,null,null,null,null,null,191,"000010062","QUILLABAMBA - ESSALUD","03","01","09","01","0301","000010062 - QUILLABAMBA - ESSALUD"]
[null,null,null,null,null,null,null,null,null,null,null,null,null,192,"000011744","POSTA MEDICO POLICIAL LA CONVENCION - QUILLABAMBA","03","01","09","01","0301","000011744 - POSTA MEDICO POLICIAL LA CONVENCION - QUILLABAMBA"]
[null,null,null,null,null,null,null,null,null,null,null,null,null,193,"000015842","PAVAYOC","03","01","09","01",{"$f":"CONCATENATE(Q217,R217)","v":"0301"},{"$f":"CONCATENATE(O217,\" - \",P217)","v":"000015842 - PAVAYOC"}]
[null,null,null,null,null,null,null,null,null,null,null,null,null,194,"000024653","INPE QUILLABAMBA","03","01","09","01","0301","000024653 - INPE QUILLABAMBA"]
[null,null,null,null,null,null,null,null,null,null,null,null,null,195,"000026386","MENTAL QUILLABAMBA","03","01","09","01","0301","000026386 - MENTAL QUILLABAMBA"]
[null,null,null,null,null,null,null,null,null,null,null,null,null,196,"000002425","ECHARATE","03","01","09","02","0301","000002425 - ECHARATE"]
[null,null,null,null,null,null,null,null,null,null,null,null,null,197,"000002430","PAMPA CONCEPCION","03","01","09","02","0301","000002430 - PAMPA CONCEPCION"]
[null,null,null,null,null,null,null,null,null,null,null,null,null,198,"000002446","CHACCO","03","01","09","02","0301","000002446 - CHACCO"]
[null,null,null,null,null,null,null,null,null,null,null,null,null,199,"000002451","CHAHUARES","03","01","09","02","0301","000002451 - CHAHUARES"]
[null,null,null,null,null,null,null,null,null,null,null,null,null,200,"000033273","SAN ISIDRO LABRADOR - ECHARATI","03","01","09","02","0301","000033273 - SAN ISIDRO LABRADOR - ECHARATI"]
[null,null,null,null,null,null,null,null,null,null,null,null,null,201,"000024296","EJERCITO-MIARIA 334","03","01","09","02","0301","000024296 - EJERCITO-MIARIA 334"]
[null,null,null,null,null,null,null,null,null,null,null,null,null,202,"000000000","(All)","03","02",null,null,"0302","000000000 - (All)"]
[null,null,null,null,null,null,null,null,null,null,null,null,null,203,"000002453","HUYRO","03","02","09","03","0302","000002453 - HUYRO"]
[null,null,null,null,null,null,null,null,null,null,null,null,null,204,"000002454","ALFAMAYO","03","02","09","03","0302","000002454 - ALFAMAYO"]
[null,null,null,null,null,null,null,null,null,null,null,null,null,205,"000002455","HUAYOPATA","03","02","09","03","0302","000002455 - HUAYOPATA"]
[null,null,null,null,null,null,null,null,null,null,null,null,null,206,"000002456","AMAYBAMBA","03","02","09","03","0302","000002456 - AMAYBAMBA"]
[null,null,null,null,null,null,null,null,null,null,null,null,null,207,"000002457","SAN PABLO HUAYOPATA","03","02","09","03","0302","000002457 - SAN PABLO HUAYOPATA"]
[null,null,null,null,null,null,null,null,null,null,null,null,null,208,"000010075","CAP HUYRO - ESSALUD","03","02","09","03","0302","000010075 - CAP HUYRO - ESSALUD"]
[null,null,null,null,null,null,null,null,null,null,null,null,null,209,"000002458","MARANURA","03","02","09","04","0302","000002458 - MARANURA"]
[null,null,null,null,null,null,null,null,null,null,null,null,null,210,"000002460","SANTA MARIA","03","02","09","04","0302","000002460 - SANTA MARIA"]
[null,null,null,null,null,null,null,null,null,null,null,null,null,211,"000002461","UCHUMAYO","03","02","09","04","0302","000002461 - UCHUMAYO"]
[null,null,null,null,null,null,null,null,null,null,null,null,null,212,"000002476","SANTA TERESA","03","02","09","08","0302","000002476 - SANTA TERESA"]
[null,null,null,null,null,null,null,null,null,null,null,null,null,213,"000002477","SULLUCUYOC","03","02","09","08","0302","000002477 - SULLUCUYOC"]
[null,null,null,null,null,null,null,null,null,null,null,null,null,214,"000002478","TOTORA","03","02","09","08","0302","000002478 - TOTORA"]
[null,null,null,null,null,null,null,null,null,null,null,null,null,215,"000000000","(All)","03","03",null,null,"0303","000000000 - (All)"]
[null,null,null,null,null,null,null,null,null,null,null,null,null,216,"000002363","TUPAC AMARU QUELLOUNO","03","03","04","08","0303","000002363 - TUPAC AMARU QUELLOUNO"]
[null,null,null,null,null,null,null,null,null,null,null,null,null,217,"000002462","OCCOBAMBA LACONVENCION","03","03","09","05","0303","000002462 - OCCOBAMBA LACONVENCION"]
[null,null,null,null,null,null,null,null,null,null,null,null,null,218,"000002463","CHINGANILLA","03","03","09","05","0303","000002463 - CHINGANILLA"]
[null,null,null,null,null,null,null,null,null,null,null,null,null,219,"000002465","QUELLOUNO","03","03","09","06","0303","000002465 - QUELLOUNO"]
[null,null,null,null,null,null,null,null,null,null,null,null,null,220,"000002466","HUILLCAPAMPA","03","03","09","06","0303","000002466 - HUILLCAPAMPA"]
[null,null,null,null,null,null,null,null,null,null,null,null,null,221,"000002468","SAN MARTIN","03","03","09","06","0303","000002468 - SAN MARTIN"]
[null,null,null,null,null,null,null,null,null,null,null,null,null,222,"000008906","ESTRELLA","03","03","09","06","0303","000008906 - ESTRELLA"]
[null,null,null,null,null,null,null,null,null,null,null,null,null,223,"000008907","MATORIATO","03","03","09","06","0303","000008907 - MATORIATO"]
[null,null,null,null,null,null,null,null,null,null,null,null,null,224,"000008908","CHIRUMBIA","03","03","09","06","0303","000008908 - CHIRUMBIA"]
[null,null,null,null,null,null,null,null,null,null,null,null,null,225,"000008909","CHAPO BOYERO","03","03","09","06","0303","000008909 - CHAPO BOYERO"]
[null,null,null,null,null,null,null,null,null,null,null,null,null,226,"000000000","(All)","03","04",null,null,"0304","000000000 - (All)"]
[null,null,null,null,null,null,null,null,null,null,null,null,null,227,"000002427","KITENI","03","04","09","02","0304","000002427 - KITENI"]
[null,null,null,null,null,null,null,null,null,null,null,null,null,228,"000002431","IVOCHOTE","03","04","09","02","0304","000002431 - IVOCHOTE"]
[null,null,null,null,null,null,null,null,null,null,null,null,null,229,"000002438","PACHIRI","03","04","09","02","0304","000002438 - PACHIRI"]
[null,null,null,null,null,null,null,null,null,null,null,null,null,230,"000002440","PANGOA","03","04","09","02","0304","000002440 - PANGOA"]
[null,null,null,null,null,null,null,null,null,null,null,null,null,231,"000002443","SANIRIATO","03","04","09","02","0304","000002443 - SANIRIATO"]
[null,null,null,null,null,null,null,null,null,null,null,null,null,232,"000002447","KAMANQUIRIATO","03","04","09","02","0304","000002447 - KAMANQUIRIATO"]
[null,null,null,null,null,null,null,null,null,null,null,null,null,233,"000014531","CAP I ECHARATE - KITENI","03","04","09","02","0304","000014531 - CAP I ECHARATE - KITENI"]
[null,null,null,null,null,null,null,null,null,null,null,null,null,234,"000024583","BCT N° 314 - KEPASHIATO","03","04","09","02","0304","000024583 - BCT N° 314 - KEPASHIATO"]
[null,null,null,null,null,null,null,null,null,null,null,null,null,235,"000002489","YUVENI","03","04","09","09","0304","000002489 - YUVENI"]
[null,null,null,null,null,null,null,null,null,null,null,null,null,236,"000002493","SELVA ALEGRE","03","04","09","09","0304","000002493 - SELVA ALEGRE"]
[null,null,null,null,null,null,null,null,null,null,null,null,null,237,"000006976","CHONTABAMBA","03","04","09","09","0304","000006976 - CHONTABAMBA"]
[null,null,null,null,null,null,null,null,null,null,null,null,null,238,"000002432","KEPASHIATO","03","04","09","15","0304","000002432 - KEPASHIATO"]
[null,null,null,null,null,null,null,null,null,null,null,null,null,239,"000002434","MATERIATO","03","04","09","15","0304","000002434 - MATERIATO"]
[null,null,null,null,null,null,null,null,null,null,null,null,null,240,"000013068","TRIO RIO","03","04","09","15","0304","000013068 - TRIO RIO"]
[null,null,null,null,null,null,null,null,null,null,null,null,null,241,"000013069","PUGUIENTIMARI","03","04","09","15","0304","000013069 - PUGUIENTIMARI"]
[null,null,null,null,null,null,null,null,null,null,null,null,null,242,"000000000","(All)","03","05",null,null,"0305","000000000 - (All)"]
[null,null,null,null,null,null,null,null,null,null,null,null,null,243,"000002426","KIRIGUETI","03","05","09","14","0305","000002426 - KIRIGUETI"]
[null,null,null,null,null,null,null,null,null,null,null,null,null,244,"000002428","CHOCORIARI","03","05","09","14","0305","000002428 - CHOCORIARI"]
[null,null,null,null,null,null,null,null,null,null,null,null,null,{"$f":"+N268+1","v":245},"000002435","MIARIA","03","05","09","14","0305","000002435 - MIARIA"]
[null,null,null,null,null,null,null,null,null,null,null,null,null,246,"000002436","NUEVA LUZ","03","05","09","14","0305","000002436 - NUEVA LUZ"]
[null,null,null,null,null,null,null,null,null,null,null,null,null,247,"000002437","NUEVO MUNDO","03","05","09","14","0305","000002437 - NUEVO MUNDO"]
[null,null,null,null,null,null,null,null,null,null,null,null,null,248,"000002441","PUERTO HUALLANA","03","05","09","14","0305","000002441 - PUERTO HUALLANA"]
[null,null,null,null,null,null,null,null,null,null,null,null,null,249,"000002442","PUERTO RICO","03","05","09","14","0305","000002442 - PUERTO RICO"]
[null,null,null,null,null,null,null,null,null,null,null,null,null,250,"000002444","SENSA","03","05","09","14","0305","000002444 - SENSA"]
[null,null,null,null,null,null,null,null,null,null,null,null,null,251,"000002445","TIMPIA","03","05","09","14","0305","000002445 - TIMPIA"]
[null,null,null,null,null,null,null,null,null,null,null,null,null,252,"000002448","KAMISEA","03","05","09","14","0305","000002448 - KAMISEA"]
[null,null,null,null,null,null,null,null,null,null,null,null,null,253,"000002452","SHIVANKORENI","03","05","09","14","0305","000002452 - SHIVANKORENI"]
[null,null,null,null,null,null,null,null,null,null,null,null,null,254,"000013066","MONTETONI","03","05","09","14","0305","000013066 - MONTETONI"]
[null,null,null,null,null,null,null,null,null,null,null,null,null,255,"000013067","TANGOSHIARI","03","05","09","14","0305","000013067 - TANGOSHIARI"]
[null,null,null,null,null,null,null,null,null,null,null,null,null,256,"000015235","NUEVA VIDA","03","05","09","14","0305","000015235 - NUEVA VIDA"]
[null,null,null,null,null,null,null,null,null,null,null,null,null,257,"000015843","CASHIRIARI","03","05","09","14",{"$f":"CONCATENATE(Q281,R281)","v":"0305"},{"$f":"CONCATENATE(O281,\" - \",P281)","v":"000015843 - CASHIRIARI"}]
[null,null,null,null,null,null,null,null,null,null,null,null,null,258,"000015844","CAMANA","03","05","09","14","0305","000015844 - CAMANA"]
[null,null,null,null,null,null,null,null,null,null,null,null,null,259,"000000000","(All)","03","06",null,null,"0306","000000000 - (All)"]
[null,null,null,null,null,null,null,null,null,null,null,null,null,260,"000002480","PUCYURA","03","06","09","09","0306","000002480 - PUCYURA"]
[null,null,null,null,null,null,null,null,null,null,null,null,null,261,"000002484","OYARA","03","06","09","09","0306","000002484 - OYARA"]
[null,null,null,null,null,null,null,null,null,null,null,null,null,262,"000002486","PAMPACONAS","03","06","09","09","0306","000002486 - PAMPACONAS"]
[null,null,null,null,null,null,null,null,null,null,null,null,null,263,"000002490","ARMA","03","06","09","09","0306","000002490 - ARMA"]
[null,null,null,null,null,null,null,null,null,null,null,null,null,264,"000002492","PALTAYBAMBA","03","06","09","09","0306","000002492 - PALTAYBAMBA"]
[null,null,null,null,null,null,null,null,null,null,null,null,null,265,"000002481","CCARCCO","03","06","09","11","0306","000002481 - CCARCCO"]
[null,null,null,null,null,null,null,null,null,null,null,null,null,266,"000002482","INCAHUASI","03","06","09","11","0306","000002482 - INCAHUASI"]
[null,null,null,null,null,null,null,null,null,null,null,null,null,267,"000002485","PACCAYBAMBA","03","06","09","11","0306","000002485 - PACCAYBAMBA"]
[null,null,null,null,null,null,null,null,null,null,null,null,null,268,"000002487","CHOQUETIRA","03","06","09","11","0306","000002487 - CHOQUETIRA"]
[null,null,null,null,null,null,null,null,null,null,null,null,null,269,"000002491","LUCMAHUAYCO","03","06","09","11","0306","000002491 - LUCMAHUAYCO"]
[null,null,null,null,null,null,null,null,null,null,null,null,null,270,"000035520","CHANCAVINE","03","06","09","12","0306","000035520 - CHANCAVINE"]
[null,null,null,null,null,null,null,null,null,null,null,null,null,271,"000000000","(All)","03","07",null,null,"0307","000000000 - (All)"]
[null,null,null,null,null,null,null,null,null,null,null,null,null,272,"000002429","CIRIALO","03","07","09","02","0307","000002429 - CIRIALO"]
[null,null,null,null,null,null,null,null,null,null,null,null,null,273,"000002433","KORIBENI","03","07","09","02","0307","000002433 - KORIBENI"]
[null,null,null,null,null,null,null,null,null,null,null,null,null,274,"000002439","PALMA REAL","03","07","09","02","0307","000002439 - PALMA REAL"]
[null,null,null,null,null,null,null,null,null,null,null,null,null,275,"000002449","ICHIQUIATO","03","07","09","02","0307","000002449 - ICHIQUIATO"]
[null,null,null,null,null,null,null,null,null,null,null,null,null,276,"000002450","SAN ANTONIO","03","07","09","02","0307","000002450 - SAN ANTONIO"]
[null,null,null,null,null,null,null,null,null,null,null,null,null,277,"999999999","(All)","03","99",null,null,"0399","999999999 - (All)"]
[null,null,null,null,null,null,null,null,null,null,null,null,null,278,"000000000","(All)","04","00",null,null,"0400","000000000 - (All)"]
[null,null,null,null,null,null,null,null,null,null,null,null,null,279,"000002378","SICUANI","04","00","06","01","0400","000002378 - SICUANI"]
[null,null,null,null,null,null,null,null,null,null,null,null,null,280,"000007135","ESPINAR","04","00","08","01","0400","000007135 - ESPINAR"]
[null,null,null,null,null,null,null,null,null,null,null,null,null,281,"000000000","(All)","04","01",null,null,"0401","000000000 - (All)"]
[null,null,null,null,null,null,null,null,null,null,null,null,null,282,"000002364","YANAOCA","04","01","05","01","0401","000002364 - YANAOCA"]
[null,null,null,null,null,null,null,null,null,null,null,null,null,283,"000002365","PONGOÑA","04","01","05","01","0401","000002365 - PONGOÑA"]
[null,null,null,null,null,null,null,null,null,null,null,null,null,284,"000018241","HAMPATURA","04","01","05","01","0401","000018241 - HAMPATURA"]
[null,null,null,null,null,null,null,null,null,null,null,null,null,285,"000002367","CHITIBAMBA","04","01","05","02","0401","000002367 - CHITIBAMBA"]
[null,null,null,null,null,null,null,null,null,null,null,null,null,286,"000002372","PAMPAMARCA","04","01","05","06","0401","000002372 - PAMPAMARCA"]
[null,null,null,null,null,null,null,null,null,null,null,null,null,287,"000002373","QUEHUE","04","01","05","07","0401","000002373 - QUEHUE"]
[null,null,null,null,null,null,null,null,null,null,null,null,null,288,"000002374","HUINCHIRI","04","01","05","07","0401","000002374 - HUINCHIRI"]
[null,null,null,null,null,null,null,null,null,null,null,null,null,289,"000034449","CHAUPIBANDA","04","01","05","07","0401","000034449 - CHAUPIBANDA"]
[null,null,null,null,null,null,null,null,null,null,null,null,null,290,"000002375","SURIMANA","04","01","05","08","0401","000002375 - SURIMANA"]
[null,null,null,null,null,null,null,null,null,null,null,null,null,291,"000002376","TUNGASUCA","04","01","05","08","0401","000002376 - TUNGASUCA"]
[null,null,null,null,null,null,null,null,null,null,null,null,null,292,"000002377","TOCCOCCORI","04","01","05","08","0401","000002377 - TOCCOCCORI"]
[null,null,null,null,null,null,null,null,null,null,null,null,null,293,"000032339","CCOCHAPATA","04","01","05","08","0401","000032339 - CCOCHAPATA"]
[null,null,null,null,null,null,null,null,null,null,null,null,null,294,"000000000","(All)","04","02",null,null,"0402","000000000 - (All)"]
[null,null,null,null,null,null,null,null,null,null,null,null,null,295,"000002366","CHECCA","04","02","05","02","0402","000002366 - CHECCA"]
[null,null,null,null,null,null,null,null,null,null,null,null,null,296,"000007700","EL DESCANSO","04","02","05","03","0402","000007700 - EL DESCANSO"]
[null,null,null,null,null,null,null,null,null,null,null,null,null,297,"000002369","LANGUI","04","02","05","04","0402","000002369 - LANGUI"]
[null,null,null,null,null,null,null,null,null,null,null,null,null,298,"000002370","CONDEVILUYO","04","02","05","04","0402","000002370 - CONDEVILUYO"]
[null,null,null,null,null,null,null,null,null,null,null,null,null,299,"000002371","LAYO","04","02","05","05","0402","000002371 - LAYO"]
[null,null,null,null,null,null,null,null,null,null,null,null,null,300,"000000000","(All)","04","03",null,null,"0403","000000000 - (All)"]
[null,null,null,null,null,null,null,null,null,null,null,null,null,301,"000002320","MOSOCLLACTA","04","03","02","04","0403","000002320 - MOSOCLLACTA"]
[null,null,null,null,null,null,null,null,null,null,null,null,null,302,"000034929","CHECACUPE","04","03","06","02","0403","000034929 - CHECACUPE"]
[null,null,null,null,null,null,null,null,null,null,null,null,null,303,"000002386","COMBAPATA CANCHIS","04","03","06","03","0403","000002386 - COMBAPATA CANCHIS"]
[null,null,null,null,null,null,null,null,null,null,null,null,null,304,"000034448","CHIARA","04","03","06","03","0403","000034448 - CHIARA"]
[null,null,null,null,null,null,null,null,null,null,null,null,null,305,"000034887","PITUMARCA","04","03","06","05","0403","000034887 - PITUMARCA"]
[null,null,null,null,null,null,null,null,null,null,null,null,null,306,"000002397","TINTA","04","03","06","08","0403","000002397 - TINTA"]
[null,null,null,null,null,null,null,null,null,null,null,null,null,307,"000000000","(All)","04","04",null,null,"0404","000000000 - (All)"]
[null,null,null,null,null,null,null,null,null,null,null,null,null,308,"000002379","HERCCA","04","04","06","01","0404","000002379 - HERCCA"]
[null,null,null,null,null,null,null,null,null,null,null,null,null,{"$f":"+N332+1","v":309},"000002380","TECHO OBRERO","04","04","06","01","0404","000002380 - TECHO OBRERO"]
[null,null,null,null,null,null,null,null,null,null,null,null,null,310,"000010063","ESSALUD SICUANI","04","04","06","01","0404","000010063 - ESSALUD SICUANI"]
[null,null,null,null,null,null,null,null,null,null,null,null,null,311,"000024639","INPE SICUANI","04","04","06","01","0404","000024639 - INPE SICUANI"]
[null,null,null,null,null,null,null,null,null,null,null,null,null,312,"000024663","SANIDAD PNP  SICUANI","04","04","06","01","0404","000024663 - SANIDAD PNP  SICUANI"]
[null,null,null,null,null,null,null,null,null,null,null,null,null,313,"000002388","MARANGANI","04","04","06","04","0404","000002388 - MARANGANI"]
[null,null,null,null,null,null,null,null,null,null,null,null,null,314,"000002389","CHECTUYOC","04","04","06","04","0404","000002389 - CHECTUYOC"]
[null,null,null,null,null,null,null,null,null,null,null,null,null,315,"000002390","CCUYO","04","04","06","04","0404","000002390 - CCUYO"]
[null,null,null,null,null,null,null,null,null,null,null,null,null,316,"000002391","OCCOBAMBA MARANGANI","04","04","06","04","0404","000002391 - OCCOBAMBA MARANGANI"]
[null,null,null,null,null,null,null,null,null,null,null,null,null,317,"000000000","(All)","04","05",null,null,"0405","000000000 - (All)"]
[null,null,null,null,null,null,null,null,null,null,null,null,null,318,"000002381","QUEHUAR","04","05","06","01","0405","000002381 - QUEHUAR"]
[null,null,null,null,null,null,null,null,null,null,null,null,null,319,"000002382","UZCUPATA","04","05","06","01","0405","000002382 - UZCUPATA"]
[null,null,null,null,null,null,null,null,null,null,null,null,null,320,"000002383","LA FLORIDA","04","05","06","01","0405","000002383 - LA FLORIDA"]
[null,null,null,null,null,null,null,null,null,null,null,null,null,321,"000026387","MENTAL COMUNITARIO SICUANI","04","05","06","01","0405","000026387 - MENTAL COMUNITARIO SICUANI"]
[null,null,null,null,null,null,null,null,null,null,null,null,null,322,"000032923","SR DE PAMPACUCHO-SICUANI","04","05","06","01","0405","000032923 - SR DE PAMPACUCHO-SICUANI"]
[null,null,null,null,null,null,null,null,null,null,null,null,null,323,"000035845","PAMPAPHALLA","04","05","06","01","0405","000035845 - PAMPAPHALLA"]
[null,null,null,null,null,null,null,null,null,null,null,null,null,324,"000035848","MENTAL COMUNITARIO SICUANI","04","05","06","01",{"$f":"CONCATENATE(Q348,R348)","v":"0405"},{"$f":"CONCATENATE(O348,\" - \",P348)","v":"000035848 - MENTAL COMUNITARIO SICUANI"}]
[null,null,null,null,null,null,null,null,null,null,null,null,null,325,"000002393","PHINAYA","04","05","06","05","0405","000002393 - PHINAYA"]
[null,null,null,null,null,null,null,null,null,null,null,null,null,326,"000002394","SAN PABLO CANCHIS","04","05","06","06","0405","000002394 - SAN PABLO CANCHIS"]
[null,null,null,null,null,null,null,null,null,null,null,null,null,327,"000002395","SANTA BARBARA","04","05","06","06","0405","000002395 - SANTA BARBARA"]
[null,null,null,null,null,null,null,null,null,null,null,null,null,328,"000002396","SAN PEDRO CANCHIS","04","05","06","07","0405","000002396 - SAN PEDRO CANCHIS"]
[null,null,null,null,null,null,null,null,null,null,null,null,null,329,"000000000","(All)","04","06",null,null,"0406","000000000 - (All)"]
[null,null,null,null,null,null,null,null,null,null,null,null,null,330,"000002410","YAURI","04","06","08","01","0406","000002410 - YAURI"]
[null,null,null,null,null,null,null,null,null,null,null,null,null,331,"000006745","TINTAYA MARQUIRI","04","06","08","01","0406","000006745 - TINTAYA MARQUIRI"]
[null,null,null,null,null,null,null,null,null,null,null,null,null,332,"000010061","ESPINAR - ESSALUD","04","06","08","01","0406","000010061 - ESPINAR - ESSALUD"]
[null,null,null,null,null,null,null,null,null,null,null,null,null,333,"000030366","MENTAL COMUNITARIO ESPINAR \"MUSUQ KAWSAY\"","04","06","08","01","0406","000030366 - MENTAL COMUNITARIO ESPINAR \"MUSUQ KAWSAY\""]
[null,null,null,null,null,null,null,null,null,null,null,null,null,334,"000002411","CONDOROMA","04","06","08","02","0406","000002411 - CONDOROMA"]
[null,null,null,null,null,null,null,null,null,null,null,null,null,335,"000002412","COPORAQUE","04","06","08","03","0406","000002412 - COPORAQUE"]
[null,null,null,null,null,null,null,null,null,null,null,null,null,336,"000002413","URINSAYA","04","06","08","03","0406","000002413 - URINSAYA"]
[null,null,null,null,null,null,null,null,null,null,null,null,null,337,"000002414","HUAYHUAHUASI","04","06","08","03","0406","000002414 - HUAYHUAHUASI"]
[null,null,null,null,null,null,null,null,null,null,null,null,null,338,"000002415","OCCORURO","04","06","08","04","0406","000002415 - OCCORURO"]
[null,null,null,null,null,null,null,null,null,null,null,null,null,339,"000002416","PALLPATA","04","06","08","05","0406","000002416 - PALLPATA"]
[null,null,null,null,null,null,null,null,null,null,null,null,null,340,"000002418","SAN MIGUEL","04","06","08","06","0406","000002418 - SAN MIGUEL"]
[null,null,null,null,null,null,null,null,null,null,null,null,null,341,"000034450","PICHIGUA ESPINAR","04","06","08","06","0406","000034450 - PICHIGUA ESPINAR"]
[null,null,null,null,null,null,null,null,null,null,null,null,null,342,"000002419","SUYKUTAMBO","04","06","08","07","0406","000002419 - SUYKUTAMBO"]
[null,null,null,null,null,null,null,null,null,null,null,null,null,343,"000002420","ACCOCUNCA","04","06","08","08","0406","000002420 - ACCOCUNCA"]
[null,null,null,null,null,null,null,null,null,null,null,null,null,344,"999999999","(All)","04","99",null,null,"0499","999999999 - (All)"]
[null,null,null,null,null,null,null,null,null,null,null,null,null,345,"000002469","SAN JUAN DE KIMBIRI-VRAEM","05","00","09","07","0500","000002469 - SAN JUAN DE KIMBIRI-VRAEM"]
[null,null,null,null,null,null,null,null,null,null,null,null,null,346,"000000000","(All)","05","01",null,null,"0501","000000000 - (All)"]
[null,null,null,null,null,null,null,null,null,null,null,null,null,347,"000002472","MAPITUNARI","05","01","09","07","0501","000002472 - MAPITUNARI"]
[null,null,null,null,null,null,null,null,null,null,null,null,null,348,"000002474","SAMANIATO","05","01","09","07","0501","000002474 - SAMANIATO"]
[null,null,null,null,null,null,null,null,null,null,null,null,null,349,"000002475","KIMBIRI ALTO","05","01","09","07","0501","000002475 - KIMBIRI ALTO"]
[null,null,null,null,null,null,null,null,null,null,null,null,null,350,"000008285","ANGELES","05","01","09","07","0501","000008285 - ANGELES"]
[null,null,null,null,null,null,null,null,null,null,null,null,null,351,"000002479","VILLA VIRGEN","05","01","09","12","0501","000002479 - VILLA VIRGEN"]
[null,null,null,null,null,null,null,null,null,null,null,null,null,352,"000024957","BTC LA OROYA  N°34 VILLA VIRGEN","05","01","09","12","0501","000024957 - BTC LA OROYA  N°34 VILLA VIRGEN"]
[null,null,null,null,null,null,null,null,null,null,null,null,null,353,"000002488","VILLA KINTIARINA","05","01","09","13","0501","000002488 - VILLA KINTIARINA"]
[null,null,null,null,null,null,null,null,null,null,null,null,null,354,"000008283","PUEBLO LIBRE","05","01","09","13","0501","000008283 - PUEBLO LIBRE"]
[null,null,null,null,null,null,null,null,null,null,null,null,null,355,"000002470","CHIRUMPIARI","05","01","09","16","0501","000002470 - CHIRUMPIARI"]
[null,null,null,null,null,null,null,null,null,null,null,null,null,356,"000002471","LOBO TAHUANTINSUYO","05","01","09","17","0501","000002471 - LOBO TAHUANTINSUYO"]
[null,null,null,null,null,null,null,null,null,null,null,null,null,357,"000002473","UNION ROSALES","05","01","09","17","0501","000002473 - UNION ROSALES"]
[null,null,null,null,null,null,null,null,null,null,null,null,null,358,"000008284","MANITEA ALTA","05","01","09","17","0501","000008284 - MANITEA ALTA"]
[null,null,null,null,null,null,null,null,null,null,null,null,null,359,"000000000","(All)","05","02",null,null,"0502","000000000 - (All)"]
[null,null,null,null,null,null,null,null,null,null,null,null,null,360,"000002496","OMAYA","05","02","09","10","0502","000002496 - OMAYA"]
[null,null,null,null,null,null,null,null,null,null,null,null,null,361,"000002497","OTARI","05","02","09","10","0502","000002497 - OTARI"]
[null,null,null,null,null,null,null,null,null,null,null,null,null,362,"000002498","PUERTO MAYO","05","02","09","10","0502","000002498 - PUERTO MAYO"]
[null,null,null,null,null,null,null,null,null,null,null,null,null,363,"000007113","NATIVIDAD","05","02","09","10","0502","000007113 - NATIVIDAD"]
[null,null,null,null,null,null,null,null,null,null,null,null,null,364,"000007114","QUISTO CENTRAL","05","02","09","10","0502","000007114 - QUISTO CENTRAL"]
[null,null,null,null,null,null,null,null,null,null,null,null,null,365,"000015104","TAMBO DEL ENE","05","02","09","10","0502","000015104 - TAMBO DEL ENE"]
[null,null,null,null,null,null,null,null,null,null,null,null,null,366,"000015170","PICHARI BAJA","05","02","09","10","0502","000015170 - PICHARI BAJA"]
[null,null,null,null,null,null,null,null,null,null,null,null,null,367,"000024638","MILITAR PICHARI","05","02","09","10","0502","000024638 - MILITAR PICHARI"]
[null,null,null,null,null,null,null,null,null,null,null,null,null,368,"000027230","MEDICA POLICIAL PICHARI","05","02","09","10","0502","000027230 - MEDICA POLICIAL PICHARI"]
[null,null,null,null,null,null,null,null,null,null,null,null,null,369,"000027948","ESSALUD PICHARI","05","02","09","10","0502","000027948 - ESSALUD PICHARI"]
[null,null,null,null,null,null,null,null,null,null,null,null,null,370,"000032211","NUEVO PROGRESO","05","02","09","10","0502","000032211 - NUEVO PROGRESO"]
[null,null,null,null,null,null,null,null,null,null,null,null,null,371,"000033988","MENTAL COMUNITARIO PICHARI","05","02","09","10","0502","000033988 - MENTAL COMUNITARIO PICHARI"]
[null,null,null,null,null,null,null,null,null,null,null,null,null,372,"000034418","PICHARI VRAEM","05","02","09","10","0502","000034418 - PICHARI VRAEM"]
[null,null,null,null,null,null,null,null,null,null,null,null,null,{"$f":"+N396+1","v":373},"000024637","EJERCITO-INCAHUASI 331","05","02","09","10","0502","000024637 - EJERCITO-INCAHUASI 331"]
[null,null,null,null,null,null,null,null,null,null,null,null,null,374,"000034417","CAP I ECHARATE - KITENI","05","02","09","10","0502","000034417 - CAP I ECHARATE - KITENI"]
[null,null,null,null,null,null,null,null,null,null,null,null,null,375,"000002495","MANTARO","05","02","09","18","0502","000002495 - MANTARO"]
[null,null,null,null,null,null,null,null,null,null,null,null,null,376,"000015169","PITIRINQUINI","05","02","09","18","0502","000015169 - PITIRINQUINI"]
[null,null,null,null,null,null,null,null,null,null,null,null,null,377,"999999999","(All)","05","99",null,null,"0599","999999999 - (All)"]
[null,null,null,null,null,null,null,null,null,null,null,null,null,378,"000002398","SANTO TOMAS","06","00","07","01","0600","000002398 - SANTO TOMAS"]
[null,null,null,null,null,null,null,null,null,null,null,null,null,379,"000000000","(All)","06","01",null,null,"0601","000000000 - (All)"]
[null,null,null,null,null,null,null,null,null,null,null,null,null,380,"000035864","CANGALLE","06","01","07","01","0601","000035864 - CANGALLE"]
[null,null,null,null,null,null,null,null,null,null,null,null,null,381,"000002402","CHAMACA","06","01","07","03","0601","000002402 - CHAMACA"]
[null,null,null,null,null,null,null,null,null,null,null,null,null,382,"000002403","AÑAHUICHI","06","01","07","03","0601","000002403 - AÑAHUICHI"]
[null,null,null,null,null,null,null,null,null,null,null,null,null,383,"000016328","UCCHUCCARCCO","06","01","07","03","0601","000016328 - UCCHUCCARCCO"]
[null,null,null,null,null,null,null,null,null,null,null,null,null,384,"000016329","INGATA","06","01","07","03","0601","000016329 - INGATA"]
[null,null,null,null,null,null,null,null,null,null,null,null,null,385,"000016330","CCONCHACCOLLO","06","01","07","03","0601","000016330 - CCONCHACCOLLO"]
[null,null,null,null,null,null,null,null,null,null,null,null,null,386,"000035861","CCACHO","06","01","07","03","0601","000035861 - CCACHO"]
[null,null,null,null,null,null,null,null,null,null,null,null,null,387,"000035863","TINCURCA","06","01","07","03","0601","000035863 - TINCURCA"]
[null,null,null,null,null,null,null,null,null,null,null,null,null,388,"000002406","LIVITACA","06","01","07","05","0601","000002406 - LIVITACA"]
[null,null,null,null,null,null,null,null,null,null,null,null,null,389,"000016325","CHILLOROYA - LIVITACA","06","01","07","05","0601","000016325 - CHILLOROYA - LIVITACA"]
[null,null,null,null,null,null,null,null,null,null,null,null,null,390,"000016327","AUSANTA","06","01","07","05","0601","000016327 - AUSANTA"]
[null,null,null,null,null,null,null,null,null,null,null,null,null,391,"000016332","PATAQUEÑA - LIVITACA","06","01","07","05","0601","000016332 - PATAQUEÑA - LIVITACA"]
[null,null,null,null,null,null,null,null,null,null,null,null,null,392,"000016334","KISIO","06","01","07","05","0601","000016334 - KISIO"]
[null,null,null,null,null,null,null,null,null,null,null,null,null,393,"000025739","PISQUICOCHA","06","01","07","05","0601","000025739 - PISQUICOCHA"]
[null,null,null,null,null,null,null,null,null,null,null,null,null,394,"000025740","TOTORA - REYNA DE LOS ANGELES","06","01","07","05","0601","000025740 - TOTORA - REYNA DE LOS ANGELES"]
[null,null,null,null,null,null,null,null,null,null,null,null,null,395,"000035860","KAYNO","06","01","07","05",{"$f":"CONCATENATE(Q419,R419)","v":"0601"},{"$f":"CONCATENATE(O419,\" - \",P419)","v":"000035860 - KAYNO"}]
[null,null,null,null,null,null,null,null,null,null,null,null,null,396,"000035862","SANTA ISABEL JALCCO","06","01","07","05","0601","000035862 - SANTA ISABEL JALCCO"]
[null,null,null,null,null,null,null,null,null,null,null,null,null,397,"000000000","(All)","06","09",null,null,"0609","000000000 - (All)"]
[null,null,null,null,null,null,null,null,null,null,null,null,null,398,"000002399","PULPERA","06","09","07","01","0609","000002399 - PULPERA"]
[null,null,null,null,null,null,null,null,null,null,null,null,null,399,"000002400","ALHUACCHULLO","06","09","07","01","0609","000002400 - ALHUACCHULLO"]
[null,null,null,null,null,null,null,null,null,null,null,null,null,400,"000006746","LLIQUE","06","09","07","01","0609","000006746 - LLIQUE"]
[null,null,null,null,null,null,null,null,null,null,null,null,null,401,"000006981","CCOYO","06","09","07","01","0609","000006981 - CCOYO"]
[null,null,null,null,null,null,null,null,null,null,null,null,null,402,"000006982","MELLOTOTORA","06","09","07","01","0609","000006982 - MELLOTOTORA"]
[null,null,null,null,null,null,null,null,null,null,null,null,null,403,"000006983","ORCCOMA","06","09","07","01","0609","000006983 - ORCCOMA"]
[null,null,null,null,null,null,null,null,null,null,null,null,null,404,"000007111","YAVINA","06","09","07","01","0609","000007111 - YAVINA"]
[null,null,null,null,null,null,null,null,null,null,null,null,null,405,"000008915","PFULLPURI CONDEPAMPA","06","09","07","01","0609","000008915 - PFULLPURI CONDEPAMPA"]
[null,null,null,null,null,null,null,null,null,null,null,null,null,406,"000013185","CAP I SANTO TOMÁS  ESSALUD","06","09","07","01","0609","000013185 - CAP I SANTO TOMÁS  ESSALUD"]
[null,null,null,null,null,null,null,null,null,null,null,null,null,407,"000030940","ARCANGEL SAN MIGUEL DE ESQUINA CONGUNYA","06","09","07","01","0609","000030940 - ARCANGEL SAN MIGUEL DE ESQUINA CONGUNYA"]
[null,null,null,null,null,null,null,null,null,null,null,null,null,408,"000002401","CCAPACMARCA","06","09","07","02","0609","000002401 - CCAPACMARCA"]
[null,null,null,null,null,null,null,null,null,null,null,null,null,409,"000009963","CANCAHUANI","06","09","07","02","0609","000009963 - CANCAHUANI"]
[null,null,null,null,null,null,null,null,null,null,null,null,null,410,"000027009","TAHUAY","06","09","07","02","0609","000027009 - TAHUAY"]
[null,null,null,null,null,null,null,null,null,null,null,null,null,411,"000002404","COLQUEMARCA","06","09","07","04","0609","000002404 - COLQUEMARCA"]
[null,null,null,null,null,null,null,null,null,null,null,null,null,412,"000002405","CHARAMURAY","06","09","07","04","0609","000002405 - CHARAMURAY"]
[null,null,null,null,null,null,null,null,null,null,null,null,null,413,"000008913","HUARACO","06","09","07","04","0609","000008913 - HUARACO"]
[null,null,null,null,null,null,null,null,null,null,null,null,null,414,"000008914","HUAYLLANI","06","09","07","04","0609","000008914 - HUAYLLANI"]
[null,null,null,null,null,null,null,null,null,null,null,null,null,415,"000012932","YANQUE","06","09","07","04","0609","000012932 - YANQUE"]
[null,null,null,null,null,null,null,null,null,null,null,null,null,416,"000002407","LLUSCO","06","09","07","06","0609","000002407 - LLUSCO"]
[null,null,null,null,null,null,null,null,null,null,null,null,null,417,"000006747","LUTTO","06","09","07","06","0609","000006747 - LUTTO"]
[null,null,null,null,null,null,null,null,null,null,null,null,null,418,"000006748","COLLPA","06","09","07","06","0609","000006748 - COLLPA"]
[null,null,null,null,null,null,null,null,null,null,null,null,null,419,"000006985","TOTORAPALLCA","06","09","07","06","0609","000006985 - TOTORAPALLCA"]
[null,null,null,null,null,null,null,null,null,null,null,null,null,420,"000027008","ANTUYO","06","09","07","06","0609","000027008 - ANTUYO"]
[null,null,null,null,null,null,null,null,null,null,null,null,null,421,"000002408","QUIÑOTA","06","09","07","07","0609","000002408 - QUIÑOTA"]
[null,null,null,null,null,null,null,null,null,null,null,null,null,422,"000006984","CCOLLANA","06","09","07","07","0609","000006984 - CCOLLANA"]
[null,null,null,null,null,null,null,null,null,null,null,null,null,423,"000007112","YORENCCA","06","09","07","07","0609","000007112 - YORENCCA"]
[null,null,null,null,null,null,null,null,null,null,null,null,null,424,"000025369","PUMALLACTA","06","09","07","07","0609","000025369 - PUMALLACTA"]
[null,null,null,null,null,null,null,null,null,null,null,null,null,425,"000002409","VELILLE","06","09","07","08","0609","000002409 - VELILLE"]
[null,null,null,null,null,null,null,null,null,null,null,null,null,426,"000008912","ALCCA VICTORIA","06","09","07","08","0609","000008912 - ALCCA VICTORIA"]
[null,null,null,null,null,null,null,null,null,null,null,null,null,427,"000025371","TUNTUMA","06","09","07","08","0609","000025371 - TUNTUMA"]
[null,null,null,null,null,null,null,null,null,null,null,null,null,428,"000027011","AYACCASI","06","09","07","08","0609","000027011 - AYACCASI"]
[null,null,null,null,null,null,null,null,null,null,null,null,null,429,"000027016","HUAYCUÑUTA - URCURUTA","06","09","07","08","0609","000027016 - HUAYCUÑUTA - URCURUTA"]
[null,null,null,null,null,null,null,null,null,null,null,null,null,430,"999999999","(All)","99","99",null,null,"9999","999999999 - (All)"]

{"sheet":"TBC0011","index":3,"n_rows":94,"n_cols":49,"rows_kept":94,"cut":false,"hidden":false,"merged":[[1,1,1,11],[21,1,21,4],[21,6,21,7],[22,1,22,3],[22,4,23,4],[22,6,22,7],[23,6,24,6],[8,2,8,3],[9,2,9,3],[14,2,14,3],[15,2,15,3],[2,1,2,12],[9,6,9,9],[10,2,10,3],[11,2,11,3],[11,6,11,7],[34,1,34,2],[34,6,34,7],[25,6,25,7],[26,1,26,3],[26,6,26,8],[27,1,27,2],[27,6,27,8],[28,1,28,2],[29,1,29,2],[30,1,30,2],[32,1,32,2],[33,1,33,2],[33,6,33,7],[35,1,35,2],[35,6,35,7],[40,1,40,2],[40,8,40,9],[41,1,41,2],[41,8,41,9],[42,1,42,2],[42,8,42,9],[43,1,44,2],[43,8,43,9],[45,1,45,2],[45,8,45,9],[61,1,61,2],[46,1,47,2],[46,4,47,5],[53,4,53,5],[53,9,53,10],[54,7,55,7],[54,9,54,10],[55,9,55,10],[56,7,57,7],[56,9,56,10],[57,9,57,10],[58,1,58,2],[58,4,58,6],[62,1,65,1],[62,2,63,2],[62,5,65,5],[64,2,65,2],[66,1,67,1],[66,3,67,3],[66,5,67,5],[68,2,68,4],[69,2,69,4],[81,1,82,1],[81,2,81,11],[81,12,82,12],[3,1,3,12],[12,2,12,3],[13,2,13,3],[5,2,5,3],[5,6,5,7],[6,2,6,3],[7,2,7,3],[7,6,7,9]]}
[]
[]
[null,"REPORTE MENSUAL DE ACTIVIDADES DE PREVENCION Y CONTROL DE TUBERCULOSIS  [00-11]"]
[null,"CURSO DE VIDA : NIÑO"]
[]
[null,"DIRESA","CUSCO",null,null,"REGION","CUSCO"]
[]
[null,"RED DE SALUD ",{"$f":"+TABLAS!O9","v":"03 - LA CONVENCION"},null,null,"EJECUTORA",{"$f":"+TABLAS!O14","v":""}]
[]
[null,"MICRO RED",{"$f":"+TABLAS!O10","v":""},null,null,"RESPONSABLE"]
[]
[null,"EE.SS.",{"$f":"+TABLAS!O11","v":""},null,null,"COD. RENAES",{"$f":"+TABLAS!Q11","v":""}]
[]
[null,"PROVINCIA",{"$f":"+TABLAS!O12","v":""},null,null,"AÑO",{"$f":"+TABLAS!J16","v":"2025"}]
[]
[null,"DISTRITO",{"$f":"+TABLAS!O13","v":""},null,null,"MES",{"$f":"+TABLAS!N26","v":"ENE - MAR"}]
[]
[null,"INSTITUCION :  MINSA (  X  )   ESSALUD (     )   FFAA  (     )   PNP  (     )   INPE  (     )   OTROS  (     )"]
[]
[null,"I. ACTIVIDADES DE DETECCION Y DIAGNOSTICO PARA TUBERCULOSIS"]
[]
[null,"DETECCIÓN DE CASOS",null,null,null,null,"RECOLECCIÓN DE MUESTRAS PARA EXAMEN BACTERIOLÓGICO",null,"N°",null,null,null,null,null,null,null,null,null,null,null,null,null,null,null,null,null,null,null,null,null,null,null,null,null,null,"\";TABLAS!$A$281)"]
[null,"Sintomático respiratorio (SR)",null,null,"Caso probable de TB",null,"RECOLECCIÓN DE MUESTRAS PARA TB*",null,{"$f":"+GETPIVOTDATA(\" BAS001\",TABLAS!$A$59)","v":60},null,null,null,null,null,null,null,1,null,null,null,null,null,null,null,null,null,null,null,{"$f":"IF(LEN(Q23)=1,CONCATENATE(\"00\",Q23),IF(LEN(Q23)=2,CONCATENATE(\"0\",Q23),Q23))","v":"001"},null,null,null,null,null,"=+IMPORTARDATOSDINAMICOS(\" BAS",null,null,null,null,{"$f":"$AI$23&AC23&$AJ$22","v":"=+IMPORTARDATOSDINAMICOS(\" BAS001\";TABLAS!$A$281)"}]
[null,"SR Identificado","SR Examinado","SR examinados con bacteriología confirmada",null,null,"PROCEDIMIENTOS ESPECIALES PARA OBTENCION DE MUESTRAS","Lavado gástrico",{"$f":"+GETPIVOTDATA(\" BAS002\",TABLAS!$A$59)","v":0},null,null,null,null,null,null,null,{"$f":"+Q23+1","v":2},null,null,null,null,null,null,null,null,null,null,null,"002",null,null,null,null,null,null,null,null,null,null,{"$f":"$AI$23&AC24&$AJ$22","v":"=+IMPORTARDATOSDINAMICOS(\" BAS002\";TABLAS!$A$281)"}]
[null,{"$f":"M92","v":19},{"$f":"M93","v":16},{"$f":"M94","v":0},{"$f":"M91","v":0},null,null,"Inducción del esputo",{"$f":"+GETPIVOTDATA(\" BAS003\",TABLAS!$A$59)","v":0},null,null,null,null,null,null,null,{"$f":"+Q24+1","v":3},null,null,null,null,null,null,null,null,null,null,null,"003",null,null,null,null,null,null,null,null,null,null,"=+IMPORTARDATOSDINAMICOS(\" BAS003\";TABLAS!$A$281)"]
[null,null,null,null,null,null,"TOTAL",null,{"$f":"SUM(I23+I24+I25)","v":60}]
[null,"SR examinados con bacteriología confirmada",null,null,null,null,"*Muestra recolectada por expectoración espontánea"]
[null,"Por baciloscopia",null,{"$f":"+GETPIVOTDATA(\" BAS004\",TABLAS!$A$59)","v":0},null,null,"REFERENCIAS",null,null,null,null,null,null,null,null,null,{"$f":"+Q25+1","v":4},null,null,null,null,null,null,null,null,null,null,null,{"$f":"IF(LEN(Q28)=1,CONCATENATE(\"00\",Q28),IF(LEN(Q28)=2,CONCATENATE(\"0\",Q28),Q28))","v":"004"},null,null,null,null,null,null,null,null,null,null,{"$f":"$AI$23&AC28&$AJ$22","v":"=+IMPORTARDATOSDINAMICOS(\" BAS004\";TABLAS!$A$281)"}]
[null,"Por prueba molecular",null,{"$f":"+GETPIVOTDATA(\" BAS005\",TABLAS!$A$59)","v":0},null,null,"Condición","Derivaciones","Transferencias",null,null,null,null,null,null,null,{"$f":"+Q28+1","v":5},null,null,{"$f":"+Q30+1","v":7},{"$f":"+T29+1","v":8},null,null,null,null,null,null,null,"005",null,null,{"$f":"IF(LEN(T29)=1,CONCATENATE(\"00\",T29),IF(LEN(T29)=2,CONCATENATE(\"0\",T29),T29))","v":"007"},{"$f":"IF(LEN(U29)=1,CONCATENATE(\"00\",U29),IF(LEN(U29)=2,CONCATENATE(\"0\",U29),U29))","v":"008"},null,null,null,null,null,null,"=+IMPORTARDATOSDINAMICOS(\" BAS005\";TABLAS!$A$281)",null,null,{"$f":"$AI$23&AF29&$AJ$22","v":"=+IMPORTARDATOSDINAMICOS(\" BAS007\";TABLAS!$A$281)"},{"$f":"$AI$23&AG29&$AJ$22","v":"=+IMPORTARDATOSDINAMICOS(\" BAS008\";TABLAS!$A$281)"}]
[null,"Por cultivo",null,{"$f":"+GETPIVOTDATA(\" BAS006\",TABLAS!$A$59)","v":0},null,null,"Realizadas",{"$f":"+GETPIVOTDATA(\" BAS007\",TABLAS!$A$59)","v":0},{"$f":"+GETPIVOTDATA(\" BAS008\",TABLAS!$A$59)","v":0},null,null,null,null,null,null,null,{"$f":"+Q29+1","v":6},null,null,{"$f":"+U29+1","v":9},{"$f":"+T30+1","v":10},null,null,null,null,null,null,null,"006",null,null,"009","010",null,null,null,null,null,null,"=+IMPORTARDATOSDINAMICOS(\" BAS006\";TABLAS!$A$281)",null,null,"=+IMPORTARDATOSDINAMICOS(\" BAS009\";TABLAS!$A$281)","=+IMPORTARDATOSDINAMICOS(\" BAS010\";TABLAS!$A$281)"]
[null,"TOTAL",null,{"$f":"SUM(D28+D29+D30)","v":0},null,null,"Aceptadas",{"$f":"+GETPIVOTDATA(\" BAS009\",TABLAS!$A$59)","v":0},{"$f":"+GETPIVOTDATA(\" BAS010\",TABLAS!$A$59)","v":0}]
[null,null,null,null,null,null,"TOTAL",{"$f":"SUM(H30+H31)","v":0},{"$f":"SUM(I30+I31)","v":0}]
[null,"COMORBILIDADES Y CONDICIONES ASOCIADAS",null,"N°"]
[null,"TB-VIH/SIDA",null,{"$f":"+GETPIVOTDATA(\" BAS011\",TABLAS!$A$59)","v":0},null,null,"TAMIZAJE DE COMORBILIDADES",null,"N°",null,null,null,null,null,null,null,{"$f":"+U30+1","v":11},null,null,null,null,null,null,null,null,null,null,null,{"$f":"IF(LEN(Q34)=1,CONCATENATE(\"00\",Q34),IF(LEN(Q34)=2,CONCATENATE(\"0\",Q34),Q34))","v":"011"},null,null,null,null,null,null,null,null,null,null,{"$f":"$AI$23&AC34&$AJ$22","v":"=+IMPORTARDATOSDINAMICOS(\" BAS011\";TABLAS!$A$281)"}]
[null,"TB-DM",null,{"$f":"+GETPIVOTDATA(\" BAS012\",TABLAS!$A$59)","v":0},null,null,"Tamizaje TB-VIH",null,{"$f":"+GETPIVOTDATA(\" BAS014\",TABLAS!$A$59)","v":0},null,null,null,null,null,null,null,{"$f":"+Q34+1","v":12},null,{"$f":"+Q36+1","v":14},null,null,null,null,null,null,null,null,null,"012",null,{"$f":"IF(LEN(S35)=1,CONCATENATE(\"00\",S35),IF(LEN(S35)=2,CONCATENATE(\"0\",S35),S35))","v":"014"},null,null,null,null,null,null,null,null,"=+IMPORTARDATOSDINAMICOS(\" BAS012\";TABLAS!$A$281)",null,{"$f":"$AI$23&AE35&$AJ$22","v":"=+IMPORTARDATOSDINAMICOS(\" BAS014\";TABLAS!$A$281)"}]
[null,"Reacción adversa a medicamentos para TB",null,{"$f":"+GETPIVOTDATA(\" BAS013\",TABLAS!$A$59)","v":0},null,null,"Tamizaje TB-DM",null,{"$f":"+GETPIVOTDATA(\" BAS015\",TABLAS!$A$59)","v":0},null,null,null,null,null,null,null,13,null,{"$f":"+S35+1","v":15},null,null,null,null,null,null,null,null,null,"013",null,"015",null,null,null,null,null,null,null,null,"=+IMPORTARDATOSDINAMICOS(\" BAS013\";TABLAS!$A$281)",null,"=+IMPORTARDATOSDINAMICOS(\" BAS015\";TABLAS!$A$281)"]
[]
[]
[null,"II. ACTIVIDADES PARA LA RECUPERACION DE LA PERSONA AFECTADA POR TUBERCULOSIS"]
[]
[null,"ATENCIÓN MULTIDISCIPLINARIA",null,"MODALIDAD","EN PAT CON TB SENSIBLE","EN PAT CON TB RESISTENTE","TOTAL",null,2,null,"N°"]
[null,"Evaluación médica",null,null,{"$f":"+GETPIVOTDATA(\" BAS016\",TABLAS!$A$59)","v":1},{"$f":"+GETPIVOTDATA(\" BAS017\",TABLAS!$A$59)","v":0},{"$f":"SUM(E42+F42)","v":1},null,"Administración de tratamiento para TB sensible",null,{"$f":"+GETPIVOTDATA(\" BAS028\",TABLAS!$A$59)","v":152},null,null,null,null,null,{"$f":"+S36+1","v":16},{"$f":"+Q42+1","v":17},null,null,null,{"$f":"+Q48+1","v":28},null,null,null,null,null,null,{"$f":"IF(LEN(Q42)=1,CONCATENATE(\"00\",Q42),IF(LEN(Q42)=2,CONCATENATE(\"0\",Q42),Q42))","v":"016"},"017",null,null,null,{"$f":"IF(LEN(V42)=1,CONCATENATE(\"00\",V42),IF(LEN(V42)=2,CONCATENATE(\"0\",V42),V42))","v":"028"},null,null,null,null,null,{"$f":"$AI$23&AC42&$AJ$22","v":"=+IMPORTARDATOSDINAMICOS(\" BAS016\";TABLAS!$A$281)"},{"$f":"$AI$23&AD42&$AJ$22","v":"=+IMPORTARDATOSDINAMICOS(\" BAS017\";TABLAS!$A$281)"},null,null,null,{"$f":"$AI$23&AH42&$AJ$22","v":"=+IMPORTARDATOSDINAMICOS(\" BAS028\";TABLAS!$A$281)"}]
[null,"Atención en consultorio de enfermería",null,null,{"$f":"+GETPIVOTDATA(\" BAS018\",TABLAS!$A$59)","v":0},{"$f":"+GETPIVOTDATA(\" BAS019\",TABLAS!$A$59)","v":0},{"$f":"SUM(E43+F43)","v":0},null,"Administración de tratamiento para TB resistente",null,{"$f":"+GETPIVOTDATA(\" BAS029\",TABLAS!$A$59)","v":0},null,null,null,null,null,{"$f":"+R42+1","v":18},{"$f":"+Q43+1","v":19},null,null,null,{"$f":"+V42+1","v":29},null,null,null,null,null,null,"018","019",null,null,null,"029",null,null,null,null,null,"=+IMPORTARDATOSDINAMICOS(\" BAS018\";TABLAS!$A$281)","=+IMPORTARDATOSDINAMICOS(\" BAS019\";TABLAS!$A$281)",null,null,null,"=+IMPORTARDATOSDINAMICOS(\" BAS029\";TABLAS!$A$281)"]
[null,"Atención de servicio social",null,"En el establecimiento de salud",{"$f":"+GETPIVOTDATA(\" BAS020\",TABLAS!$A$59)","v":0},{"$f":"+GETPIVOTDATA(\" BAS021\",TABLAS!$A$59)","v":0},{"$f":"SUM(E44+F44)","v":0},null,"Control de tratamiento",null,{"$f":"+GETPIVOTDATA(\" BAS030\",TABLAS!$A$59)","v":3},null,null,null,null,null,{"$f":"+R43+1","v":20},21,null,null,null,{"$f":"+V43+1","v":30},null,null,null,null,null,null,"020","021",null,null,null,"030",null,null,null,null,null,"=+IMPORTARDATOSDINAMICOS(\" BAS020\";TABLAS!$A$281)","=+IMPORTARDATOSDINAMICOS(\" BAS021\";TABLAS!$A$281)",null,null,null,"=+IMPORTARDATOSDINAMICOS(\" BAS030\";TABLAS!$A$281)"]
[null,null,null,"Mediante teleconsulta en línea",{"$f":"+GETPIVOTDATA(\" BAS022\",TABLAS!$A$59)","v":0},{"$f":"+GETPIVOTDATA(\" BAS023\",TABLAS!$A$59)","v":0},{"$f":"SUM(E45+F45)","v":0},null,null,null,null,null,null,null,null,null,22,23,null,null,null,null,null,null,null,null,null,null,"022","023",null,null,null,null,null,null,null,null,null,"=+IMPORTARDATOSDINAMICOS(\" BAS022\";TABLAS!$A$281)","=+IMPORTARDATOSDINAMICOS(\" BAS023\";TABLAS!$A$281)"]
[null,"Atención en nutrición",null,null,{"$f":"+GETPIVOTDATA(\" BAS024\",TABLAS!$A$59)","v":1},{"$f":"+GETPIVOTDATA(\" BAS025\",TABLAS!$A$59)","v":0},{"$f":"SUM(E46+F46)","v":1},null,"RETO ANTE REACCIONES ADVERSAS",null,null,null,null,null,null,null,24,25,null,null,null,null,null,null,null,null,null,null,"024","025",null,null,null,null,null,null,null,null,null,"=+IMPORTARDATOSDINAMICOS(\" BAS024\";TABLAS!$A$281)","=+IMPORTARDATOSDINAMICOS(\" BAS025\";TABLAS!$A$281)"]
[null,"Atención en salud mental",null,"En el establecimiento de salud",null,null,{"$f":"+GETPIVOTDATA(\" BAS026\",TABLAS!$A$59)","v":0},null,"Condición","N°",null,null,null,null,null,null,26,null,null,null,null,null,null,null,null,null,null,null,"026",null,null,null,null,null,null,null,null,null,null,"=+IMPORTARDATOSDINAMICOS(\" BAS026\";TABLAS!$A$281)"]
[null,null,null,"Mediante teleorientación síncrona",null,null,{"$f":"+GETPIVOTDATA(\" BAS027\",TABLAS!$A$59)","v":0},null,"Inicio",{"$f":"+GETPIVOTDATA(\" BAS031\",TABLAS!$A$59)","v":0},null,"REGISTRO EN EL PADRON DE BENEFICIARIOS PANTBC",null,null,null,null,{"$f":"+Q47+1","v":27},null,null,null,null,{"$f":"+V44+1","v":31},null,null,null,null,null,null,"027",null,null,null,null,{"$f":"IF(LEN(V48)=1,CONCATENATE(\"00\",V48),IF(LEN(V48)=2,CONCATENATE(\"0\",V48),V48))","v":"031"},null,null,null,null,null,"=+IMPORTARDATOSDINAMICOS(\" BAS027\";TABLAS!$A$281)",null,null,null,null,{"$f":"$AI$23&AH48&$AJ$22","v":"=+IMPORTARDATOSDINAMICOS(\" BAS031\";TABLAS!$A$281)"}]
[null,null,null,null,null,null,null,null,"Término",{"$f":"+GETPIVOTDATA(\" BAS032\",TABLAS!$A$59)","v":0},null,{"$f":"+GETPIVOTDATA(\" BAS033\",TABLAS!$A$59)","v":1},null,null,null,null,null,null,null,null,null,{"$f":"+V48+1","v":32},null,{"$f":"+V49+1","v":33},null,null,null,null,null,null,null,null,null,"032",null,{"$f":"IF(LEN(X49)=1,CONCATENATE(\"00\",X49),IF(LEN(X49)=2,CONCATENATE(\"0\",X49),X49))","v":"033"},null,null,null,null,null,null,null,null,"=+IMPORTARDATOSDINAMICOS(\" BAS032\";TABLAS!$A$281)",null,{"$f":"$AI$23&AJ49&$AJ$22","v":"=+IMPORTARDATOSDINAMICOS(\" BAS033\";TABLAS!$A$281)"}]
[]
[]
[null,"III. ACTIVIDADES DE PREVENCIÓN EN TUBERCULOSIS"]
[]
[null,"CENSO DE CONTACTOS","N°",null,"PRUEBA PARA DIAGNOSTICO DE TB LATENTE",null,"N°","POSITIVOS",null,"TERAPIA PREVENTIVA PARA TUBERCULOSIS LATENTE",null,"N°"]
[null,"En el establecimiento de salud",{"$f":"+GETPIVOTDATA(\" BAS034\",TABLAS!$A$59)","v":3},null,"PPD","Aplicación",{"$f":"M84","v":6},{"$f":"+GETPIVOTDATA(\" BAS037\",TABLAS!$A$59)","v":0},null,"Administración de terapia preventiva para contactos de TB sensible",null,{"$f":"+GETPIVOTDATA(\" BAS039\",TABLAS!$A$59)","v":41},null,null,null,null,{"$f":"+X49+1","v":34},null,{"$f":"+Q57+1","v":37},null,{"$f":"+S57+1","v":39},null,null,null,null,null,null,null,{"$f":"IF(LEN(Q55)=1,CONCATENATE(\"00\",Q55),IF(LEN(Q55)=2,CONCATENATE(\"0\",Q55),Q55))","v":"034"},null,{"$f":"IF(LEN(S55)=1,CONCATENATE(\"00\",S55),IF(LEN(S55)=2,CONCATENATE(\"0\",S55),S55))","v":"037"},null,{"$f":"IF(LEN(U55)=1,CONCATENATE(\"00\",U55),IF(LEN(U55)=2,CONCATENATE(\"0\",U55),U55))","v":"039"},null,null,null,null,null,null,{"$f":"$AI$23&AC55&$AJ$22","v":"=+IMPORTARDATOSDINAMICOS(\" BAS034\";TABLAS!$A$281)"},null,{"$f":"$AI$23&AE55&$AJ$22","v":"=+IMPORTARDATOSDINAMICOS(\" BAS037\";TABLAS!$A$281)"},null,{"$f":"$AI$23&AG55&$AJ$22","v":"=+IMPORTARDATOSDINAMICOS(\" BAS039\";TABLAS!$A$281)"}]
[null,"En el domicilio*",{"$f":"+GETPIVOTDATA(\" BAS035\",TABLAS!$A$59)","v":1},null,null,"Lectura",{"$f":"M85","v":4},null,null,"Administración de terapia preventiva para contactos de TB resistente",null,{"$f":"+GETPIVOTDATA(\" BAS040\",TABLAS!$A$59)","v":0},null,null,null,null,{"$f":"+Q55+1","v":35},null,null,null,{"$f":"+U55+1","v":40},null,null,null,null,null,null,null,"035",null,null,null,{"$f":"IF(LEN(U56)=1,CONCATENATE(\"00\",U56),IF(LEN(U56)=2,CONCATENATE(\"0\",U56),U56))","v":"040"},null,null,null,null,null,null,"=+IMPORTARDATOSDINAMICOS(\" BAS035\";TABLAS!$A$281)",null,null,null,"=+IMPORTARDATOSDINAMICOS(\" BAS040\";TABLAS!$A$281)"]
[null,"Mediante teleorientación síncrona",{"$f":"+GETPIVOTDATA(\" BAS036\",TABLAS!$A$59)","v":0},null,"IGRA","Aplicación",{"$f":"M86","v":0},{"$f":"+GETPIVOTDATA(\" BAS038\",TABLAS!$A$59)","v":0},null,"Administración de terapia preventiva para población vulnerable para TB",null,{"$f":"M90","v":0},null,null,null,null,{"$f":"+Q56+1","v":36},null,{"$f":"+S55+1","v":38},null,null,null,null,null,null,null,null,null,"036",null,{"$f":"IF(LEN(S57)=1,CONCATENATE(\"00\",S57),IF(LEN(S57)=2,CONCATENATE(\"0\",S57),S57))","v":"038"},null,null,null,null,null,null,null,null,"=+IMPORTARDATOSDINAMICOS(\" BAS036\";TABLAS!$A$281)",null,{"$f":"$AI$23&AE57&$AJ$22","v":"=+IMPORTARDATOSDINAMICOS(\" BAS038\";TABLAS!$A$281)"}]
[null,"Total",{"$f":"SUM(C55+C56+C57)","v":4},null,null,"Lectura",{"$f":"M87","v":0},null,null,"TOTAL",null,{"$f":"SUM(L55+L56+L57)","v":41}]
[null,"*Mediante visita familiar",null,null,"TOTAL",null,null,{"$f":"SUM(H55+H57)","v":0}]
[]
[null,"IV. ACTIVIDADES DE PROMOCIÓN DE LA SALUD EN TUBERCULOSIS"]
[null,"ACTIVIDADES",null,"MODALIDAD","N°","TOTAL"]
[null,"Consejeria para TB","Primera","Mediante visita familiar",{"$f":"+GETPIVOTDATA(\" BAS041\",TABLAS!$A$59)","v":4},{"$f":"SUM(E63+E64+E65+E66)","v":4},null,null,null,null,null,null,null,null,null,null,{"$f":"+U56+1","v":41},null,null,null,null,null,null,null,null,null,null,null,{"$f":"IF(LEN(Q63)=1,CONCATENATE(\"00\",Q63),IF(LEN(Q63)=2,CONCATENATE(\"0\",Q63),Q63))","v":"041"},null,null,null,null,null,null,null,null,null,null,{"$f":"$AI$23&AC63&$AJ$22","v":"=+IMPORTARDATOSDINAMICOS(\" BAS041\";TABLAS!$A$281)"}]
[null,null,null,"Mediante teleorientación síncrona",{"$f":"+GETPIVOTDATA(\" BAS042\",TABLAS!$A$59)","v":0},null,null,null,null,null,null,null,null,null,null,null,{"$f":"+Q63+1","v":42},null,null,null,null,null,null,null,null,null,null,null,"042",null,null,null,null,null,null,null,null,null,null,"=+IMPORTARDATOSDINAMICOS(\" BAS042\";TABLAS!$A$281)"]
[null,null,"Segunda","Mediante visita familiar",{"$f":"+GETPIVOTDATA(\" BAS043\",TABLAS!$A$59)","v":0},null,null,null,null,null,null,null,null,null,null,null,{"$f":"+Q64+1","v":43},null,null,null,null,null,null,null,null,null,null,null,"043",null,null,null,null,null,null,null,null,null,null,"=+IMPORTARDATOSDINAMICOS(\" BAS043\";TABLAS!$A$281)"]
[null,null,null,"Mediante teleorientación síncrona",{"$f":"+GETPIVOTDATA(\" BAS044\",TABLAS!$A$59)","v":0},null,null,null,null,null,null,null,null,null,null,null,44,null,null,null,null,null,null,null,null,null,null,null,"044",null,null,null,null,null,null,null,null,null,null,"=+IMPORTARDATOSDINAMICOS(\" BAS044\";TABLAS!$A$281)"]
[null,"Sesión educativa y demostrativa para TB","Primera",null,{"$f":"+GETPIVOTDATA(\" BAS045\",TABLAS!$A$59)","v":0},{"$f":"SUM(E67+E68)","v":0},null,null,null,null,null,null,null,null,null,null,45,null,null,null,null,null,null,null,null,null,null,null,"045",null,null,null,null,null,null,null,null,null,null,"=+IMPORTARDATOSDINAMICOS(\" BAS045\";TABLAS!$A$281)"]
[null,null,"Segunda",null,{"$f":"+GETPIVOTDATA(\" BAS046\",TABLAS!$A$59)","v":0},null,null,null,null,null,null,null,null,null,null,null,46,null,null,null,null,null,null,null,null,null,null,null,"046",null,null,null,null,null,null,null,null,null,null,"=+IMPORTARDATOSDINAMICOS(\" BAS046\";TABLAS!$A$281)"]
[null,"Visitas familiar",null,null,null,{"$f":"SUM(C56+E63+E65)","v":5}]
[null,"Otras consejerias",null,null,null,{"$f":"+GETPIVOTDATA(\" BAS047\",TABLAS!$A$59)","v":0},null,null,null,null,null,null,null,null,null,null,{"$f":"+Q68+1","v":47},null,null,null,null,null,null,null,null,null,null,null,{"$f":"IF(LEN(Q70)=1,CONCATENATE(\"00\",Q70),IF(LEN(Q70)=2,CONCATENATE(\"0\",Q70),Q70))","v":"047"},null,null,null,null,null,null,null,null,null,null,{"$f":"$AI$23&AC70&$AJ$22","v":"=+IMPORTARDATOSDINAMICOS(\" BAS047\";TABLAS!$A$281)"}]
[]
[]
[null,"V. ACTIVIDADES EN TELESALUD"]
[]
[null,"ACTIVIDADES","N°"]
[null,"Teleconsulta en línea",{"$f":"G45","v":0}]
[null,"Teleorientación síncrona",{"$f":"SUM(G48+C57)","v":0}]
[null,"Total",{"$f":"SUM(C76+C77+#REF!)","v":{"$error":"#REF!"}}]
[]
[null,"REPORTE DE ACTIVIDADES SEGMENTADO POR POBLACION AFECTADA Y VULNERABLE"]
[]
[null,"ACTIVIDADES","POBLACION AFECTADA Y VULNERABLE",null,null,null,null,null,null,null,null,null,"TOTAL"]
[null,null,"POBLACIÓN EN GENERAL","CONTACTOS","PERSONA VIVIENDO CON VIH/SIDA","TRABAJADOR DE SALUD","PERSONA CON DIABETES MELLITUS","PPL","PERSONA CON TERAPIA PROLONGADA CON CORTICOIDES","PERSONA CON HEMODIALISIS Y/O ENFERMEDAD RENAL CRÓNICA","PERSONAL PENITENCIARIO","OTRAS CONDICIONES DE SALUD SEGÚN NORMATIVIDAD VIGENTE"]
[null,"Aplicación de PPD",null,{"$f":"+GETPIVOTDATA(\" BAS048\",TABLAS!$A$59)","v":6},{"$f":"+GETPIVOTDATA(\" BAS049\",TABLAS!$A$59)","v":0},{"$f":"+GETPIVOTDATA(\" BAS050\",TABLAS!$A$59)","v":0},{"$f":"+GETPIVOTDATA(\" BAS051\",TABLAS!$A$59)","v":0},{"$f":"+GETPIVOTDATA(\" BAS052\",TABLAS!$A$59)","v":0},{"$f":"+GETPIVOTDATA(\" BAS053\",TABLAS!$A$59)","v":0},{"$f":"+GETPIVOTDATA(\" BAS054\",TABLAS!$A$59)","v":0},{"$f":"+GETPIVOTDATA(\" BAS055\",TABLAS!$A$59)","v":0},{"$f":"+GETPIVOTDATA(\" BAS056\",TABLAS!$A$59)","v":0},{"$f":"SUM(C84+D84+E84+F84+G84+H84+I84+J84+K84+L84)","v":6},null,null,null,{"$f":"+Q70+1","v":48},{"$f":"+Q84+1","v":49},{"$f":"+R84+1","v":50},51,52,53,54,55,56,null,null,null,{"$f":"IF(LEN(Q84)=1,CONCATENATE(\"00\",Q84),IF(LEN(Q84)=2,CONCATENATE(\"0\",Q84),Q84))","v":"048"},{"$f":"IF(LEN(R84)=1,CONCATENATE(\"00\",R84),IF(LEN(R84)=2,CONCATENATE(\"0\",R84),R84))","v":"049"},{"$f":"IF(LEN(S84)=1,CONCATENATE(\"00\",S84),IF(LEN(S84)=2,CONCATENATE(\"0\",S84),S84))","v":"050"},{"$f":"IF(LEN(T84)=1,CONCATENATE(\"00\",T84),IF(LEN(T84)=2,CONCATENATE(\"0\",T84),T84))","v":"051"},{"$f":"IF(LEN(U84)=1,CONCATENATE(\"00\",U84),IF(LEN(U84)=2,CONCATENATE(\"0\",U84),U84))","v":"052"},{"$f":"IF(LEN(V84)=1,CONCATENATE(\"00\",V84),IF(LEN(V84)=2,CONCATENATE(\"0\",V84),V84))","v":"053"},{"$f":"IF(LEN(W84)=1,CONCATENATE(\"00\",W84),IF(LEN(W84)=2,CONCATENATE(\"0\",W84),W84))","v":"054"},{"$f":"IF(LEN(X84)=1,CONCATENATE(\"00\",X84),IF(LEN(X84)=2,CONCATENATE(\"0\",X84),X84))","v":"055"},{"$f":"IF(LEN(Y84)=1,CONCATENATE(\"00\",Y84),IF(LEN(Y84)=2,CONCATENATE(\"0\",Y84),Y84))","v":"056"},null,null,{"$f":"$AI$23&AC84&$AJ$22","v":"=+IMPORTARDATOSDINAMICOS(\" BAS048\";TABLAS!$A$281)"},{"$f":"$AI$23&AD84&$AJ$22","v":"=+IMPORTARDATOSDINAMICOS(\" BAS049\";TABLAS!$A$281)"},"=+IMPORTARDATOSDINAMICOS(\" BAS050\";TABLAS!$A$281)","=+IMPORTARDATOSDINAMICOS(\" BAS051\";TABLAS!$A$281)","=+IMPORTARDATOSDINAMICOS(\" BAS052\";TABLAS!$A$281)","=+IMPORTARDATOSDINAMICOS(\" BAS053\";TABLAS!$A$281)","=+IMPORTARDATOSDINAMICOS(\" BAS054\";TABLAS!$A$281)","=+IMPORTARDATOSDINAMICOS(\" BAS055\";TABLAS!$A$281)","=+IMPORTARDATOSDINAMICOS(\" BAS056\";TABLAS!$A$281)"]
[null,"Lectura de PPD",null,{"$f":"+GETPIVOTDATA(\" BAS057\",TABLAS!$A$59)","v":4},{"$f":"+GETPIVOTDATA(\" BAS058\",TABLAS!$A$59)","v":0},{"$f":"+GETPIVOTDATA(\" BAS059\",TABLAS!$A$59)","v":0},{"$f":"+GETPIVOTDATA(\" BAS060\",TABLAS!$A$59)","v":0},{"$f":"+GETPIVOTDATA(\" BAS061\",TABLAS!$A$59)","v":0},{"$f":"+GETPIVOTDATA(\" BAS062\",TABLAS!$A$59)","v":0},{"$f":"+GETPIVOTDATA(\" BAS063\",TABLAS!$A$59)","v":0},{"$f":"+GETPIVOTDATA(\" BAS064\",TABLAS!$A$59)","v":0},{"$f":"+GETPIVOTDATA(\" BAS065\",TABLAS!$A$59)","v":0},4,null,null,null,{"$f":"+Y84+1","v":57},{"$f":"+Q85+1","v":58},59,60,61,62,63,64,65,null,null,null,"057","058","059","060","061","062","063","064","065",null,null,{"$f":"$AI$23&AC85&$AJ$22","v":"=+IMPORTARDATOSDINAMICOS(\" BAS057\";TABLAS!$A$281)"},"=+IMPORTARDATOSDINAMICOS(\" BAS058\";TABLAS!$A$281)","=+IMPORTARDATOSDINAMICOS(\" BAS059\";TABLAS!$A$281)","=+IMPORTARDATOSDINAMICOS(\" BAS060\";TABLAS!$A$281)","=+IMPORTARDATOSDINAMICOS(\" BAS061\";TABLAS!$A$281)","=+IMPORTARDATOSDINAMICOS(\" BAS062\";TABLAS!$A$281)","=+IMPORTARDATOSDINAMICOS(\" BAS063\";TABLAS!$A$281)","=+IMPORTARDATOSDINAMICOS(\" BAS064\";TABLAS!$A$281)","=+IMPORTARDATOSDINAMICOS(\" BAS065\";TABLAS!$A$281)"]
[null,"Aplicación de IGRA",null,{"$f":"+GETPIVOTDATA(\" BAS066\",TABLAS!$A$59)","v":0},{"$f":"+GETPIVOTDATA(\" BAS067\",TABLAS!$A$59)","v":0},{"$f":"+GETPIVOTDATA(\" BAS068\",TABLAS!$A$59)","v":0},{"$f":"+GETPIVOTDATA(\" BAS069\",TABLAS!$A$59)","v":0},{"$f":"+GETPIVOTDATA(\" BAS070\",TABLAS!$A$59)","v":0},{"$f":"+GETPIVOTDATA(\" BAS071\",TABLAS!$A$59)","v":0},{"$f":"+GETPIVOTDATA(\" BAS072\",TABLAS!$A$59)","v":0},{"$f":"+GETPIVOTDATA(\" BAS073\",TABLAS!$A$59)","v":0},{"$f":"+GETPIVOTDATA(\" BAS074\",TABLAS!$A$59)","v":0},0,null,null,null,{"$f":"+Y85+1","v":66},{"$f":"+Q86+1","v":67},68,69,70,71,72,73,74,null,null,null,"066","067","068","069","070","071","072","073","074",null,null,"=+IMPORTARDATOSDINAMICOS(\" BAS066\";TABLAS!$A$281)","=+IMPORTARDATOSDINAMICOS(\" BAS067\";TABLAS!$A$281)","=+IMPORTARDATOSDINAMICOS(\" BAS068\";TABLAS!$A$281)","=+IMPORTARDATOSDINAMICOS(\" BAS069\";TABLAS!$A$281)","=+IMPORTARDATOSDINAMICOS(\" BAS070\";TABLAS!$A$281)","=+IMPORTARDATOSDINAMICOS(\" BAS071\";TABLAS!$A$281)","=+IMPORTARDATOSDINAMICOS(\" BAS072\";TABLAS!$A$281)","=+IMPORTARDATOSDINAMICOS(\" BAS073\";TABLAS!$A$281)","=+IMPORTARDATOSDINAMICOS(\" BAS074\";TABLAS!$A$281)"]
[null,"Lectura de IGRA",null,{"$f":"+GETPIVOTDATA(\" BAS075\",TABLAS!$A$59)","v":0},{"$f":"+GETPIVOTDATA(\" BAS076\",TABLAS!$A$59)","v":0},{"$f":"+GETPIVOTDATA(\" BAS077\",TABLAS!$A$59)","v":0},{"$f":"+GETPIVOTDATA(\" BAS078\",TABLAS!$A$59)","v":0},{"$f":"+GETPIVOTDATA(\" BAS079\",TABLAS!$A$59)","v":0},{"$f":"+GETPIVOTDATA(\" BAS080\",TABLAS!$A$59)","v":0},{"$f":"+GETPIVOTDATA(\" BAS081\",TABLAS!$A$59)","v":0},{"$f":"+GETPIVOTDATA(\" BAS082\",TABLAS!$A$59)","v":0},{"$f":"+GETPIVOTDATA(\" BAS083\",TABLAS!$A$59)","v":0},0,null,null,null,75,{"$f":"+Q87+1","v":76},77,78,79,80,81,82,83,null,null,null,"075","076","077","078","079","080","081","082","083",null,null,"=+IMPORTARDATOSDINAMICOS(\" BAS075\";TABLAS!$A$281)","=+IMPORTARDATOSDINAMICOS(\" BAS076\";TABLAS!$A$281)","=+IMPORTARDATOSDINAMICOS(\" BAS077\";TABLAS!$A$281)","=+IMPORTARDATOSDINAMICOS(\" BAS078\";TABLAS!$A$281)","=+IMPORTARDATOSDINAMICOS(\" BAS079\";TABLAS!$A$281)","=+IMPORTARDATOSDINAMICOS(\" BAS080\";TABLAS!$A$281)","=+IMPORTARDATOSDINAMICOS(\" BAS081\";TABLAS!$A$281)","=+IMPORTARDATOSDINAMICOS(\" BAS082\";TABLAS!$A$281)","=+IMPORTARDATOSDINAMICOS(\" BAS083\";TABLAS!$A$281)"]
[null,"Administración de terapia preventiva para contactos de TB sensible",null,{"$f":"+GETPIVOTDATA(\" BAS084\",TABLAS!$A$59)","v":41},null,null,null,null,null,null,null,null,41,null,null,null,84,null,null,null,null,null,null,null,null,null,null,null,"084",null,null,null,null,null,null,null,null,null,null,"=+IMPORTARDATOSDINAMICOS(\" BAS084\";TABLAS!$A$281)"]
[null,"Administración de terapia preventiva para contactos de TB resistente",null,{"$f":"+GETPIVOTDATA(\" BAS085\",TABLAS!$A$59)","v":0},null,null,null,null,null,null,null,null,0,null,null,null,{"$f":"+Q88+1","v":85},null,null,null,null,null,null,null,null,null,null,null,"085",null,null,null,null,null,null,null,null,null,null,"=+IMPORTARDATOSDINAMICOS(\" BAS085\";TABLAS!$A$281)"]
[null,"Administración de terapia preventiva para población vulnerable para TB",null,null,{"$f":"+GETPIVOTDATA(\" BAS086\",TABLAS!$A$59)","v":0},{"$f":"+GETPIVOTDATA(\" BAS087\",TABLAS!$A$59)","v":0},{"$f":"+GETPIVOTDATA(\" BAS088\",TABLAS!$A$59)","v":0},{"$f":"+GETPIVOTDATA(\" BAS089\",TABLAS!$A$59)","v":0},{"$f":"+GETPIVOTDATA(\" BAS090\",TABLAS!$A$59)","v":0},{"$f":"+GETPIVOTDATA(\" BAS091\",TABLAS!$A$59)","v":0},{"$f":"+GETPIVOTDATA(\" BAS092\",TABLAS!$A$59)","v":0},{"$f":"+GETPIVOTDATA(\" BAS093\",TABLAS!$A$59)","v":0},0,null,null,null,null,{"$f":"+Q89+1","v":86},{"$f":"+R90+1","v":87},88,89,90,91,92,93,null,null,null,null,{"$f":"IF(LEN(R90)=1,CONCATENATE(\"00\",R90),IF(LEN(R90)=2,CONCATENATE(\"0\",R90),R90))","v":"086"},"087","088","089","090","091","092","093",null,null,null,{"$f":"$AI$23&AD90&$AJ$22","v":"=+IMPORTARDATOSDINAMICOS(\" BAS086\";TABLAS!$A$281)"},"=+IMPORTARDATOSDINAMICOS(\" BAS087\";TABLAS!$A$281)","=+IMPORTARDATOSDINAMICOS(\" BAS088\";TABLAS!$A$281)","=+IMPORTARDATOSDINAMICOS(\" BAS089\";TABLAS!$A$281)","=+IMPORTARDATOSDINAMICOS(\" BAS090\";TABLAS!$A$281)","=+IMPORTARDATOSDINAMICOS(\" BAS091\";TABLAS!$A$281)","=+IMPORTARDATOSDINAMICOS(\" BAS092\";TABLAS!$A$281)","=+IMPORTARDATOSDINAMICOS(\" BAS093\";TABLAS!$A$281)"]
[null,"Caso probable",{"$f":"+GETPIVOTDATA(\" BAS094\",TABLAS!$A$59)","v":0},{"$f":"+GETPIVOTDATA(\" BAS095\",TABLAS!$A$59)","v":0},{"$f":"+GETPIVOTDATA(\" BAS096\",TABLAS!$A$59)","v":0},{"$f":"+GETPIVOTDATA(\" BAS097\",TABLAS!$A$59)","v":0},{"$f":"+GETPIVOTDATA(\" BAS098\",TABLAS!$A$59)","v":0},{"$f":"+GETPIVOTDATA(\" BAS099\",TABLAS!$A$59)","v":0},{"$f":"+GETPIVOTDATA(\" BAS100\",TABLAS!$A$59)","v":0},{"$f":"+GETPIVOTDATA(\" BAS101\",TABLAS!$A$59)","v":0},{"$f":"+GETPIVOTDATA(\" BAS102\",TABLAS!$A$59)","v":0},{"$f":"+GETPIVOTDATA(\" BAS103\",TABLAS!$A$59)","v":0},0,null,null,null,94,{"$f":"+Q91+1","v":95},96,97,98,99,100,101,102,103,null,null,{"$f":"IF(LEN(Q91)=1,CONCATENATE(\"00\",Q91),IF(LEN(Q91)=2,CONCATENATE(\"0\",Q91),Q91))","v":"094"},"095","096","097","098","099",100,101,102,{"$f":"IF(LEN(Z91)=1,CONCATENATE(\"00\",Z91),IF(LEN(Z91)=2,CONCATENATE(\"0\",Z91),Z91))","v":103},null,{"$f":"$AI$23&AC91&$AJ$22","v":"=+IMPORTARDATOSDINAMICOS(\" BAS094\";TABLAS!$A$281)"},"=+IMPORTARDATOSDINAMICOS(\" BAS095\";TABLAS!$A$281)","=+IMPORTARDATOSDINAMICOS(\" BAS096\";TABLAS!$A$281)","=+IMPORTARDATOSDINAMICOS(\" BAS097\";TABLAS!$A$281)","=+IMPORTARDATOSDINAMICOS(\" BAS098\";TABLAS!$A$281)","=+IMPORTARDATOSDINAMICOS(\" BAS099\";TABLAS!$A$281)","=+IMPORTARDATOSDINAMICOS(\" BAS100\";TABLAS!$A$281)","=+IMPORTARDATOSDINAMICOS(\" BAS101\";TABLAS!$A$281)","=+IMPORTARDATOSDINAMICOS(\" BAS102\";TABLAS!$A$281)",{"$f":"$AI$23&AL91&$AJ$22","v":"=+IMPORTARDATOSDINAMICOS(\" BAS103\";TABLAS!$A$281)"}]
[null,"Sintomático respiratorio identificado",{"$f":"+GETPIVOTDATA(\" BAS104\",TABLAS!$A$59)","v":15},{"$f":"+GETPIVOTDATA(\" BAS105\",TABLAS!$A$59)","v":4},{"$f":"+GETPIVOTDATA(\" BAS106\",TABLAS!$A$59)","v":0},{"$f":"+GETPIVOTDATA(\" BAS107\",TABLAS!$A$59)","v":0},{"$f":"+GETPIVOTDATA(\" BAS108\",TABLAS!$A$59)","v":0},{"$f":"+GETPIVOTDATA(\" BAS109\",TABLAS!$A$59)","v":0},{"$f":"+GETPIVOTDATA(\" BAS110\",TABLAS!$A$59)","v":0},{"$f":"+GETPIVOTDATA(\" BAS111\",TABLAS!$A$59)","v":0},{"$f":"+GETPIVOTDATA(\" BAS112\",TABLAS!$A$59)","v":0},{"$f":"+GETPIVOTDATA(\" BAS113\",TABLAS!$A$59)","v":0},19,null,null,null,{"$f":"+Z91+1","v":104},{"$f":"+Q92+1","v":105},106,107,108,109,110,111,112,113,null,null,104,105,106,107,108,109,110,111,112,113,null,"=+IMPORTARDATOSDINAMICOS(\" BAS104\";TABLAS!$A$281)","=+IMPORTARDATOSDINAMICOS(\" BAS105\";TABLAS!$A$281)","=+IMPORTARDATOSDINAMICOS(\" BAS106\";TABLAS!$A$281)","=+IMPORTARDATOSDINAMICOS(\" BAS107\";TABLAS!$A$281)","=+IMPORTARDATOSDINAMICOS(\" BAS108\";TABLAS!$A$281)","=+IMPORTARDATOSDINAMICOS(\" BAS109\";TABLAS!$A$281)","=+IMPORTARDATOSDINAMICOS(\" BAS110\";TABLAS!$A$281)","=+IMPORTARDATOSDINAMICOS(\" BAS111\";TABLAS!$A$281)","=+IMPORTARDATOSDINAMICOS(\" BAS112\";TABLAS!$A$281)","=+IMPORTARDATOSDINAMICOS(\" BAS113\";TABLAS!$A$281)"]
[null,"Sintomático respiratorio examinado",{"$f":"+GETPIVOTDATA(\" BAS114\",TABLAS!$A$59)","v":9},{"$f":"+GETPIVOTDATA(\" BAS115\",TABLAS!$A$59)","v":4},{"$f":"+GETPIVOTDATA(\" BAS116\",TABLAS!$A$59)","v":0},{"$f":"+GETPIVOTDATA(\" BAS117\",TABLAS!$A$59)","v":0},{"$f":"+GETPIVOTDATA(\" BAS118\",TABLAS!$A$59)","v":0},{"$f":"+GETPIVOTDATA(\" BAS119\",TABLAS!$A$59)","v":3},{"$f":"+GETPIVOTDATA(\" BAS120\",TABLAS!$A$59)","v":0},{"$f":"+GETPIVOTDATA(\" BAS121\",TABLAS!$A$59)","v":0},{"$f":"+GETPIVOTDATA(\" BAS122\",TABLAS!$A$59)","v":0},{"$f":"+GETPIVOTDATA(\" BAS123\",TABLAS!$A$59)","v":0},16,null,null,null,{"$f":"+Z92+1","v":114},{"$f":"+Q93+1","v":115},116,117,118,119,120,121,122,123,null,null,114,115,116,117,118,119,120,121,122,123,null,"=+IMPORTARDATOSDINAMICOS(\" BAS114\";TABLAS!$A$281)","=+IMPORTARDATOSDINAMICOS(\" BAS115\";TABLAS!$A$281)","=+IMPORTARDATOSDINAMICOS(\" BAS116\";TABLAS!$A$281)","=+IMPORTARDATOSDINAMICOS(\" BAS117\";TABLAS!$A$281)","=+IMPORTARDATOSDINAMICOS(\" BAS118\";TABLAS!$A$281)","=+IMPORTARDATOSDINAMICOS(\" BAS119\";TABLAS!$A$281)","=+IMPORTARDATOSDINAMICOS(\" BAS120\";TABLAS!$A$281)","=+IMPORTARDATOSDINAMICOS(\" BAS121\";TABLAS!$A$281)","=+IMPORTARDATOSDINAMICOS(\" BAS122\";TABLAS!$A$281)","=+IMPORTARDATOSDINAMICOS(\" BAS123\";TABLAS!$A$281)"]
[null,"SR examinados con bacteriología confirmada",{"$f":"+GETPIVOTDATA(\" BAS124\",TABLAS!$A$59)","v":0},{"$f":"+GETPIVOTDATA(\" BAS125\",TABLAS!$A$59)","v":0},{"$f":"+GETPIVOTDATA(\" BAS126\",TABLAS!$A$59)","v":0},{"$f":"+GETPIVOTDATA(\" BAS127\",TABLAS!$A$59)","v":0},{"$f":"+GETPIVOTDATA(\" BAS128\",TABLAS!$A$59)","v":0},{"$f":"+GETPIVOTDATA(\" BAS129\",TABLAS!$A$59)","v":0},{"$f":"+GETPIVOTDATA(\" BAS130\",TABLAS!$A$59)","v":0},{"$f":"+GETPIVOTDATA(\" BAS131\",TABLAS!$A$59)","v":0},{"$f":"+GETPIVOTDATA(\" BAS132\",TABLAS!$A$59)","v":0},{"$f":"+GETPIVOTDATA(\" BAS133\",TABLAS!$A$59)","v":0},0,null,null,null,124,{"$f":"+Q94+1","v":125},126,127,128,129,130,131,132,133,null,null,124,125,126,127,128,129,130,131,132,133,null,"=+IMPORTARDATOSDINAMICOS(\" BAS124\";TABLAS!$A$281)","=+IMPORTARDATOSDINAMICOS(\" BAS125\";TABLAS!$A$281)","=+IMPORTARDATOSDINAMICOS(\" BAS126\";TABLAS!$A$281)","=+IMPORTARDATOSDINAMICOS(\" BAS127\";TABLAS!$A$281)","=+IMPORTARDATOSDINAMICOS(\" BAS128\";TABLAS!$A$281)","=+IMPORTARDATOSDINAMICOS(\" BAS129\";TABLAS!$A$281)","=+IMPORTARDATOSDINAMICOS(\" BAS130\";TABLAS!$A$281)","=+IMPORTARDATOSDINAMICOS(\" BAS131\";TABLAS!$A$281)","=+IMPORTARDATOSDINAMICOS(\" BAS132\";TABLAS!$A$281)","=+IMPORTARDATOSDINAMICOS(\" BAS133\";TABLAS!$A$281)"]

{"sheet":"TBC1217","index":4,"n_rows":94,"n_cols":49,"rows_kept":94,"cut":false,"hidden":false,"merged":[[81,12,82,12],[66,1,67,1],[66,3,67,3],[66,5,67,5],[68,2,68,4],[69,2,69,4],[81,1,82,1],[81,2,81,11],[58,1,58,2],[58,4,58,6],[61,1,61,2],[62,1,65,1],[62,2,63,2],[62,5,65,5],[64,2,65,2],[56,7,57,7],[56,9,56,10],[57,9,57,10],[43,1,44,2],[43,8,43,9],[45,1,45,2],[45,8,45,9],[46,1,47,2],[46,4,47,5],[53,4,53,5],[53,9,53,10],[54,7,55,7],[54,9,54,10],[55,9,55,10],[40,1,40,2],[40,8,40,9],[41,1,41,2],[41,8,41,9],[42,1,42,2],[42,8,42,9],[33,1,33,2],[33,6,33,7],[34,1,34,2],[34,6,34,7],[35,1,35,2],[35,6,35,7],[32,1,32,2],[22,1,22,3],[22,4,23,4],[22,6,22,7],[23,6,24,6],[25,6,25,7],[26,1,26,3],[26,6,26,8],[27,1,27,2],[27,6,27,8],[28,1,28,2],[29,1,29,2],[30,1,30,2],[21,6,21,7],[8,2,8,3],[9,2,9,3],[9,6,9,9],[10,2,10,3],[11,2,11,3],[11,6,11,7],[12,2,12,3],[13,2,13,3],[14,2,14,3],[15,2,15,3],[21,1,21,4],[7,2,7,3],[7,6,7,9],[1,1,1,11],[2,1,2,12],[5,2,5,3],[5,6,5,7],[6,2,6,3],[3,1,3,12]]}
[]
[]
[null,"REPORTE MENSUAL DE ACTIVIDADES DE PREVENCION Y CONTROL DE TUBERCULOSIS [12-17]"]
[null,"CURSO DE VIDA : ADOLESCENTE"]
[]
[null,"DIRESA","CUSCO",null,null,"REGION","CUSCO"]
[]
[null,"RED DE SALUD ",{"$f":"+TABLAS!O9","v":"03 - LA CONVENCION"},null,null,"EJECUTORA",{"$f":"+TABLAS!O14","v":""}]
[]
[null,"MICRO RED",{"$f":"+TABLAS!O10","v":""},null,null,"RESPONSABLE"]
[]
[null,"EE.SS.",{"$f":"+TABLAS!O11","v":""},null,null,"COD. RENAES",{"$f":"+TABLAS!Q11","v":""}]
[]
[null,"PROVINCIA",{"$f":"+TABLAS!O12","v":""},null,null,"AÑO",{"$f":"+TABLAS!J16","v":"2025"}]
[]
[null,"DISTRITO",{"$f":"+TABLAS!O13","v":""},null,null,"MES",{"$f":"+TABLAS!N26","v":"ENE - MAR"}]
[]
[null,"INSTITUCION :  MINSA (  X  )   ESSALUD (     )   FFAA  (     )   PNP  (     )   INPE  (     )   OTROS  (     )"]
[]
[null,"I. ACTIVIDADES DE DETECCION Y DIAGNOSTICO PARA TUBERCULOSIS"]
[]
[null,"DETECCIÓN DE CASOS",null,null,null,null,"RECOLECCIÓN DE MUESTRAS PARA EXAMEN BACTERIOLÓGICO",null,"N°",null,null,null,null,null,null,null,null,null,null,null,null,null,null,null,null,null,null,null,null,null,null,null,null,null,null,"\";TABLAS!$A$281)"]
[null,"Sintomático respiratorio (SR)",null,null,"Caso probable de TB",null,"RECOLECCIÓN DE MUESTRAS PARA TB*",null,{"$f":"+GETPIVOTDATA(\" BAS001\",TABLAS!$A$95)","v":154},null,null,null,null,null,null,null,1,null,null,null,null,null,null,null,null,null,null,null,{"$f":"IF(LEN(Q23)=1,CONCATENATE(\"00\",Q23),IF(LEN(Q23)=2,CONCATENATE(\"0\",Q23),Q23))","v":"001"},null,null,null,null,null,"=+IMPORTARDATOSDINAMICOS(\" BAS",null,null,null,null,{"$f":"$AI$23&AC23&$AJ$22","v":"=+IMPORTARDATOSDINAMICOS(\" BAS001\";TABLAS!$A$281)"}]
[null,"SR Identificado","SR Examinado","SR examinados con bacteriología confirmada",null,null,"PROCEDIMIENTOS ESPECIALES PARA OBTENCION DE MUESTRAS","Lavado gástrico",{"$f":"+GETPIVOTDATA(\" BAS002\",TABLAS!$A$95)","v":0},null,null,null,null,null,null,null,{"$f":"+Q23+1","v":2},null,null,null,null,null,null,null,null,null,null,null,"002",null,null,null,null,null,null,null,null,null,null,{"$f":"$AI$23&AC24&$AJ$22","v":"=+IMPORTARDATOSDINAMICOS(\" BAS002\";TABLAS!$A$281)"}]
[null,{"$f":"M92","v":42},{"$f":"M93","v":39},{"$f":"M94","v":0},{"$f":"M91","v":0},null,null,"Inducción del esputo",{"$f":"+GETPIVOTDATA(\" BAS003\",TABLAS!$A$95)","v":0},null,null,null,null,null,null,null,{"$f":"+Q24+1","v":3},null,null,null,null,null,null,null,null,null,null,null,"003",null,null,null,null,null,null,null,null,null,null,"=+IMPORTARDATOSDINAMICOS(\" BAS003\";TABLAS!$A$281)"]
[null,null,null,null,null,null,"TOTAL",null,{"$f":"SUM(I23+I24+I25)","v":154}]
[null,"SR examinados con bacteriología confirmada",null,null,null,null,"*Muestra recolectada por expectoración espontánea"]
[null,"Por baciloscopia",null,{"$f":"+GETPIVOTDATA(\" BAS004\",TABLAS!$A$95)","v":0},null,null,"REFERENCIAS",null,null,null,null,null,null,null,null,null,{"$f":"+Q25+1","v":4},null,null,null,null,null,null,null,null,null,null,null,{"$f":"IF(LEN(Q28)=1,CONCATENATE(\"00\",Q28),IF(LEN(Q28)=2,CONCATENATE(\"0\",Q28),Q28))","v":"004"},null,null,null,null,null,null,null,null,null,null,{"$f":"$AI$23&AC28&$AJ$22","v":"=+IMPORTARDATOSDINAMICOS(\" BAS004\";TABLAS!$A$281)"}]
[null,"Por prueba molecular",null,{"$f":"+GETPIVOTDATA(\" BAS005\",TABLAS!$A$95)","v":0},null,null,"Condición","Derivaciones","Transferencias",null,null,null,null,null,null,null,{"$f":"+Q28+1","v":5},null,null,{"$f":"+Q30+1","v":7},{"$f":"+T29+1","v":8},null,null,null,null,null,null,null,"005",null,null,{"$f":"IF(LEN(T29)=1,CONCATENATE(\"00\",T29),IF(LEN(T29)=2,CONCATENATE(\"0\",T29),T29))","v":"007"},"008",null,null,null,null,null,null,"=+IMPORTARDATOSDINAMICOS(\" BAS005\";TABLAS!$A$281)",null,null,{"$f":"$AI$23&AF29&$AJ$22","v":"=+IMPORTARDATOSDINAMICOS(\" BAS007\";TABLAS!$A$281)"},"=+IMPORTARDATOSDINAMICOS(\" BAS008\";TABLAS!$A$281)"]
[null,"Por cultivo",null,{"$f":"+GETPIVOTDATA(\" BAS006\",TABLAS!$A$95)","v":0},null,null,"Realizadas",{"$f":"+GETPIVOTDATA(\" BAS007\",TABLAS!$A$95)","v":0},{"$f":"+GETPIVOTDATA(\" BAS008\",TABLAS!$A$95)","v":0},null,null,null,null,null,null,null,{"$f":"+Q29+1","v":6},null,null,{"$f":"+U29+1","v":9},{"$f":"+T30+1","v":10},null,null,null,null,null,null,null,"006",null,null,"009","010",null,null,null,null,null,null,"=+IMPORTARDATOSDINAMICOS(\" BAS006\";TABLAS!$A$281)",null,null,"=+IMPORTARDATOSDINAMICOS(\" BAS009\";TABLAS!$A$281)","=+IMPORTARDATOSDINAMICOS(\" BAS010\";TABLAS!$A$281)"]
[null,"TOTAL",null,{"$f":"SUM(D28+D29+D30)","v":0},null,null,"Aceptadas",{"$f":"+GETPIVOTDATA(\" BAS009\",TABLAS!$A$95)","v":0},{"$f":"+GETPIVOTDATA(\" BAS010\",TABLAS!$A$95)","v":0}]
[null,null,null,null,null,null,"TOTAL",{"$f":"SUM(H30+H31)","v":0},{"$f":"SUM(I30+I31)","v":0}]
[null,"COMORBILIDADES Y CONDICIONES ASOCIADAS",null,"N°"]
[null,"TB-VIH/SIDA",null,{"$f":"+GETPIVOTDATA(\" BAS011\",TABLAS!$A$95)","v":0},null,null,"TAMIZAJE DE COMORBILIDADES",null,"N°",null,null,null,null,null,null,null,{"$f":"+U30+1","v":11},null,null,null,null,null,null,null,null,null,null,null,{"$f":"IF(LEN(Q34)=1,CONCATENATE(\"00\",Q34),IF(LEN(Q34)=2,CONCATENATE(\"0\",Q34),Q34))","v":"011"},null,null,null,null,null,null,null,null,null,null,{"$f":"$AI$23&AC34&$AJ$22","v":"=+IMPORTARDATOSDINAMICOS(\" BAS011\";TABLAS!$A$281)"}]
[null,"TB-DM",null,{"$f":"+GETPIVOTDATA(\" BAS012\",TABLAS!$A$95)","v":0},null,null,"Tamizaje TB-VIH",null,{"$f":"+GETPIVOTDATA(\" BAS014\",TABLAS!$A$95)","v":1},null,null,null,null,null,null,null,{"$f":"+Q34+1","v":12},null,{"$f":"+Q36+1","v":14},null,null,null,null,null,null,null,null,null,"012",null,{"$f":"IF(LEN(S35)=1,CONCATENATE(\"00\",S35),IF(LEN(S35)=2,CONCATENATE(\"0\",S35),S35))","v":"014"},null,null,null,null,null,null,null,null,"=+IMPORTARDATOSDINAMICOS(\" BAS012\";TABLAS!$A$281)",null,{"$f":"$AI$23&AE35&$AJ$22","v":"=+IMPORTARDATOSDINAMICOS(\" BAS014\";TABLAS!$A$281)"}]
[null,"Reacción adversa a medicamentos para TB",null,{"$f":"+GETPIVOTDATA(\" BAS013\",TABLAS!$A$95)","v":0},null,null,"Tamizaje TB-DM",null,{"$f":"+GETPIVOTDATA(\" BAS015\",TABLAS!$A$95)","v":1},null,null,null,null,null,null,null,13,null,{"$f":"+S35+1","v":15},null,null,null,null,null,null,null,null,null,"013",null,"015",null,null,null,null,null,null,null,null,"=+IMPORTARDATOSDINAMICOS(\" BAS013\";TABLAS!$A$281)",null,"=+IMPORTARDATOSDINAMICOS(\" BAS015\";TABLAS!$A$281)"]
[]
[]
[null,"II. ACTIVIDADES PARA LA RECUPERACION DE LA PERSONA AFECTADA POR TUBERCULOSIS"]
[]
[null,"ATENCIÓN MULTIDISCIPLINARIA",null,"MODALIDAD","EN PAT CON TB SENSIBLE","EN PAT CON TB RESISTENTE","TOTAL",null,2,null,"N°"]
[null,"Evaluación médica",null,null,{"$f":"+GETPIVOTDATA(\" BAS016\",TABLAS!$A$95)","v":0},{"$f":"+GETPIVOTDATA(\" BAS017\",TABLAS!$A$95)","v":0},{"$f":"SUM(E42+F42)","v":0},null,"Administración de tratamiento para TB sensible",null,{"$f":"+GETPIVOTDATA(\" BAS028\",TABLAS!$A$95)","v":31},null,null,null,null,null,{"$f":"+S36+1","v":16},{"$f":"+Q42+1","v":17},null,null,null,{"$f":"+Q48+1","v":28},null,null,null,null,null,null,{"$f":"IF(LEN(Q42)=1,CONCATENATE(\"00\",Q42),IF(LEN(Q42)=2,CONCATENATE(\"0\",Q42),Q42))","v":"016"},"017",null,null,null,{"$f":"IF(LEN(V42)=1,CONCATENATE(\"00\",V42),IF(LEN(V42)=2,CONCATENATE(\"0\",V42),V42))","v":"028"},null,null,null,null,null,{"$f":"$AI$23&AC42&$AJ$22","v":"=+IMPORTARDATOSDINAMICOS(\" BAS016\";TABLAS!$A$281)"},"=+IMPORTARDATOSDINAMICOS(\" BAS017\";TABLAS!$A$281)",null,null,null,{"$f":"$AI$23&AH42&$AJ$22","v":"=+IMPORTARDATOSDINAMICOS(\" BAS028\";TABLAS!$A$281)"}]
[null,"Atención en consultorio de enfermería",null,null,{"$f":"+GETPIVOTDATA(\" BAS018\",TABLAS!$A$95)","v":0},{"$f":"+GETPIVOTDATA(\" BAS019\",TABLAS!$A$95)","v":0},{"$f":"SUM(E43+F43)","v":0},null,"Administración de tratamiento para TB resistente",null,{"$f":"+GETPIVOTDATA(\" BAS029\",TABLAS!$A$95)","v":0},null,null,null,null,null,{"$f":"+R42+1","v":18},{"$f":"+Q43+1","v":19},null,null,null,{"$f":"+V42+1","v":29},null,null,null,null,null,null,"018","019",null,null,null,"029",null,null,null,null,null,"=+IMPORTARDATOSDINAMICOS(\" BAS018\";TABLAS!$A$281)","=+IMPORTARDATOSDINAMICOS(\" BAS019\";TABLAS!$A$281)",null,null,null,"=+IMPORTARDATOSDINAMICOS(\" BAS029\";TABLAS!$A$281)"]
[null,"Atención de servicio social",null,"En el establecimiento de salud",{"$f":"+GETPIVOTDATA(\" BAS020\",TABLAS!$A$95)","v":0},{"$f":"+GETPIVOTDATA(\" BAS021\",TABLAS!$A$95)","v":0},{"$f":"SUM(E44+F44)","v":0},null,"Control de tratamiento",null,{"$f":"+GETPIVOTDATA(\" BAS030\",TABLAS!$A$95)","v":2},null,null,null,null,null,{"$f":"+R43+1","v":20},21,null,null,null,{"$f":"+V43+1","v":30},null,null,null,null,null,null,"020","021",null,null,null,"030",null,null,null,null,null,"=+IMPORTARDATOSDINAMICOS(\" BAS020\";TABLAS!$A$281)","=+IMPORTARDATOSDINAMICOS(\" BAS021\";TABLAS!$A$281)",null,null,null,"=+IMPORTARDATOSDINAMICOS(\" BAS030\";TABLAS!$A$281)"]
[null,null,null,"Mediante teleconsulta en línea",{"$f":"+GETPIVOTDATA(\" BAS022\",TABLAS!$A$95)","v":0},{"$f":"+GETPIVOTDATA(\" BAS023\",TABLAS!$A$95)","v":0},{"$f":"SUM(E45+F45)","v":0},null,null,null,null,null,null,null,null,null,22,23,null,null,null,null,null,null,null,null,null,null,"022","023",null,null,null,null,null,null,null,null,null,"=+IMPORTARDATOSDINAMICOS(\" BAS022\";TABLAS!$A$281)","=+IMPORTARDATOSDINAMICOS(\" BAS023\";TABLAS!$A$281)"]
[null,"Atención en nutrición",null,null,{"$f":"+GETPIVOTDATA(\" BAS024\",TABLAS!$A$95)","v":0},{"$f":"+GETPIVOTDATA(\" BAS025\",TABLAS!$A$95)","v":0},{"$f":"SUM(E46+F46)","v":0},null,"RETO ANTE REACCIONES ADVERSAS",null,null,null,null,null,null,null,24,25,null,null,null,null,null,null,null,null,null,null,"024","025",null,null,null,null,null,null,null,null,null,"=+IMPORTARDATOSDINAMICOS(\" BAS024\";TABLAS!$A$281)","=+IMPORTARDATOSDINAMICOS(\" BAS025\";TABLAS!$A$281)"]
[null,"Atención en salud mental",null,"En el establecimiento de salud",null,null,{"$f":"+GETPIVOTDATA(\" BAS026\",TABLAS!$A$95)","v":0},null,"Condición","N°",null,null,null,null,null,null,26,null,null,null,null,null,null,null,null,null,null,null,"026",null,null,null,null,null,null,null,null,null,null,"=+IMPORTARDATOSDINAMICOS(\" BAS026\";TABLAS!$A$281)"]
[null,null,null,"Mediante teleorientación síncrona",null,null,{"$f":"+GETPIVOTDATA(\" BAS027\",TABLAS!$A$95)","v":0},null,"Inicio",{"$f":"+GETPIVOTDATA(\" BAS031\",TABLAS!$A$95)","v":0},null,"REGISTRO EN EL PADRON DE BENEFICIARIOS PANTBC",null,null,null,null,{"$f":"+Q47+1","v":27},null,null,null,null,{"$f":"+V44+1","v":31},null,null,null,null,null,null,"027",null,null,null,null,{"$f":"IF(LEN(V48)=1,CONCATENATE(\"00\",V48),IF(LEN(V48)=2,CONCATENATE(\"0\",V48),V48))","v":"031"},null,null,null,null,null,"=+IMPORTARDATOSDINAMICOS(\" BAS027\";TABLAS!$A$281)",null,null,null,null,{"$f":"$AI$23&AH48&$AJ$22","v":"=+IMPORTARDATOSDINAMICOS(\" BAS031\";TABLAS!$A$281)"}]
[null,null,null,null,null,null,null,null,"Término",{"$f":"+GETPIVOTDATA(\" BAS032\",TABLAS!$A$95)","v":0},null,{"$f":"+GETPIVOTDATA(\" BAS033\",TABLAS!$A$95)","v":0},null,null,null,null,null,null,null,null,null,{"$f":"+V48+1","v":32},null,{"$f":"+V49+1","v":33},null,null,null,null,null,null,null,null,null,"032",null,{"$f":"IF(LEN(X49)=1,CONCATENATE(\"00\",X49),IF(LEN(X49)=2,CONCATENATE(\"0\",X49),X49))","v":"033"},null,null,null,null,null,null,null,null,"=+IMPORTARDATOSDINAMICOS(\" BAS032\";TABLAS!$A$281)",null,{"$f":"$AI$23&AJ49&$AJ$22","v":"=+IMPORTARDATOSDINAMICOS(\" BAS033\";TABLAS!$A$281)"}]
[]
[]
[null,"III. ACTIVIDADES DE PREVENCIÓN EN TUBERCULOSIS"]
[]
[null,"CENSO DE CONTACTOS","N°",null,"PRUEBA PARA DIAGNOSTICO DE TB LATENTE",null,"N°","POSITIVOS",null,"TERAPIA PREVENTIVA PARA TUBERCULOSIS LATENTE",null,"N°"]
[null,"En el establecimiento de salud",{"$f":"+GETPIVOTDATA(\" BAS034\",TABLAS!$A$95)","v":0},null,"PPD","Aplicación",{"$f":"M84","v":2},{"$f":"+GETPIVOTDATA(\" BAS037\",TABLAS!$A$95)","v":0},null,"Administración de terapia preventiva para contactos de TB sensible",null,{"$f":"+GETPIVOTDATA(\" BAS039\",TABLAS!$A$95)","v":3},null,null,null,null,{"$f":"+X49+1","v":34},null,{"$f":"+Q57+1","v":37},null,{"$f":"+S57+1","v":39},null,null,null,null,null,null,null,{"$f":"IF(LEN(Q55)=1,CONCATENATE(\"00\",Q55),IF(LEN(Q55)=2,CONCATENATE(\"0\",Q55),Q55))","v":"034"},null,{"$f":"IF(LEN(S55)=1,CONCATENATE(\"00\",S55),IF(LEN(S55)=2,CONCATENATE(\"0\",S55),S55))","v":"037"},null,{"$f":"IF(LEN(U55)=1,CONCATENATE(\"00\",U55),IF(LEN(U55)=2,CONCATENATE(\"0\",U55),U55))","v":"039"},null,null,null,null,null,null,{"$f":"$AI$23&AC55&$AJ$22","v":"=+IMPORTARDATOSDINAMICOS(\" BAS034\";TABLAS!$A$281)"},null,{"$f":"$AI$23&AE55&$AJ$22","v":"=+IMPORTARDATOSDINAMICOS(\" BAS037\";TABLAS!$A$281)"},null,{"$f":"$AI$23&AG55&$AJ$22","v":"=+IMPORTARDATOSDINAMICOS(\" BAS039\";TABLAS!$A$281)"}]
[null,"En el domicilio*",{"$f":"+GETPIVOTDATA(\" BAS035\",TABLAS!$A$95)","v":0},null,null,"Lectura",{"$f":"M85","v":1},null,null,"Administración de terapia preventiva para contactos de TB resistente",null,{"$f":"+GETPIVOTDATA(\" BAS040\",TABLAS!$A$95)","v":0},null,null,null,null,{"$f":"+Q55+1","v":35},null,null,null,{"$f":"+U55+1","v":40},null,null,null,null,null,null,null,"035",null,null,null,{"$f":"IF(LEN(U56)=1,CONCATENATE(\"00\",U56),IF(LEN(U56)=2,CONCATENATE(\"0\",U56),U56))","v":"040"},null,null,null,null,null,null,"=+IMPORTARDATOSDINAMICOS(\" BAS035\";TABLAS!$A$281)",null,null,null,"=+IMPORTARDATOSDINAMICOS(\" BAS040\";TABLAS!$A$281)"]
[null,"Mediante teleorientación síncrona",{"$f":"+GETPIVOTDATA(\" BAS036\",TABLAS!$A$95)","v":0},null,"IGRA","Aplicación",{"$f":"M86","v":0},{"$f":"+GETPIVOTDATA(\" BAS038\",TABLAS!$A$95)","v":0},null,"Administración de terapia preventiva para población vulnerable para TB",null,{"$f":"M90","v":0},null,null,null,null,{"$f":"+Q56+1","v":36},null,{"$f":"+S55+1","v":38},null,null,null,null,null,null,null,null,null,"036",null,{"$f":"IF(LEN(S57)=1,CONCATENATE(\"00\",S57),IF(LEN(S57)=2,CONCATENATE(\"0\",S57),S57))","v":"038"},null,null,null,null,null,null,null,null,"=+IMPORTARDATOSDINAMICOS(\" BAS036\";TABLAS!$A$281)",null,{"$f":"$AI$23&AE57&$AJ$22","v":"=+IMPORTARDATOSDINAMICOS(\" BAS038\";TABLAS!$A$281)"}]
[null,"Total",{"$f":"SUM(C55+C56+C57)","v":0},null,null,"Lectura",{"$f":"M87","v":0},null,null,"TOTAL",null,{"$f":"SUM(L55+L56+L57)","v":3}]
[null,"*Mediante visita familiar",null,null,"TOTAL",null,null,{"$f":"SUM(H55+H57)","v":0}]
[]
[null,"IV. ACTIVIDADES DE PROMOCIÓN DE LA SALUD EN TUBERCULOSIS"]
[null,"ACTIVIDADES",null,"MODALIDAD","N°","TOTAL"]
[null,"Consejeria para TB","Primera","Mediante visita familiar",{"$f":"+GETPIVOTDATA(\" BAS041\",TABLAS!$A$95)","v":0},{"$f":"SUM(E63+E64+E65+E66)","v":0},null,null,null,null,null,null,null,null,null,null,{"$f":"+U56+1","v":41},null,null,null,null,null,null,null,null,null,null,null,{"$f":"IF(LEN(Q63)=1,CONCATENATE(\"00\",Q63),IF(LEN(Q63)=2,CONCATENATE(\"0\",Q63),Q63))","v":"041"},null,null,null,null,null,null,null,null,null,null,{"$f":"$AI$23&AC63&$AJ$22","v":"=+IMPORTARDATOSDINAMICOS(\" BAS041\";TABLAS!$A$281)"}]
[null,null,null,"Mediante teleorientación síncrona",{"$f":"+GETPIVOTDATA(\" BAS042\",TABLAS!$A$95)","v":0},null,null,null,null,null,null,null,null,null,null,null,{"$f":"+Q63+1","v":42},null,null,null,null,null,null,null,null,null,null,null,"042",null,null,null,null,null,null,null,null,null,null,"=+IMPORTARDATOSDINAMICOS(\" BAS042\";TABLAS!$A$281)"]
[null,null,"Segunda","Mediante visita familiar",{"$f":"+GETPIVOTDATA(\" BAS043\",TABLAS!$A$95)","v":0},null,null,null,null,null,null,null,null,null,null,null,{"$f":"+Q64+1","v":43},null,null,null,null,null,null,null,null,null,null,null,"043",null,null,null,null,null,null,null,null,null,null,"=+IMPORTARDATOSDINAMICOS(\" BAS043\";TABLAS!$A$281)"]
[null,null,null,"Mediante teleorientación síncrona",{"$f":"+GETPIVOTDATA(\" BAS044\",TABLAS!$A$95)","v":0},null,null,null,null,null,null,null,null,null,null,null,44,null,null,null,null,null,null,null,null,null,null,null,"044",null,null,null,null,null,null,null,null,null,null,"=+IMPORTARDATOSDINAMICOS(\" BAS044\";TABLAS!$A$281)"]
[null,"Sesión educativa y demostrativa para TB","Primera",null,{"$f":"+GETPIVOTDATA(\" BAS045\",TABLAS!$A$95)","v":0},{"$f":"SUM(E67+E68)","v":0},null,null,null,null,null,null,null,null,null,null,45,null,null,null,null,null,null,null,null,null,null,null,"045",null,null,null,null,null,null,null,null,null,null,"=+IMPORTARDATOSDINAMICOS(\" BAS045\";TABLAS!$A$281)"]
[null,null,"Segunda",null,{"$f":"+GETPIVOTDATA(\" BAS046\",TABLAS!$A$95)","v":0},null,null,null,null,null,null,null,null,null,null,null,46,null,null,null,null,null,null,null,null,null,null,null,"046",null,null,null,null,null,null,null,null,null,null,"=+IMPORTARDATOSDINAMICOS(\" BAS046\";TABLAS!$A$281)"]
[null,"Visitas familiar",null,null,null,{"$f":"SUM(C56+E63+E65)","v":0}]
[null,"Otras consejerias",null,null,null,{"$f":"+GETPIVOTDATA(\" BAS047\",TABLAS!$A$95)","v":1},null,null,null,null,null,null,null,null,null,null,{"$f":"+Q68+1","v":47},null,null,null,null,null,null,null,null,null,null,null,{"$f":"IF(LEN(Q70)=1,CONCATENATE(\"00\",Q70),IF(LEN(Q70)=2,CONCATENATE(\"0\",Q70),Q70))","v":"047"},null,null,null,null,null,null,null,null,null,null,{"$f":"$AI$23&AC70&$AJ$22","v":"=+IMPORTARDATOSDINAMICOS(\" BAS047\";TABLAS!$A$281)"}]
[]
[]
[null,"V. ACTIVIDADES EN TELESALUD"]
[]
[null,"ACTIVIDADES","N°"]
[null,"Teleconsulta en línea",{"$f":"G45","v":0}]
[null,"Teleorientación síncrona",{"$f":"SUM(G48+C57)","v":0}]
[null,"Total",{"$f":"SUM(C76+C77+#REF!)","v":{"$error":"#REF!"}}]
[]
[null,"REPORTE DE ACTIVIDADES SEGMENTADO POR POBLACION AFECTADA Y VULNERABLE"]
[]
[null,"ACTIVIDADES","POBLACION AFECTADA Y VULNERABLE",null,null,null,null,null,null,null,null,null,"TOTAL"]
[null,null,"POBLACIÓN EN GENERAL","CONTACTOS","PERSONA VIVIENDO CON VIH/SIDA","TRABAJADOR DE SALUD","PERSONA CON DIABETES MELLITUS","PPL","PERSONA CON TERAPIA PROLONGADA CON CORTICOIDES","PERSONA CON HEMODIALISIS Y/O ENFERMEDAD RENAL CRÓNICA","PERSONAL PENITENCIARIO","OTRAS CONDICIONES DE SALUD SEGÚN NORMATIVIDAD VIGENTE"]
[null,"Aplicación de PPD",null,{"$f":"+GETPIVOTDATA(\" BAS048\",TABLAS!$A$95)","v":2},{"$f":"+GETPIVOTDATA(\" BAS049\",TABLAS!$A$95)","v":0},{"$f":"+GETPIVOTDATA(\" BAS050\",TABLAS!$A$95)","v":0},{"$f":"+GETPIVOTDATA(\" BAS051\",TABLAS!$A$95)","v":0},{"$f":"+GETPIVOTDATA(\" BAS052\",TABLAS!$A$95)","v":0},{"$f":"+GETPIVOTDATA(\" BAS053\",TABLAS!$A$95)","v":0},{"$f":"+GETPIVOTDATA(\" BAS054\",TABLAS!$A$95)","v":0},{"$f":"+GETPIVOTDATA(\" BAS055\",TABLAS!$A$95)","v":0},{"$f":"+GETPIVOTDATA(\" BAS056\",TABLAS!$A$95)","v":0},{"$f":"SUM(C84+D84+E84+F84+G84+H84+I84+J84+K84+L84)","v":2},null,null,null,{"$f":"+Q70+1","v":48},{"$f":"+Q84+1","v":49},{"$f":"+R84+1","v":50},51,52,53,54,55,56,null,null,null,{"$f":"IF(LEN(Q84)=1,CONCATENATE(\"00\",Q84),IF(LEN(Q84)=2,CONCATENATE(\"0\",Q84),Q84))","v":"048"},"049","050","051","052","053","054","055","056",null,null,{"$f":"$AI$23&AC84&$AJ$22","v":"=+IMPORTARDATOSDINAMICOS(\" BAS048\";TABLAS!$A$281)"},{"$f":"$AI$23&AD84&$AJ$22","v":"=+IMPORTARDATOSDINAMICOS(\" BAS049\";TABLAS!$A$281)"},"=+IMPORTARDATOSDINAMICOS(\" BAS050\";TABLAS!$A$281)","=+IMPORTARDATOSDINAMICOS(\" BAS051\";TABLAS!$A$281)","=+IMPORTARDATOSDINAMICOS(\" BAS052\";TABLAS!$A$281)","=+IMPORTARDATOSDINAMICOS(\" BAS053\";TABLAS!$A$281)","=+IMPORTARDATOSDINAMICOS(\" BAS054\";TABLAS!$A$281)","=+IMPORTARDATOSDINAMICOS(\" BAS055\";TABLAS!$A$281)","=+IMPORTARDATOSDINAMICOS(\" BAS056\";TABLAS!$A$281)"]
[null,"Lectura de PPD",null,{"$f":"+GETPIVOTDATA(\" BAS057\",TABLAS!$A$95)","v":1},{"$f":"+GETPIVOTDATA(\" BAS058\",TABLAS!$A$95)","v":0},{"$f":"+GETPIVOTDATA(\" BAS059\",TABLAS!$A$95)","v":0},{"$f":"+GETPIVOTDATA(\" BAS060\",TABLAS!$A$95)","v":0},{"$f":"+GETPIVOTDATA(\" BAS061\",TABLAS!$A$95)","v":0},{"$f":"+GETPIVOTDATA(\" BAS062\",TABLAS!$A$95)","v":0},{"$f":"+GETPIVOTDATA(\" BAS063\",TABLAS!$A$95)","v":0},{"$f":"+GETPIVOTDATA(\" BAS064\",TABLAS!$A$95)","v":0},{"$f":"+GETPIVOTDATA(\" BAS065\",TABLAS!$A$95)","v":0},1,null,null,null,{"$f":"+Y84+1","v":57},{"$f":"+Q85+1","v":58},59,60,61,62,63,64,65,null,null,null,"057","058","059","060","061","062","063","064","065",null,null,{"$f":"$AI$23&AC85&$AJ$22","v":"=+IMPORTARDATOSDINAMICOS(\" BAS057\";TABLAS!$A$281)"},"=+IMPORTARDATOSDINAMICOS(\" BAS058\";TABLAS!$A$281)","=+IMPORTARDATOSDINAMICOS(\" BAS059\";TABLAS!$A$281)","=+IMPORTARDATOSDINAMICOS(\" BAS060\";TABLAS!$A$281)","=+IMPORTARDATOSDINAMICOS(\" BAS061\";TABLAS!$A$281)","=+IMPORTARDATOSDINAMICOS(\" BAS062\";TABLAS!$A$281)","=+IMPORTARDATOSDINAMICOS(\" BAS063\";TABLAS!$A$281)","=+IMPORTARDATOSDINAMICOS(\" BAS064\";TABLAS!$A$281)","=+IMPORTARDATOSDINAMICOS(\" BAS065\";TABLAS!$A$281)"]
[null,"Aplicación de IGRA",null,{"$f":"+GETPIVOTDATA(\" BAS066\",TABLAS!$A$95)","v":0},{"$f":"+GETPIVOTDATA(\" BAS067\",TABLAS!$A$95)","v":0},{"$f":"+GETPIVOTDATA(\" BAS068\",TABLAS!$A$95)","v":0},{"$f":"+GETPIVOTDATA(\" BAS069\",TABLAS!$A$95)","v":0},{"$f":"+GETPIVOTDATA(\" BAS070\",TABLAS!$A$95)","v":0},{"$f":"+GETPIVOTDATA(\" BAS071\",TABLAS!$A$95)","v":0},{"$f":"+GETPIVOTDATA(\" BAS072\",TABLAS!$A$95)","v":0},{"$f":"+GETPIVOTDATA(\" BAS073\",TABLAS!$A$95)","v":0},{"$f":"+GETPIVOTDATA(\" BAS074\",TABLAS!$A$95)","v":0},0,null,null,null,{"$f":"+Y85+1","v":66},67,68,69,70,71,72,73,74,null,null,null,"066","067","068","069","070","071","072","073","074",null,null,"=+IMPORTARDATOSDINAMICOS(\" BAS066\";TABLAS!$A$281)","=+IMPORTARDATOSDINAMICOS(\" BAS067\";TABLAS!$A$281)","=+IMPORTARDATOSDINAMICOS(\" BAS068\";TABLAS!$A$281)","=+IMPORTARDATOSDINAMICOS(\" BAS069\";TABLAS!$A$281)","=+IMPORTARDATOSDINAMICOS(\" BAS070\";TABLAS!$A$281)","=+IMPORTARDATOSDINAMICOS(\" BAS071\";TABLAS!$A$281)","=+IMPORTARDATOSDINAMICOS(\" BAS072\";TABLAS!$A$281)","=+IMPORTARDATOSDINAMICOS(\" BAS073\";TABLAS!$A$281)","=+IMPORTARDATOSDINAMICOS(\" BAS074\";TABLAS!$A$281)"]
[null,"Lectura de IGRA",null,{"$f":"+GETPIVOTDATA(\" BAS075\",TABLAS!$A$95)","v":0},{"$f":"+GETPIVOTDATA(\" BAS076\",TABLAS!$A$95)","v":0},{"$f":"+GETPIVOTDATA(\" BAS077\",TABLAS!$A$95)","v":0},{"$f":"+GETPIVOTDATA(\" BAS078\",TABLAS!$A$95)","v":0},{"$f":"+GETPIVOTDATA(\" BAS079\",TABLAS!$A$95)","v":0},{"$f":"+GETPIVOTDATA(\" BAS080\",TABLAS!$A$95)","v":0},{"$f":"+GETPIVOTDATA(\" BAS081\",TABLAS!$A$95)","v":0},{"$f":"+GETPIVOTDATA(\" BAS082\",TABLAS!$A$95)","v":0},{"$f":"+GETPIVOTDATA(\" BAS083\",TABLAS!$A$95)","v":0},0,null,null,null,75,76,77,78,79,80,81,82,83,null,null,null,"075","076","077","078","079","080","081","082","083",null,null,"=+IMPORTARDATOSDINAMICOS(\" BAS075\";TABLAS!$A$281)","=+IMPORTARDATOSDINAMICOS(\" BAS076\";TABLAS!$A$281)","=+IMPORTARDATOSDINAMICOS(\" BAS077\";TABLAS!$A$281)","=+IMPORTARDATOSDINAMICOS(\" BAS078\";TABLAS!$A$281)","=+IMPORTARDATOSDINAMICOS(\" BAS079\";TABLAS!$A$281)","=+IMPORTARDATOSDINAMICOS(\" BAS080\";TABLAS!$A$281)","=+IMPORTARDATOSDINAMICOS(\" BAS081\";TABLAS!$A$281)","=+IMPORTARDATOSDINAMICOS(\" BAS082\";TABLAS!$A$281)","=+IMPORTARDATOSDINAMICOS(\" BAS083\";TABLAS!$A$281)"]
[null,"Administración de terapia preventiva para contactos de TB sensible",null,{"$f":"+GETPIVOTDATA(\" BAS084\",TABLAS!$A$95)","v":3},null,null,null,null,null,null,null,null,3,null,null,null,84,null,null,null,null,null,null,null,null,null,null,null,"084",null,null,null,null,null,null,null,null,null,null,"=+IMPORTARDATOSDINAMICOS(\" BAS084\";TABLAS!$A$281)"]
[null,"Administración de terapia preventiva para contactos de TB resistente",null,{"$f":"+GETPIVOTDATA(\" BAS085\",TABLAS!$A$95)","v":0},null,null,null,null,null,null,null,null,0,null,null,null,{"$f":"+Q88+1","v":85},null,null,null,null,null,null,null,null,null,null,null,"085",null,null,null,null,null,null,null,null,null,null,"=+IMPORTARDATOSDINAMICOS(\" BAS085\";TABLAS!$A$281)"]
[null,"Administración de terapia preventiva para población vulnerable para TB",null,null,{"$f":"+GETPIVOTDATA(\" BAS086\",TABLAS!$A$95)","v":0},{"$f":"+GETPIVOTDATA(\" BAS087\",TABLAS!$A$95)","v":0},{"$f":"+GETPIVOTDATA(\" BAS088\",TABLAS!$A$95)","v":0},{"$f":"+GETPIVOTDATA(\" BAS089\",TABLAS!$A$95)","v":0},{"$f":"+GETPIVOTDATA(\" BAS090\",TABLAS!$A$95)","v":0},{"$f":"+GETPIVOTDATA(\" BAS091\",TABLAS!$A$95)","v":0},{"$f":"+GETPIVOTDATA(\" BAS092\",TABLAS!$A$95)","v":0},{"$f":"+GETPIVOTDATA(\" BAS093\",TABLAS!$A$95)","v":0},0,null,null,null,null,{"$f":"+Q89+1","v":86},{"$f":"+R90+1","v":87},88,89,90,91,92,93,null,null,null,null,{"$f":"IF(LEN(R90)=1,CONCATENATE(\"00\",R90),IF(LEN(R90)=2,CONCATENATE(\"0\",R90),R90))","v":"086"},"087","088","089","090","091","092","093",null,null,null,{"$f":"$AI$23&AD90&$AJ$22","v":"=+IMPORTARDATOSDINAMICOS(\" BAS086\";TABLAS!$A$281)"},"=+IMPORTARDATOSDINAMICOS(\" BAS087\";TABLAS!$A$281)","=+IMPORTARDATOSDINAMICOS(\" BAS088\";TABLAS!$A$281)","=+IMPORTARDATOSDINAMICOS(\" BAS089\";TABLAS!$A$281)","=+IMPORTARDATOSDINAMICOS(\" BAS090\";TABLAS!$A$281)","=+IMPORTARDATOSDINAMICOS(\" BAS091\";TABLAS!$A$281)","=+IMPORTARDATOSDINAMICOS(\" BAS092\";TABLAS!$A$281)","=+IMPORTARDATOSDINAMICOS(\" BAS093\";TABLAS!$A$281)"]
[null,"Caso probable",{"$f":"+GETPIVOTDATA(\" BAS094\",TABLAS!$A$95)","v":0},{"$f":"+GETPIVOTDATA(\" BAS095\",TABLAS!$A$95)","v":0},{"$f":"+GETPIVOTDATA(\" BAS096\",TABLAS!$A$95)","v":0},{"$f":"+GETPIVOTDATA(\" BAS097\",TABLAS!$A$95)","v":0},{"$f":"+GETPIVOTDATA(\" BAS098\",TABLAS!$A$95)","v":0},{"$f":"+GETPIVOTDATA(\" BAS099\",TABLAS!$A$95)","v":0},{"$f":"+GETPIVOTDATA(\" BAS100\",TABLAS!$A$95)","v":0},{"$f":"+GETPIVOTDATA(\" BAS101\",TABLAS!$A$95)","v":0},{"$f":"+GETPIVOTDATA(\" BAS102\",TABLAS!$A$95)","v":0},{"$f":"+GETPIVOTDATA(\" BAS103\",TABLAS!$A$95)","v":0},0,null,null,null,94,{"$f":"+Q91+1","v":95},96,97,98,99,100,101,102,103,null,null,{"$f":"IF(LEN(Q91)=1,CONCATENATE(\"00\",Q91),IF(LEN(Q91)=2,CONCATENATE(\"0\",Q91),Q91))","v":"094"},"095","096","097","098","099",100,101,102,103,null,{"$f":"$AI$23&AC91&$AJ$22","v":"=+IMPORTARDATOSDINAMICOS(\" BAS094\";TABLAS!$A$281)"},"=+IMPORTARDATOSDINAMICOS(\" BAS095\";TABLAS!$A$281)","=+IMPORTARDATOSDINAMICOS(\" BAS096\";TABLAS!$A$281)","=+IMPORTARDATOSDINAMICOS(\" BAS097\";TABLAS!$A$281)","=+IMPORTARDATOSDINAMICOS(\" BAS098\";TABLAS!$A$281)","=+IMPORTARDATOSDINAMICOS(\" BAS099\";TABLAS!$A$281)","=+IMPORTARDATOSDINAMICOS(\" BAS100\";TABLAS!$A$281)","=+IMPORTARDATOSDINAMICOS(\" BAS101\";TABLAS!$A$281)","=+IMPORTARDATOSDINAMICOS(\" BAS102\";TABLAS!$A$281)","=+IMPORTARDATOSDINAMICOS(\" BAS103\";TABLAS!$A$281)"]
[null,"Sintomático respiratorio identificado",{"$f":"+GETPIVOTDATA(\" BAS104\",TABLAS!$A$95)","v":41},{"$f":"+GETPIVOTDATA(\" BAS105\",TABLAS!$A$95)","v":1},{"$f":"+GETPIVOTDATA(\" BAS106\",TABLAS!$A$95)","v":0},{"$f":"+GETPIVOTDATA(\" BAS107\",TABLAS!$A$95)","v":0},{"$f":"+GETPIVOTDATA(\" BAS108\",TABLAS!$A$95)","v":0},{"$f":"+GETPIVOTDATA(\" BAS109\",TABLAS!$A$95)","v":0},{"$f":"+GETPIVOTDATA(\" BAS110\",TABLAS!$A$95)","v":0},{"$f":"+GETPIVOTDATA(\" BAS111\",TABLAS!$A$95)","v":0},{"$f":"+GETPIVOTDATA(\" BAS112\",TABLAS!$A$95)","v":0},{"$f":"+GETPIVOTDATA(\" BAS113\",TABLAS!$A$95)","v":0},42,null,null,null,{"$f":"+Z91+1","v":104},105,106,107,108,109,110,111,112,113,null,null,104,105,106,107,108,109,110,111,112,113,null,"=+IMPORTARDATOSDINAMICOS(\" BAS104\";TABLAS!$A$281)","=+IMPORTARDATOSDINAMICOS(\" BAS105\";TABLAS!$A$281)","=+IMPORTARDATOSDINAMICOS(\" BAS106\";TABLAS!$A$281)","=+IMPORTARDATOSDINAMICOS(\" BAS107\";TABLAS!$A$281)","=+IMPORTARDATOSDINAMICOS(\" BAS108\";TABLAS!$A$281)","=+IMPORTARDATOSDINAMICOS(\" BAS109\";TABLAS!$A$281)","=+IMPORTARDATOSDINAMICOS(\" BAS110\";TABLAS!$A$281)","=+IMPORTARDATOSDINAMICOS(\" BAS111\";TABLAS!$A$281)","=+IMPORTARDATOSDINAMICOS(\" BAS112\";TABLAS!$A$281)","=+IMPORTARDATOSDINAMICOS(\" BAS113\";TABLAS!$A$281)"]
[null,"Sintomático respiratorio examinado",{"$f":"+GETPIVOTDATA(\" BAS114\",TABLAS!$A$95)","v":37},{"$f":"+GETPIVOTDATA(\" BAS115\",TABLAS!$A$95)","v":1},{"$f":"+GETPIVOTDATA(\" BAS116\",TABLAS!$A$95)","v":0},{"$f":"+GETPIVOTDATA(\" BAS117\",TABLAS!$A$95)","v":0},{"$f":"+GETPIVOTDATA(\" BAS118\",TABLAS!$A$95)","v":0},{"$f":"+GETPIVOTDATA(\" BAS119\",TABLAS!$A$95)","v":1},{"$f":"+GETPIVOTDATA(\" BAS120\",TABLAS!$A$95)","v":0},{"$f":"+GETPIVOTDATA(\" BAS121\",TABLAS!$A$95)","v":0},{"$f":"+GETPIVOTDATA(\" BAS122\",TABLAS!$A$95)","v":0},{"$f":"+GETPIVOTDATA(\" BAS123\",TABLAS!$A$95)","v":0},39,null,null,null,{"$f":"+Z92+1","v":114},115,116,117,118,119,120,121,122,123,null,null,114,115,116,117,118,119,120,121,122,123,null,"=+IMPORTARDATOSDINAMICOS(\" BAS114\";TABLAS!$A$281)","=+IMPORTARDATOSDINAMICOS(\" BAS115\";TABLAS!$A$281)","=+IMPORTARDATOSDINAMICOS(\" BAS116\";TABLAS!$A$281)","=+IMPORTARDATOSDINAMICOS(\" BAS117\";TABLAS!$A$281)","=+IMPORTARDATOSDINAMICOS(\" BAS118\";TABLAS!$A$281)","=+IMPORTARDATOSDINAMICOS(\" BAS119\";TABLAS!$A$281)","=+IMPORTARDATOSDINAMICOS(\" BAS120\";TABLAS!$A$281)","=+IMPORTARDATOSDINAMICOS(\" BAS121\";TABLAS!$A$281)","=+IMPORTARDATOSDINAMICOS(\" BAS122\";TABLAS!$A$281)","=+IMPORTARDATOSDINAMICOS(\" BAS123\";TABLAS!$A$281)"]
[null,"SR examinados con bacteriología confirmada",{"$f":"+GETPIVOTDATA(\" BAS124\",TABLAS!$A$95)","v":0},{"$f":"+GETPIVOTDATA(\" BAS125\",TABLAS!$A$95)","v":0},{"$f":"+GETPIVOTDATA(\" BAS126\",TABLAS!$A$95)","v":0},{"$f":"+GETPIVOTDATA(\" BAS127\",TABLAS!$A$95)","v":0},{"$f":"+GETPIVOTDATA(\" BAS128\",TABLAS!$A$95)","v":0},{"$f":"+GETPIVOTDATA(\" BAS129\",TABLAS!$A$95)","v":0},{"$f":"+GETPIVOTDATA(\" BAS130\",TABLAS!$A$95)","v":0},{"$f":"+GETPIVOTDATA(\" BAS131\",TABLAS!$A$95)","v":0},{"$f":"+GETPIVOTDATA(\" BAS132\",TABLAS!$A$95)","v":0},{"$f":"+GETPIVOTDATA(\" BAS133\",TABLAS!$A$95)","v":0},0,null,null,null,124,125,126,127,128,129,130,131,132,133,null,null,124,125,126,127,128,129,130,131,132,133,null,"=+IMPORTARDATOSDINAMICOS(\" BAS124\";TABLAS!$A$281)","=+IMPORTARDATOSDINAMICOS(\" BAS125\";TABLAS!$A$281)","=+IMPORTARDATOSDINAMICOS(\" BAS126\";TABLAS!$A$281)","=+IMPORTARDATOSDINAMICOS(\" BAS127\";TABLAS!$A$281)","=+IMPORTARDATOSDINAMICOS(\" BAS128\";TABLAS!$A$281)","=+IMPORTARDATOSDINAMICOS(\" BAS129\";TABLAS!$A$281)","=+IMPORTARDATOSDINAMICOS(\" BAS130\";TABLAS!$A$281)","=+IMPORTARDATOSDINAMICOS(\" BAS131\";TABLAS!$A$281)","=+IMPORTARDATOSDINAMICOS(\" BAS132\";TABLAS!$A$281)","=+IMPORTARDATOSDINAMICOS(\" BAS133\";TABLAS!$A$281)"]

{"sheet":"TBC1829","index":5,"n_rows":94,"n_cols":49,"rows_kept":94,"cut":false,"hidden":false,"merged":[[81,12,82,12],[66,1,67,1],[66,3,67,3],[66,5,67,5],[68,2,68,4],[69,2,69,4],[81,1,82,1],[81,2,81,11],[58,1,58,2],[58,4,58,6],[61,1,61,2],[62,1,65,1],[62,2,63,2],[62,5,65,5],[64,2,65,2],[56,7,57,7],[56,9,56,10],[57,9,57,10],[43,1,44,2],[43,8,43,9],[45,1,45,2],[45,8,45,9],[46,1,47,2],[46,4,47,5],[53,4,53,5],[53,9,53,10],[54,7,55,7],[54,9,54,10],[55,9,55,10],[40,1,40,2],[40,8,40,9],[41,1,41,2],[41,8,41,9],[42,1,42,2],[42,8,42,9],[33,1,33,2],[33,6,33,7],[34,1,34,2],[34,6,34,7],[35,1,35,2],[35,6,35,7],[32,1,32,2],[22,1,22,3],[22,4,23,4],[22,6,22,7],[23,6,24,6],[25,6,25,7],[26,1,26,3],[26,6,26,8],[27,1,27,2],[27,6,27,8],[28,1,28,2],[29,1,29,2],[30,1,30,2],[21,6,21,7],[8,2,8,3],[9,2,9,3],[9,6,9,9],[10,2,10,3],[11,2,11,3],[11,6,11,7],[12,2,12,3],[13,2,13,3],[14,2,14,3],[15,2,15,3],[21,1,21,4],[7,2,7,3],[7,6,7,9],[1,1,1,11],[2,1,2,12],[5,2,5,3],[5,6,5,7],[6,2,6,3],[3,1,3,12]]}
[]
[]
[null,"REPORTE MENSUAL DE ACTIVIDADES DE PREVENCION Y CONTROL DE TUBERCULOSIS [18-29]"]
[null,"CURSO DE VIDA : JOVEN"]
[]
[null,"DIRESA","CUSCO",null,null,"REGION","CUSCO"]
[]
[null,"RED DE SALUD ",{"$f":"+TABLAS!O9","v":"03 - LA CONVENCION"},null,null,"EJECUTORA",{"$f":"+TABLAS!O14","v":""}]
[]
[null,"MICRO RED",{"$f":"+TABLAS!O10","v":""},null,null,"RESPONSABLE"]
[]
[null,"EE.SS.",{"$f":"+TABLAS!O11","v":""},null,null,"COD. RENAES",{"$f":"+TABLAS!Q11","v":""}]
[]
[null,"PROVINCIA",{"$f":"+TABLAS!O12","v":""},null,null,"AÑO",{"$f":"+TABLAS!J16","v":"2025"}]
[]
[null,"DISTRITO",{"$f":"+TABLAS!O13","v":""},null,null,"MES",{"$f":"+TABLAS!N26","v":"ENE - MAR"}]
[]
[null,"INSTITUCION :  MINSA (  X  )   ESSALUD (     )   FFAA  (     )   PNP  (     )   INPE  (     )   OTROS  (     )"]
[]
[null,"I. ACTIVIDADES DE DETECCION Y DIAGNOSTICO PARA TUBERCULOSIS"]
[]
[null,"DETECCIÓN DE CASOS",null,null,null,null,"RECOLECCIÓN DE MUESTRAS PARA EXAMEN BACTERIOLÓGICO",null,"N°",null,null,null,null,null,null,null,null,null,null,null,null,null,null,null,null,null,null,null,null,null,null,null,null,null,null,"\";TABLAS!$A$281)"]
[null,"Sintomático respiratorio (SR)",null,null,"Caso probable de TB",null,"RECOLECCIÓN DE MUESTRAS PARA TB*",null,{"$f":"+GETPIVOTDATA(\" BAS001\",TABLAS!$A$130)","v":574},null,null,null,null,null,null,null,1,null,null,null,null,null,null,null,null,null,null,null,{"$f":"IF(LEN(Q23)=1,CONCATENATE(\"00\",Q23),IF(LEN(Q23)=2,CONCATENATE(\"0\",Q23),Q23))","v":"001"},null,null,null,null,null,"=+IMPORTARDATOSDINAMICOS(\" BAS",null,null,null,null,{"$f":"$AI$23&AC23&$AJ$22","v":"=+IMPORTARDATOSDINAMICOS(\" BAS001\";TABLAS!$A$281)"}]
[null,"SR Identificado","SR Examinado","SR examinados con bacteriología confirmada",null,null,"PROCEDIMIENTOS ESPECIALES PARA OBTENCION DE MUESTRAS","Lavado gástrico",{"$f":"+GETPIVOTDATA(\" BAS002\",TABLAS!$A$130)","v":0},null,null,null,null,null,null,null,{"$f":"+Q23+1","v":2},null,null,null,null,null,null,null,null,null,null,null,"002",null,null,null,null,null,null,null,null,null,null,{"$f":"$AI$23&AC24&$AJ$22","v":"=+IMPORTARDATOSDINAMICOS(\" BAS002\";TABLAS!$A$281)"}]
[null,{"$f":"M92","v":142},{"$f":"M93","v":141},{"$f":"M94","v":0},{"$f":"M91","v":0},null,null,"Inducción del esputo",{"$f":"+GETPIVOTDATA(\" BAS003\",TABLAS!$A$130)","v":0},null,null,null,null,null,null,null,{"$f":"+Q24+1","v":3},null,null,null,null,null,null,null,null,null,null,null,"003",null,null,null,null,null,null,null,null,null,null,"=+IMPORTARDATOSDINAMICOS(\" BAS003\";TABLAS!$A$281)"]
[null,null,null,null,null,null,"TOTAL",null,{"$f":"SUM(I23+I24+I25)","v":574}]
[null,"SR examinados con bacteriología confirmada",null,null,null,null,"*Muestra recolectada por expectoración espontánea"]
[null,"Por baciloscopia",null,{"$f":"+GETPIVOTDATA(\" BAS004\",TABLAS!$A$130)","v":0},null,null,"REFERENCIAS",null,null,null,null,null,null,null,null,null,{"$f":"+Q25+1","v":4},null,null,null,null,null,null,null,null,null,null,null,{"$f":"IF(LEN(Q28)=1,CONCATENATE(\"00\",Q28),IF(LEN(Q28)=2,CONCATENATE(\"0\",Q28),Q28))","v":"004"},null,null,null,null,null,null,null,null,null,null,{"$f":"$AI$23&AC28&$AJ$22","v":"=+IMPORTARDATOSDINAMICOS(\" BAS004\";TABLAS!$A$281)"}]
[null,"Por prueba molecular",null,{"$f":"+GETPIVOTDATA(\" BAS005\",TABLAS!$A$130)","v":0},null,null,"Condición","Derivaciones","Transferencias",null,null,null,null,null,null,null,{"$f":"+Q28+1","v":5},null,null,{"$f":"+Q30+1","v":7},{"$f":"+T29+1","v":8},null,null,null,null,null,null,null,"005",null,null,{"$f":"IF(LEN(T29)=1,CONCATENATE(\"00\",T29),IF(LEN(T29)=2,CONCATENATE(\"0\",T29),T29))","v":"007"},"008",null,null,null,null,null,null,"=+IMPORTARDATOSDINAMICOS(\" BAS005\";TABLAS!$A$281)",null,null,{"$f":"$AI$23&AF29&$AJ$22","v":"=+IMPORTARDATOSDINAMICOS(\" BAS007\";TABLAS!$A$281)"},"=+IMPORTARDATOSDINAMICOS(\" BAS008\";TABLAS!$A$281)"]
[null,"Por cultivo",null,{"$f":"+GETPIVOTDATA(\" BAS006\",TABLAS!$A$130)","v":0},null,null,"Realizadas",{"$f":"+GETPIVOTDATA(\" BAS007\",TABLAS!$A$130)","v":0},{"$f":"+GETPIVOTDATA(\" BAS008\",TABLAS!$A$130)","v":0},null,null,null,null,null,null,null,{"$f":"+Q29+1","v":6},null,null,{"$f":"+U29+1","v":9},{"$f":"+T30+1","v":10},null,null,null,null,null,null,null,"006",null,null,"009","010",null,null,null,null,null,null,"=+IMPORTARDATOSDINAMICOS(\" BAS006\";TABLAS!$A$281)",null,null,"=+IMPORTARDATOSDINAMICOS(\" BAS009\";TABLAS!$A$281)","=+IMPORTARDATOSDINAMICOS(\" BAS010\";TABLAS!$A$281)"]
[null,"TOTAL",null,{"$f":"SUM(D28+D29+D30)","v":0},null,null,"Aceptadas",{"$f":"+GETPIVOTDATA(\" BAS009\",TABLAS!$A$130)","v":0},{"$f":"+GETPIVOTDATA(\" BAS010\",TABLAS!$A$130)","v":0}]
[null,null,null,null,null,null,"TOTAL",{"$f":"SUM(H30+H31)","v":0},{"$f":"SUM(I30+I31)","v":0}]
[null,"COMORBILIDADES Y CONDICIONES ASOCIADAS",null,"N°"]
[null,"TB-VIH/SIDA",null,{"$f":"+GETPIVOTDATA(\" BAS011\",TABLAS!$A$130)","v":0},null,null,"TAMIZAJE DE COMORBILIDADES",null,"N°",null,null,null,null,null,null,null,{"$f":"+U30+1","v":11},null,null,null,null,null,null,null,null,null,null,null,{"$f":"IF(LEN(Q34)=1,CONCATENATE(\"00\",Q34),IF(LEN(Q34)=2,CONCATENATE(\"0\",Q34),Q34))","v":"011"},null,null,null,null,null,null,null,null,null,null,{"$f":"$AI$23&AC34&$AJ$22","v":"=+IMPORTARDATOSDINAMICOS(\" BAS011\";TABLAS!$A$281)"}]
[null,"TB-DM",null,{"$f":"+GETPIVOTDATA(\" BAS012\",TABLAS!$A$130)","v":0},null,null,"Tamizaje TB-VIH",null,{"$f":"+GETPIVOTDATA(\" BAS014\",TABLAS!$A$130)","v":2},null,null,null,null,null,null,null,{"$f":"+Q34+1","v":12},null,{"$f":"+Q36+1","v":14},null,null,null,null,null,null,null,null,null,"012",null,{"$f":"IF(LEN(S35)=1,CONCATENATE(\"00\",S35),IF(LEN(S35)=2,CONCATENATE(\"0\",S35),S35))","v":"014"},null,null,null,null,null,null,null,null,"=+IMPORTARDATOSDINAMICOS(\" BAS012\";TABLAS!$A$281)",null,{"$f":"$AI$23&AE35&$AJ$22","v":"=+IMPORTARDATOSDINAMICOS(\" BAS014\";TABLAS!$A$281)"}]
[null,"Reacción adversa a medicamentos para TB",null,{"$f":"+GETPIVOTDATA(\" BAS013\",TABLAS!$A$130)","v":0},null,null,"Tamizaje TB-DM",null,{"$f":"+GETPIVOTDATA(\" BAS015\",TABLAS!$A$130)","v":1},null,null,null,null,null,null,null,13,null,{"$f":"+S35+1","v":15},null,null,null,null,null,null,null,null,null,"013",null,"015",null,null,null,null,null,null,null,null,"=+IMPORTARDATOSDINAMICOS(\" BAS013\";TABLAS!$A$281)",null,"=+IMPORTARDATOSDINAMICOS(\" BAS015\";TABLAS!$A$281)"]
[]
[]
[null,"II. ACTIVIDADES PARA LA RECUPERACION DE LA PERSONA AFECTADA POR TUBERCULOSIS"]
[]
[null,"ATENCIÓN MULTIDISCIPLINARIA",null,"MODALIDAD","EN PAT CON TB SENSIBLE","EN PAT CON TB RESISTENTE","TOTAL",null,2,null,"N°"]
[null,"Evaluación médica",null,null,{"$f":"+GETPIVOTDATA(\" BAS016\",TABLAS!$A$130)","v":0},{"$f":"+GETPIVOTDATA(\" BAS017\",TABLAS!$A$130)","v":0},{"$f":"SUM(E42+F42)","v":0},null,"Administración de tratamiento para TB sensible",null,{"$f":"+GETPIVOTDATA(\" BAS028\",TABLAS!$A$130)","v":485},null,null,null,null,null,{"$f":"+S36+1","v":16},{"$f":"+Q42+1","v":17},null,null,null,{"$f":"+Q48+1","v":28},null,null,null,null,null,null,{"$f":"IF(LEN(Q42)=1,CONCATENATE(\"00\",Q42),IF(LEN(Q42)=2,CONCATENATE(\"0\",Q42),Q42))","v":"016"},"017",null,null,null,{"$f":"IF(LEN(V42)=1,CONCATENATE(\"00\",V42),IF(LEN(V42)=2,CONCATENATE(\"0\",V42),V42))","v":"028"},null,null,null,null,null,{"$f":"$AI$23&AC42&$AJ$22","v":"=+IMPORTARDATOSDINAMICOS(\" BAS016\";TABLAS!$A$281)"},"=+IMPORTARDATOSDINAMICOS(\" BAS017\";TABLAS!$A$281)",null,null,null,{"$f":"$AI$23&AH42&$AJ$22","v":"=+IMPORTARDATOSDINAMICOS(\" BAS028\";TABLAS!$A$281)"}]
[null,"Atención en consultorio de enfermería",null,null,{"$f":"+GETPIVOTDATA(\" BAS018\",TABLAS!$A$130)","v":0},{"$f":"+GETPIVOTDATA(\" BAS019\",TABLAS!$A$130)","v":0},{"$f":"SUM(E43+F43)","v":0},null,"Administración de tratamiento para TB resistente",null,{"$f":"+GETPIVOTDATA(\" BAS029\",TABLAS!$A$130)","v":23},null,null,null,null,null,{"$f":"+R42+1","v":18},{"$f":"+Q43+1","v":19},null,null,null,{"$f":"+V42+1","v":29},null,null,null,null,null,null,"018","019",null,null,null,"029",null,null,null,null,null,"=+IMPORTARDATOSDINAMICOS(\" BAS018\";TABLAS!$A$281)","=+IMPORTARDATOSDINAMICOS(\" BAS019\";TABLAS!$A$281)",null,null,null,"=+IMPORTARDATOSDINAMICOS(\" BAS029\";TABLAS!$A$281)"]
[null,"Atención de servicio social",null,"En el establecimiento de salud",{"$f":"+GETPIVOTDATA(\" BAS020\",TABLAS!$A$130)","v":0},{"$f":"+GETPIVOTDATA(\" BAS021\",TABLAS!$A$130)","v":0},{"$f":"SUM(E44+F44)","v":0},null,"Control de tratamiento",null,{"$f":"+GETPIVOTDATA(\" BAS030\",TABLAS!$A$130)","v":17},null,null,null,null,null,{"$f":"+R43+1","v":20},21,null,null,null,{"$f":"+V43+1","v":30},null,null,null,null,null,null,"020","021",null,null,null,"030",null,null,null,null,null,"=+IMPORTARDATOSDINAMICOS(\" BAS020\";TABLAS!$A$281)","=+IMPORTARDATOSDINAMICOS(\" BAS021\";TABLAS!$A$281)",null,null,null,"=+IMPORTARDATOSDINAMICOS(\" BAS030\";TABLAS!$A$281)"]
[null,null,null,"Mediante teleconsulta en línea",{"$f":"+GETPIVOTDATA(\" BAS022\",TABLAS!$A$130)","v":0},{"$f":"+GETPIVOTDATA(\" BAS023\",TABLAS!$A$130)","v":0},{"$f":"SUM(E45+F45)","v":0},null,null,null,null,null,null,null,null,null,22,23,null,null,null,null,null,null,null,null,null,null,"022","023",null,null,null,null,null,null,null,null,null,"=+IMPORTARDATOSDINAMICOS(\" BAS022\";TABLAS!$A$281)","=+IMPORTARDATOSDINAMICOS(\" BAS023\";TABLAS!$A$281)"]
[null,"Atención en nutrición",null,null,{"$f":"+GETPIVOTDATA(\" BAS024\",TABLAS!$A$130)","v":0},{"$f":"+GETPIVOTDATA(\" BAS025\",TABLAS!$A$130)","v":0},{"$f":"SUM(E46+F46)","v":0},null,"RETO ANTE REACCIONES ADVERSAS",null,null,null,null,null,null,null,24,25,null,null,null,null,null,null,null,null,null,null,"024","025",null,null,null,null,null,null,null,null,null,"=+IMPORTARDATOSDINAMICOS(\" BAS024\";TABLAS!$A$281)","=+IMPORTARDATOSDINAMICOS(\" BAS025\";TABLAS!$A$281)"]
[null,"Atención en salud mental",null,"En el establecimiento de salud",null,null,{"$f":"+GETPIVOTDATA(\" BAS026\",TABLAS!$A$130)","v":0},null,"Condición","N°",null,null,null,null,null,null,26,null,null,null,null,null,null,null,null,null,null,null,"026",null,null,null,null,null,null,null,null,null,null,"=+IMPORTARDATOSDINAMICOS(\" BAS026\";TABLAS!$A$281)"]
[null,null,null,"Mediante teleorientación síncrona",null,null,{"$f":"+GETPIVOTDATA(\" BAS027\",TABLAS!$A$130)","v":0},null,"Inicio",{"$f":"+GETPIVOTDATA(\" BAS031\",TABLAS!$A$130)","v":0},null,"REGISTRO EN EL PADRON DE BENEFICIARIOS PANTBC",null,null,null,null,{"$f":"+Q47+1","v":27},null,null,null,null,{"$f":"+V44+1","v":31},null,null,null,null,null,null,"027",null,null,null,null,{"$f":"IF(LEN(V48)=1,CONCATENATE(\"00\",V48),IF(LEN(V48)=2,CONCATENATE(\"0\",V48),V48))","v":"031"},null,null,null,null,null,"=+IMPORTARDATOSDINAMICOS(\" BAS027\";TABLAS!$A$281)",null,null,null,null,{"$f":"$AI$23&AH48&$AJ$22","v":"=+IMPORTARDATOSDINAMICOS(\" BAS031\";TABLAS!$A$281)"}]
[null,null,null,null,null,null,null,null,"Término",{"$f":"+GETPIVOTDATA(\" BAS032\",TABLAS!$A$130)","v":0},null,{"$f":"+GETPIVOTDATA(\" BAS033\",TABLAS!$A$130)","v":0},null,null,null,null,null,null,null,null,null,{"$f":"+V48+1","v":32},null,{"$f":"+V49+1","v":33},null,null,null,null,null,null,null,null,null,"032",null,{"$f":"IF(LEN(X49)=1,CONCATENATE(\"00\",X49),IF(LEN(X49)=2,CONCATENATE(\"0\",X49),X49))","v":"033"},null,null,null,null,null,null,null,null,"=+IMPORTARDATOSDINAMICOS(\" BAS032\";TABLAS!$A$281)",null,{"$f":"$AI$23&AJ49&$AJ$22","v":"=+IMPORTARDATOSDINAMICOS(\" BAS033\";TABLAS!$A$281)"}]
[]
[]
[null,"III. ACTIVIDADES DE PREVENCIÓN EN TUBERCULOSIS"]
[]
[null,"CENSO DE CONTACTOS","N°",null,"PRUEBA PARA DIAGNOSTICO DE TB LATENTE",null,"N°","POSITIVOS",null,"TERAPIA PREVENTIVA PARA TUBERCULOSIS LATENTE",null,"N°"]
[null,"En el establecimiento de salud",{"$f":"+GETPIVOTDATA(\" BAS034\",TABLAS!$A$130)","v":3},null,"PPD","Aplicación",{"$f":"M84","v":30},{"$f":"+GETPIVOTDATA(\" BAS037\",TABLAS!$A$130)","v":0},null,"Administración de terapia preventiva para contactos de TB sensible",null,{"$f":"+GETPIVOTDATA(\" BAS039\",TABLAS!$A$130)","v":35},null,null,null,null,{"$f":"+X49+1","v":34},null,{"$f":"+Q57+1","v":37},null,{"$f":"+S57+1","v":39},null,null,null,null,null,null,null,{"$f":"IF(LEN(Q55)=1,CONCATENATE(\"00\",Q55),IF(LEN(Q55)=2,CONCATENATE(\"0\",Q55),Q55))","v":"034"},null,{"$f":"IF(LEN(S55)=1,CONCATENATE(\"00\",S55),IF(LEN(S55)=2,CONCATENATE(\"0\",S55),S55))","v":"037"},null,{"$f":"IF(LEN(U55)=1,CONCATENATE(\"00\",U55),IF(LEN(U55)=2,CONCATENATE(\"0\",U55),U55))","v":"039"},null,null,null,null,null,null,{"$f":"$AI$23&AC55&$AJ$22","v":"=+IMPORTARDATOSDINAMICOS(\" BAS034\";TABLAS!$A$281)"},null,{"$f":"$AI$23&AE55&$AJ$22","v":"=+IMPORTARDATOSDINAMICOS(\" BAS037\";TABLAS!$A$281)"},null,{"$f":"$AI$23&AG55&$AJ$22","v":"=+IMPORTARDATOSDINAMICOS(\" BAS039\";TABLAS!$A$281)"}]
[null,"En el domicilio*",{"$f":"+GETPIVOTDATA(\" BAS035\",TABLAS!$A$130)","v":0},null,null,"Lectura",{"$f":"M85","v":7},null,null,"Administración de terapia preventiva para contactos de TB resistente",null,{"$f":"+GETPIVOTDATA(\" BAS040\",TABLAS!$A$130)","v":0},null,null,null,null,{"$f":"+Q55+1","v":35},null,null,null,{"$f":"+U55+1","v":40},null,null,null,null,null,null,null,"035",null,null,null,{"$f":"IF(LEN(U56)=1,CONCATENATE(\"00\",U56),IF(LEN(U56)=2,CONCATENATE(\"0\",U56),U56))","v":"040"},null,null,null,null,null,null,"=+IMPORTARDATOSDINAMICOS(\" BAS035\";TABLAS!$A$281)",null,null,null,"=+IMPORTARDATOSDINAMICOS(\" BAS040\";TABLAS!$A$281)"]
[null,"Mediante teleorientación síncrona",{"$f":"+GETPIVOTDATA(\" BAS036\",TABLAS!$A$130)","v":0},null,"IGRA","Aplicación",{"$f":"M86","v":0},{"$f":"+GETPIVOTDATA(\" BAS038\",TABLAS!$A$130)","v":0},null,"Administración de terapia preventiva para población vulnerable para TB",null,{"$f":"M90","v":0},null,null,null,null,{"$f":"+Q56+1","v":36},null,{"$f":"+S55+1","v":38},null,null,null,null,null,null,null,null,null,"036",null,{"$f":"IF(LEN(S57)=1,CONCATENATE(\"00\",S57),IF(LEN(S57)=2,CONCATENATE(\"0\",S57),S57))","v":"038"},null,null,null,null,null,null,null,null,"=+IMPORTARDATOSDINAMICOS(\" BAS036\";TABLAS!$A$281)",null,{"$f":"$AI$23&AE57&$AJ$22","v":"=+IMPORTARDATOSDINAMICOS(\" BAS038\";TABLAS!$A$281)"}]
[null,"Total",{"$f":"SUM(C55+C56+C57)","v":3},null,null,"Lectura",{"$f":"M87","v":0},null,null,"TOTAL",null,{"$f":"SUM(L55+L56+L57)","v":35}]
[null,"*Mediante visita familiar",null,null,"TOTAL",null,null,{"$f":"SUM(H55+H57)","v":0}]
[]
[null,"IV. ACTIVIDADES DE PROMOCIÓN DE LA SALUD EN TUBERCULOSIS"]
[null,"ACTIVIDADES",null,"MODALIDAD","N°","TOTAL"]
[null,"Consejeria para TB","Primera","Mediante visita familiar",{"$f":"+GETPIVOTDATA(\" BAS041\",TABLAS!$A$130)","v":0},{"$f":"SUM(E63+E64+E65+E66)","v":0},null,null,null,null,null,null,null,null,null,null,{"$f":"+U56+1","v":41},null,null,null,null,null,null,null,null,null,null,null,{"$f":"IF(LEN(Q63)=1,CONCATENATE(\"00\",Q63),IF(LEN(Q63)=2,CONCATENATE(\"0\",Q63),Q63))","v":"041"},null,null,null,null,null,null,null,null,null,null,{"$f":"$AI$23&AC63&$AJ$22","v":"=+IMPORTARDATOSDINAMICOS(\" BAS041\";TABLAS!$A$281)"}]
[null,null,null,"Mediante teleorientación síncrona",{"$f":"+GETPIVOTDATA(\" BAS042\",TABLAS!$A$130)","v":0},null,null,null,null,null,null,null,null,null,null,null,{"$f":"+Q63+1","v":42},null,null,null,null,null,null,null,null,null,null,null,"042",null,null,null,null,null,null,null,null,null,null,"=+IMPORTARDATOSDINAMICOS(\" BAS042\";TABLAS!$A$281)"]
[null,null,"Segunda","Mediante visita familiar",{"$f":"+GETPIVOTDATA(\" BAS043\",TABLAS!$A$130)","v":0},null,null,null,null,null,null,null,null,null,null,null,{"$f":"+Q64+1","v":43},null,null,null,null,null,null,null,null,null,null,null,"043",null,null,null,null,null,null,null,null,null,null,"=+IMPORTARDATOSDINAMICOS(\" BAS043\";TABLAS!$A$281)"]
[null,null,null,"Mediante teleorientación síncrona",{"$f":"+GETPIVOTDATA(\" BAS044\",TABLAS!$A$130)","v":0},null,null,null,null,null,null,null,null,null,null,null,44,null,null,null,null,null,null,null,null,null,null,null,"044",null,null,null,null,null,null,null,null,null,null,"=+IMPORTARDATOSDINAMICOS(\" BAS044\";TABLAS!$A$281)"]
[null,"Sesión educativa y demostrativa para TB","Primera",null,{"$f":"+GETPIVOTDATA(\" BAS045\",TABLAS!$A$130)","v":0},{"$f":"SUM(E67+E68)","v":0},null,null,null,null,null,null,null,null,null,null,45,null,null,null,null,null,null,null,null,null,null,null,"045",null,null,null,null,null,null,null,null,null,null,"=+IMPORTARDATOSDINAMICOS(\" BAS045\";TABLAS!$A$281)"]
[null,null,"Segunda",null,{"$f":"+GETPIVOTDATA(\" BAS046\",TABLAS!$A$130)","v":0},null,null,null,null,null,null,null,null,null,null,null,46,null,null,null,null,null,null,null,null,null,null,null,"046",null,null,null,null,null,null,null,null,null,null,"=+IMPORTARDATOSDINAMICOS(\" BAS046\";TABLAS!$A$281)"]
[null,"Visitas familiar",null,null,null,{"$f":"SUM(C56+E63+E65)","v":0}]
[null,"Otras consejerias",null,null,null,{"$f":"+GETPIVOTDATA(\" BAS047\",TABLAS!$A$130)","v":1},null,null,null,null,null,null,null,null,null,null,{"$f":"+Q68+1","v":47},null,null,null,null,null,null,null,null,null,null,null,{"$f":"IF(LEN(Q70)=1,CONCATENATE(\"00\",Q70),IF(LEN(Q70)=2,CONCATENATE(\"0\",Q70),Q70))","v":"047"},null,null,null,null,null,null,null,null,null,null,{"$f":"$AI$23&AC70&$AJ$22","v":"=+IMPORTARDATOSDINAMICOS(\" BAS047\";TABLAS!$A$281)"}]
[]
[]
[null,"V. ACTIVIDADES EN TELESALUD"]
[]
[null,"ACTIVIDADES","N°"]
[null,"Teleconsulta en línea",{"$f":"G45","v":0}]
[null,"Teleorientación síncrona",{"$f":"SUM(G48+C57)","v":0}]
[null,"Total",{"$f":"SUM(C76+C77+#REF!)","v":{"$error":"#REF!"}}]
[]
[null,"REPORTE DE ACTIVIDADES SEGMENTADO POR POBLACION AFECTADA Y VULNERABLE"]
[]
[null,"ACTIVIDADES","POBLACION AFECTADA Y VULNERABLE",null,null,null,null,null,null,null,null,null,"TOTAL"]
[null,null,"POBLACIÓN EN GENERAL","CONTACTOS","PERSONA VIVIENDO CON VIH/SIDA","TRABAJADOR DE SALUD","PERSONA CON DIABETES MELLITUS","PPL","PERSONA CON TERAPIA PROLONGADA CON CORTICOIDES","PERSONA CON HEMODIALISIS Y/O ENFERMEDAD RENAL CRÓNICA","PERSONAL PENITENCIARIO","OTRAS CONDICIONES DE SALUD SEGÚN NORMATIVIDAD VIGENTE"]
[null,"Aplicación de PPD",null,{"$f":"+GETPIVOTDATA(\" BAS048\",TABLAS!$A$130)","v":27},{"$f":"+GETPIVOTDATA(\" BAS049\",TABLAS!$A$130)","v":2},{"$f":"+GETPIVOTDATA(\" BAS050\",TABLAS!$A$130)","v":1},{"$f":"+GETPIVOTDATA(\" BAS051\",TABLAS!$A$130)","v":0},{"$f":"+GETPIVOTDATA(\" BAS052\",TABLAS!$A$130)","v":0},{"$f":"+GETPIVOTDATA(\" BAS053\",TABLAS!$A$130)","v":0},{"$f":"+GETPIVOTDATA(\" BAS054\",TABLAS!$A$130)","v":0},{"$f":"+GETPIVOTDATA(\" BAS055\",TABLAS!$A$130)","v":0},{"$f":"+GETPIVOTDATA(\" BAS056\",TABLAS!$A$130)","v":0},{"$f":"SUM(C84+D84+E84+F84+G84+H84+I84+J84+K84+L84)","v":30},null,null,null,{"$f":"+Q70+1","v":48},{"$f":"+Q84+1","v":49},{"$f":"+R84+1","v":50},51,52,53,54,55,56,null,null,null,{"$f":"IF(LEN(Q84)=1,CONCATENATE(\"00\",Q84),IF(LEN(Q84)=2,CONCATENATE(\"0\",Q84),Q84))","v":"048"},"049","050","051","052","053","054","055","056",null,null,{"$f":"$AI$23&AC84&$AJ$22","v":"=+IMPORTARDATOSDINAMICOS(\" BAS048\";TABLAS!$A$281)"},{"$f":"$AI$23&AD84&$AJ$22","v":"=+IMPORTARDATOSDINAMICOS(\" BAS049\";TABLAS!$A$281)"},"=+IMPORTARDATOSDINAMICOS(\" BAS050\";TABLAS!$A$281)","=+IMPORTARDATOSDINAMICOS(\" BAS051\";TABLAS!$A$281)","=+IMPORTARDATOSDINAMICOS(\" BAS052\";TABLAS!$A$281)","=+IMPORTARDATOSDINAMICOS(\" BAS053\";TABLAS!$A$281)","=+IMPORTARDATOSDINAMICOS(\" BAS054\";TABLAS!$A$281)","=+IMPORTARDATOSDINAMICOS(\" BAS055\";TABLAS!$A$281)","=+IMPORTARDATOSDINAMICOS(\" BAS056\";TABLAS!$A$281)"]
[null,"Lectura de PPD",null,{"$f":"+GETPIVOTDATA(\" BAS057\",TABLAS!$A$130)","v":6},{"$f":"+GETPIVOTDATA(\" BAS058\",TABLAS!$A$130)","v":0},{"$f":"+GETPIVOTDATA(\" BAS059\",TABLAS!$A$130)","v":1},{"$f":"+GETPIVOTDATA(\" BAS060\",TABLAS!$A$130)","v":0},{"$f":"+GETPIVOTDATA(\" BAS061\",TABLAS!$A$130)","v":0},{"$f":"+GETPIVOTDATA(\" BAS062\",TABLAS!$A$130)","v":0},{"$f":"+GETPIVOTDATA(\" BAS063\",TABLAS!$A$130)","v":0},{"$f":"+GETPIVOTDATA(\" BAS064\",TABLAS!$A$130)","v":0},{"$f":"+GETPIVOTDATA(\" BAS065\",TABLAS!$A$130)","v":0},7,null,null,null,{"$f":"+Y84+1","v":57},{"$f":"+Q85+1","v":58},59,60,61,62,63,64,65,null,null,null,"057","058","059","060","061","062","063","064","065",null,null,{"$f":"$AI$23&AC85&$AJ$22","v":"=+IMPORTARDATOSDINAMICOS(\" BAS057\";TABLAS!$A$281)"},"=+IMPORTARDATOSDINAMICOS(\" BAS058\";TABLAS!$A$281)","=+IMPORTARDATOSDINAMICOS(\" BAS059\";TABLAS!$A$281)","=+IMPORTARDATOSDINAMICOS(\" BAS060\";TABLAS!$A$281)","=+IMPORTARDATOSDINAMICOS(\" BAS061\";TABLAS!$A$281)","=+IMPORTARDATOSDINAMICOS(\" BAS062\";TABLAS!$A$281)","=+IMPORTARDATOSDINAMICOS(\" BAS063\";TABLAS!$A$281)","=+IMPORTARDATOSDINAMICOS(\" BAS064\";TABLAS!$A$281)","=+IMPORTARDATOSDINAMICOS(\" BAS065\";TABLAS!$A$281)"]
[null,"Aplicación de IGRA",null,{"$f":"+GETPIVOTDATA(\" BAS066\",TABLAS!$A$130)","v":0},{"$f":"+GETPIVOTDATA(\" BAS067\",TABLAS!$A$130)","v":0},{"$f":"+GETPIVOTDATA(\" BAS068\",TABLAS!$A$130)","v":0},{"$f":"+GETPIVOTDATA(\" BAS069\",TABLAS!$A$130)","v":0},{"$f":"+GETPIVOTDATA(\" BAS070\",TABLAS!$A$130)","v":0},{"$f":"+GETPIVOTDATA(\" BAS071\",TABLAS!$A$130)","v":0},{"$f":"+GETPIVOTDATA(\" BAS072\",TABLAS!$A$130)","v":0},{"$f":"+GETPIVOTDATA(\" BAS073\",TABLAS!$A$130)","v":0},{"$f":"+GETPIVOTDATA(\" BAS074\",TABLAS!$A$130)","v":0},0,null,null,null,{"$f":"+Y85+1","v":66},67,68,69,70,71,72,73,74,null,null,null,"066","067","068","069","070","071","072","073","074",null,null,"=+IMPORTARDATOSDINAMICOS(\" BAS066\";TABLAS!$A$281)","=+IMPORTARDATOSDINAMICOS(\" BAS067\";TABLAS!$A$281)","=+IMPORTARDATOSDINAMICOS(\" BAS068\";TABLAS!$A$281)","=+IMPORTARDATOSDINAMICOS(\" BAS069\";TABLAS!$A$281)","=+IMPORTARDATOSDINAMICOS(\" BAS070\";TABLAS!$A$281)","=+IMPORTARDATOSDINAMICOS(\" BAS071\";TABLAS!$A$281)","=+IMPORTARDATOSDINAMICOS(\" BAS072\";TABLAS!$A$281)","=+IMPORTARDATOSDINAMICOS(\" BAS073\";TABLAS!$A$281)","=+IMPORTARDATOSDINAMICOS(\" BAS074\";TABLAS!$A$281)"]
[null,"Lectura de IGRA",null,{"$f":"+GETPIVOTDATA(\" BAS075\",TABLAS!$A$130)","v":0},{"$f":"+GETPIVOTDATA(\" BAS076\",TABLAS!$A$130)","v":0},{"$f":"+GETPIVOTDATA(\" BAS077\",TABLAS!$A$130)","v":0},{"$f":"+GETPIVOTDATA(\" BAS078\",TABLAS!$A$130)","v":0},{"$f":"+GETPIVOTDATA(\" BAS079\",TABLAS!$A$130)","v":0},{"$f":"+GETPIVOTDATA(\" BAS080\",TABLAS!$A$130)","v":0},{"$f":"+GETPIVOTDATA(\" BAS081\",TABLAS!$A$130)","v":0},{"$f":"+GETPIVOTDATA(\" BAS082\",TABLAS!$A$130)","v":0},{"$f":"+GETPIVOTDATA(\" BAS083\",TABLAS!$A$130)","v":0},0,null,null,null,75,76,77,78,79,80,81,82,83,null,null,null,"075","076","077","078","079","080","081","082","083",null,null,"=+IMPORTARDATOSDINAMICOS(\" BAS075\";TABLAS!$A$281)","=+IMPORTARDATOSDINAMICOS(\" BAS076\";TABLAS!$A$281)","=+IMPORTARDATOSDINAMICOS(\" BAS077\";TABLAS!$A$281)","=+IMPORTARDATOSDINAMICOS(\" BAS078\";TABLAS!$A$281)","=+IMPORTARDATOSDINAMICOS(\" BAS079\";TABLAS!$A$281)","=+IMPORTARDATOSDINAMICOS(\" BAS080\";TABLAS!$A$281)","=+IMPORTARDATOSDINAMICOS(\" BAS081\";TABLAS!$A$281)","=+IMPORTARDATOSDINAMICOS(\" BAS082\";TABLAS!$A$281)","=+IMPORTARDATOSDINAMICOS(\" BAS083\";TABLAS!$A$281)"]
[null,"Administración de terapia preventiva para contactos de TB sensible",null,{"$f":"+GETPIVOTDATA(\" BAS084\",TABLAS!$A$130)","v":38},null,null,null,null,null,null,null,null,38,null,null,null,84,null,null,null,null,null,null,null,null,null,null,null,"084",null,null,null,null,null,null,null,null,null,null,"=+IMPORTARDATOSDINAMICOS(\" BAS084\";TABLAS!$A$281)"]
[null,"Administración de terapia preventiva para contactos de TB resistente",null,{"$f":"+GETPIVOTDATA(\" BAS085\",TABLAS!$A$130)","v":0},null,null,null,null,null,null,null,null,0,null,null,null,{"$f":"+Q88+1","v":85},null,null,null,null,null,null,null,null,null,null,null,"085",null,null,null,null,null,null,null,null,null,null,"=+IMPORTARDATOSDINAMICOS(\" BAS085\";TABLAS!$A$281)"]
[null,"Administración de terapia preventiva para población vulnerable para TB",null,null,{"$f":"+GETPIVOTDATA(\" BAS086\",TABLAS!$A$130)","v":0},{"$f":"+GETPIVOTDATA(\" BAS087\",TABLAS!$A$130)","v":0},{"$f":"+GETPIVOTDATA(\" BAS088\",TABLAS!$A$130)","v":0},{"$f":"+GETPIVOTDATA(\" BAS089\",TABLAS!$A$130)","v":0},{"$f":"+GETPIVOTDATA(\" BAS090\",TABLAS!$A$130)","v":0},{"$f":"+GETPIVOTDATA(\" BAS091\",TABLAS!$A$130)","v":0},{"$f":"+GETPIVOTDATA(\" BAS092\",TABLAS!$A$130)","v":0},{"$f":"+GETPIVOTDATA(\" BAS093\",TABLAS!$A$130)","v":0},0,null,null,null,null,{"$f":"+Q89+1","v":86},{"$f":"+R90+1","v":87},88,89,90,91,92,93,null,null,null,null,{"$f":"IF(LEN(R90)=1,CONCATENATE(\"00\",R90),IF(LEN(R90)=2,CONCATENATE(\"0\",R90),R90))","v":"086"},"087","088","089","090","091","092","093",null,null,null,{"$f":"$AI$23&AD90&$AJ$22","v":"=+IMPORTARDATOSDINAMICOS(\" BAS086\";TABLAS!$A$281)"},"=+IMPORTARDATOSDINAMICOS(\" BAS087\";TABLAS!$A$281)","=+IMPORTARDATOSDINAMICOS(\" BAS088\";TABLAS!$A$281)","=+IMPORTARDATOSDINAMICOS(\" BAS089\";TABLAS!$A$281)","=+IMPORTARDATOSDINAMICOS(\" BAS090\";TABLAS!$A$281)","=+IMPORTARDATOSDINAMICOS(\" BAS091\";TABLAS!$A$281)","=+IMPORTARDATOSDINAMICOS(\" BAS092\";TABLAS!$A$281)","=+IMPORTARDATOSDINAMICOS(\" BAS093\";TABLAS!$A$281)"]
[null,"Caso probable",{"$f":"+GETPIVOTDATA(\" BAS094\",TABLAS!$A$130)","v":0},{"$f":"+GETPIVOTDATA(\" BAS095\",TABLAS!$A$130)","v":0},{"$f":"+GETPIVOTDATA(\" BAS096\",TABLAS!$A$130)","v":0},{"$f":"+GETPIVOTDATA(\" BAS097\",TABLAS!$A$130)","v":0},{"$f":"+GETPIVOTDATA(\" BAS098\",TABLAS!$A$130)","v":0},{"$f":"+GETPIVOTDATA(\" BAS099\",TABLAS!$A$130)","v":0},{"$f":"+GETPIVOTDATA(\" BAS100\",TABLAS!$A$130)","v":0},{"$f":"+GETPIVOTDATA(\" BAS101\",TABLAS!$A$130)","v":0},{"$f":"+GETPIVOTDATA(\" BAS102\",TABLAS!$A$130)","v":0},{"$f":"+GETPIVOTDATA(\" BAS103\",TABLAS!$A$130)","v":0},0,null,null,null,94,{"$f":"+Q91+1","v":95},96,97,98,99,100,101,102,103,null,null,{"$f":"IF(LEN(Q91)=1,CONCATENATE(\"00\",Q91),IF(LEN(Q91)=2,CONCATENATE(\"0\",Q91),Q91))","v":"094"},"095","096","097","098","099",100,101,102,103,null,{"$f":"$AI$23&AC91&$AJ$22","v":"=+IMPORTARDATOSDINAMICOS(\" BAS094\";TABLAS!$A$281)"},"=+IMPORTARDATOSDINAMICOS(\" BAS095\";TABLAS!$A$281)","=+IMPORTARDATOSDINAMICOS(\" BAS096\";TABLAS!$A$281)","=+IMPORTARDATOSDINAMICOS(\" BAS097\";TABLAS!$A$281)","=+IMPORTARDATOSDINAMICOS(\" BAS098\";TABLAS!$A$281)","=+IMPORTARDATOSDINAMICOS(\" BAS099\";TABLAS!$A$281)","=+IMPORTARDATOSDINAMICOS(\" BAS100\";TABLAS!$A$281)","=+IMPORTARDATOSDINAMICOS(\" BAS101\";TABLAS!$A$281)","=+IMPORTARDATOSDINAMICOS(\" BAS102\";TABLAS!$A$281)","=+IMPORTARDATOSDINAMICOS(\" BAS103\";TABLAS!$A$281)"]
[null,"Sintomático respiratorio identificado",{"$f":"+GETPIVOTDATA(\" BAS104\",TABLAS!$A$130)","v":125},{"$f":"+GETPIVOTDATA(\" BAS105\",TABLAS!$A$130)","v":3},{"$f":"+GETPIVOTDATA(\" BAS106\",TABLAS!$A$130)","v":0},{"$f":"+GETPIVOTDATA(\" BAS107\",TABLAS!$A$130)","v":1},{"$f":"+GETPIVOTDATA(\" BAS108\",TABLAS!$A$130)","v":0},{"$f":"+GETPIVOTDATA(\" BAS109\",TABLAS!$A$130)","v":13},{"$f":"+GETPIVOTDATA(\" BAS110\",TABLAS!$A$130)","v":0},{"$f":"+GETPIVOTDATA(\" BAS111\",TABLAS!$A$130)","v":0},{"$f":"+GETPIVOTDATA(\" BAS112\",TABLAS!$A$130)","v":0},{"$f":"+GETPIVOTDATA(\" BAS113\",TABLAS!$A$130)","v":0},142,null,null,null,{"$f":"+Z91+1","v":104},105,106,107,108,109,110,111,112,113,null,null,104,105,106,107,108,109,110,111,112,113,null,"=+IMPORTARDATOSDINAMICOS(\" BAS104\";TABLAS!$A$281)","=+IMPORTARDATOSDINAMICOS(\" BAS105\";TABLAS!$A$281)","=+IMPORTARDATOSDINAMICOS(\" BAS106\";TABLAS!$A$281)","=+IMPORTARDATOSDINAMICOS(\" BAS107\";TABLAS!$A$281)","=+IMPORTARDATOSDINAMICOS(\" BAS108\";TABLAS!$A$281)","=+IMPORTARDATOSDINAMICOS(\" BAS109\";TABLAS!$A$281)","=+IMPORTARDATOSDINAMICOS(\" BAS110\";TABLAS!$A$281)","=+IMPORTARDATOSDINAMICOS(\" BAS111\";TABLAS!$A$281)","=+IMPORTARDATOSDINAMICOS(\" BAS112\";TABLAS!$A$281)","=+IMPORTARDATOSDINAMICOS(\" BAS113\";TABLAS!$A$281)"]
[null,"Sintomático respiratorio examinado",{"$f":"+GETPIVOTDATA(\" BAS114\",TABLAS!$A$130)","v":104},{"$f":"+GETPIVOTDATA(\" BAS115\",TABLAS!$A$130)","v":3},{"$f":"+GETPIVOTDATA(\" BAS116\",TABLAS!$A$130)","v":0},{"$f":"+GETPIVOTDATA(\" BAS117\",TABLAS!$A$130)","v":1},{"$f":"+GETPIVOTDATA(\" BAS118\",TABLAS!$A$130)","v":0},{"$f":"+GETPIVOTDATA(\" BAS119\",TABLAS!$A$130)","v":33},{"$f":"+GETPIVOTDATA(\" BAS120\",TABLAS!$A$130)","v":0},{"$f":"+GETPIVOTDATA(\" BAS121\",TABLAS!$A$130)","v":0},{"$f":"+GETPIVOTDATA(\" BAS122\",TABLAS!$A$130)","v":0},{"$f":"+GETPIVOTDATA(\" BAS123\",TABLAS!$A$130)","v":0},141,null,null,null,{"$f":"+Z92+1","v":114},115,116,117,118,119,120,121,122,123,null,null,114,115,116,117,118,119,120,121,122,123,null,"=+IMPORTARDATOSDINAMICOS(\" BAS114\";TABLAS!$A$281)","=+IMPORTARDATOSDINAMICOS(\" BAS115\";TABLAS!$A$281)","=+IMPORTARDATOSDINAMICOS(\" BAS116\";TABLAS!$A$281)","=+IMPORTARDATOSDINAMICOS(\" BAS117\";TABLAS!$A$281)","=+IMPORTARDATOSDINAMICOS(\" BAS118\";TABLAS!$A$281)","=+IMPORTARDATOSDINAMICOS(\" BAS119\";TABLAS!$A$281)","=+IMPORTARDATOSDINAMICOS(\" BAS120\";TABLAS!$A$281)","=+IMPORTARDATOSDINAMICOS(\" BAS121\";TABLAS!$A$281)","=+IMPORTARDATOSDINAMICOS(\" BAS122\";TABLAS!$A$281)","=+IMPORTARDATOSDINAMICOS(\" BAS123\";TABLAS!$A$281)"]
[null,"SR examinados con bacteriología confirmada",{"$f":"+GETPIVOTDATA(\" BAS124\",TABLAS!$A$130)","v":0},{"$f":"+GETPIVOTDATA(\" BAS125\",TABLAS!$A$130)","v":0},{"$f":"+GETPIVOTDATA(\" BAS126\",TABLAS!$A$130)","v":0},{"$f":"+GETPIVOTDATA(\" BAS127\",TABLAS!$A$130)","v":0},{"$f":"+GETPIVOTDATA(\" BAS128\",TABLAS!$A$130)","v":0},{"$f":"+GETPIVOTDATA(\" BAS129\",TABLAS!$A$130)","v":0},{"$f":"+GETPIVOTDATA(\" BAS130\",TABLAS!$A$130)","v":0},{"$f":"+GETPIVOTDATA(\" BAS131\",TABLAS!$A$130)","v":0},{"$f":"+GETPIVOTDATA(\" BAS132\",TABLAS!$A$130)","v":0},{"$f":"+GETPIVOTDATA(\" BAS133\",TABLAS!$A$130)","v":0},0,null,null,null,124,125,126,127,128,129,130,131,132,133,null,null,124,125,126,127,128,129,130,131,132,133,null,"=+IMPORTARDATOSDINAMICOS(\" BAS124\";TABLAS!$A$281)","=+IMPORTARDATOSDINAMICOS(\" BAS125\";TABLAS!$A$281)","=+IMPORTARDATOSDINAMICOS(\" BAS126\";TABLAS!$A$281)","=+IMPORTARDATOSDINAMICOS(\" BAS127\";TABLAS!$A$281)","=+IMPORTARDATOSDINAMICOS(\" BAS128\";TABLAS!$A$281)","=+IMPORTARDATOSDINAMICOS(\" BAS129\";TABLAS!$A$281)","=+IMPORTARDATOSDINAMICOS(\" BAS130\";TABLAS!$A$281)","=+IMPORTARDATOSDINAMICOS(\" BAS131\";TABLAS!$A$281)","=+IMPORTARDATOSDINAMICOS(\" BAS132\";TABLAS!$A$281)","=+IMPORTARDATOSDINAMICOS(\" BAS133\";TABLAS!$A$281)"]

{"sheet":"TBC3059","index":6,"n_rows":94,"n_cols":49,"rows_kept":94,"cut":false,"hidden":false,"merged":[[81,12,82,12],[66,1,67,1],[66,3,67,3],[66,5,67,5],[68,2,68,4],[69,2,69,4],[81,1,82,1],[81,2,81,11],[58,1,58,2],[58,4,58,6],[61,1,61,2],[62,1,65,1],[62,2,63,2],[62,5,65,5],[64,2,65,2],[56,7,57,7],[56,9,56,10],[57,9,57,10],[43,1,44,2],[43,8,43,9],[45,1,45,2],[45,8,45,9],[46,1,47,2],[46,4,47,5],[53,4,53,5],[53,9,53,10],[54,7,55,7],[54,9,54,10],[55,9,55,10],[40,1,40,2],[40,8,40,9],[41,1,41,2],[41,8,41,9],[42,1,42,2],[42,8,42,9],[33,1,33,2],[33,6,33,7],[34,1,34,2],[34,6,34,7],[35,1,35,2],[35,6,35,7],[32,1,32,2],[22,1,22,3],[22,4,23,4],[22,6,22,7],[23,6,24,6],[25,6,25,7],[26,1,26,3],[26,6,26,8],[27,1,27,2],[27,6,27,8],[28,1,28,2],[29,1,29,2],[30,1,30,2],[21,6,21,7],[8,2,8,3],[9,2,9,3],[9,6,9,9],[10,2,10,3],[11,2,11,3],[11,6,11,7],[12,2,12,3],[13,2,13,3],[14,2,14,3],[15,2,15,3],[21,1,21,4],[7,2,7,3],[7,6,7,9],[1,1,1,11],[2,1,2,12],[5,2,5,3],[5,6,5,7],[6,2,6,3],[3,1,3,12]]}
[]
[]
[null,"REPORTE MENSUAL DE ACTIVIDADES DE PREVENCION Y CONTROL DE TUBERCULOSIS [30-59]"]
[null,"CURSO DE VIDA : ADULTO"]
[]
[null,"DIRESA","CUSCO",null,null,"REGION","CUSCO"]
[]
[null,"RED DE SALUD ",{"$f":"+TABLAS!O9","v":"03 - LA CONVENCION"},null,null,"EJECUTORA",{"$f":"+TABLAS!O14","v":""}]
[]
[null,"MICRO RED",{"$f":"+TABLAS!O10","v":""},null,null,"RESPONSABLE"]
[]
[null,"EE.SS.",{"$f":"+TABLAS!O11","v":""},null,null,"COD. RENAES",{"$f":"+TABLAS!Q11","v":""}]
[]
[null,"PROVINCIA",{"$f":"+TABLAS!O12","v":""},null,null,"AÑO",{"$f":"+TABLAS!J16","v":"2025"}]
[]
[null,"DISTRITO",{"$f":"+TABLAS!O13","v":""},null,null,"MES",{"$f":"+TABLAS!N26","v":"ENE - MAR"}]
[]
[null,"INSTITUCION :  MINSA (  X  )   ESSALUD (     )   FFAA  (     )   PNP  (     )   INPE  (     )   OTROS  (     )"]
[]
[null,"I. ACTIVIDADES DE DETECCION Y DIAGNOSTICO PARA TUBERCULOSIS"]
[]
[null,"DETECCIÓN DE CASOS",null,null,null,null,"RECOLECCIÓN DE MUESTRAS PARA EXAMEN BACTERIOLÓGICO",null,"N°",null,null,null,null,null,null,null,null,null,null,null,null,null,null,null,null,null,null,null,null,null,null,null,null,null,null,"\";TABLAS!$A$281)"]
[null,"Sintomático respiratorio (SR)",null,null,"Caso probable de TB",null,"RECOLECCIÓN DE MUESTRAS PARA TB*",null,{"$f":"+GETPIVOTDATA(\" BAS001\",TABLAS!$A$168)","v":1900},null,null,null,null,null,null,null,1,null,null,null,null,null,null,null,null,null,null,null,{"$f":"IF(LEN(Q23)=1,CONCATENATE(\"00\",Q23),IF(LEN(Q23)=2,CONCATENATE(\"0\",Q23),Q23))","v":"001"},null,null,null,null,null,"=+IMPORTARDATOSDINAMICOS(\" BAS",null,null,null,null,{"$f":"$AI$23&AC23&$AJ$22","v":"=+IMPORTARDATOSDINAMICOS(\" BAS001\";TABLAS!$A$281)"}]
[null,"SR Identificado","SR Examinado","SR examinados con bacteriología confirmada",null,null,"PROCEDIMIENTOS ESPECIALES PARA OBTENCION DE MUESTRAS","Lavado gástrico",{"$f":"+GETPIVOTDATA(\" BAS002\",TABLAS!$A$168)","v":0},null,null,null,null,null,null,null,{"$f":"+Q23+1","v":2},null,null,null,null,null,null,null,null,null,null,null,"002",null,null,null,null,null,null,null,null,null,null,{"$f":"$AI$23&AC24&$AJ$22","v":"=+IMPORTARDATOSDINAMICOS(\" BAS002\";TABLAS!$A$281)"}]
[null,{"$f":"M92","v":554},{"$f":"M93","v":527},{"$f":"M94","v":4},{"$f":"M91","v":0},null,null,"Inducción del esputo",{"$f":"+GETPIVOTDATA(\" BAS003\",TABLAS!$A$168)","v":0},null,null,null,null,null,null,null,{"$f":"+Q24+1","v":3},null,null,null,null,null,null,null,null,null,null,null,"003",null,null,null,null,null,null,null,null,null,null,"=+IMPORTARDATOSDINAMICOS(\" BAS003\";TABLAS!$A$281)"]
[null,null,null,null,null,null,"TOTAL",null,{"$f":"SUM(I23+I24+I25)","v":1900}]
[null,"SR examinados con bacteriología confirmada",null,null,null,null,"*Muestra recolectada por expectoración espontánea"]
[null,"Por baciloscopia",null,{"$f":"+GETPIVOTDATA(\" BAS004\",TABLAS!$A$168)","v":3},null,null,"REFERENCIAS",null,null,null,null,null,null,null,null,null,{"$f":"+Q25+1","v":4},null,null,null,null,null,null,null,null,null,null,null,{"$f":"IF(LEN(Q28)=1,CONCATENATE(\"00\",Q28),IF(LEN(Q28)=2,CONCATENATE(\"0\",Q28),Q28))","v":"004"},null,null,null,null,null,null,null,null,null,null,{"$f":"$AI$23&AC28&$AJ$22","v":"=+IMPORTARDATOSDINAMICOS(\" BAS004\";TABLAS!$A$281)"}]
[null,"Por prueba molecular",null,{"$f":"+GETPIVOTDATA(\" BAS005\",TABLAS!$A$168)","v":1},null,null,"Condición","Derivaciones","Transferencias",null,null,null,null,null,null,null,{"$f":"+Q28+1","v":5},null,null,{"$f":"+Q30+1","v":7},{"$f":"+T29+1","v":8},null,null,null,null,null,null,null,"005",null,null,{"$f":"IF(LEN(T29)=1,CONCATENATE(\"00\",T29),IF(LEN(T29)=2,CONCATENATE(\"0\",T29),T29))","v":"007"},"008",null,null,null,null,null,null,"=+IMPORTARDATOSDINAMICOS(\" BAS005\";TABLAS!$A$281)",null,null,{"$f":"$AI$23&AF29&$AJ$22","v":"=+IMPORTARDATOSDINAMICOS(\" BAS007\";TABLAS!$A$281)"},"=+IMPORTARDATOSDINAMICOS(\" BAS008\";TABLAS!$A$281)"]
[null,"Por cultivo",null,{"$f":"+GETPIVOTDATA(\" BAS006\",TABLAS!$A$168)","v":0},null,null,"Realizadas",{"$f":"+GETPIVOTDATA(\" BAS007\",TABLAS!$A$168)","v":0},{"$f":"+GETPIVOTDATA(\" BAS008\",TABLAS!$A$168)","v":0},null,null,null,null,null,null,null,{"$f":"+Q29+1","v":6},null,null,{"$f":"+U29+1","v":9},{"$f":"+T30+1","v":10},null,null,null,null,null,null,null,"006",null,null,"009","010",null,null,null,null,null,null,"=+IMPORTARDATOSDINAMICOS(\" BAS006\";TABLAS!$A$281)",null,null,"=+IMPORTARDATOSDINAMICOS(\" BAS009\";TABLAS!$A$281)","=+IMPORTARDATOSDINAMICOS(\" BAS010\";TABLAS!$A$281)"]
[null,"TOTAL",null,{"$f":"SUM(D28+D29+D30)","v":4},null,null,"Aceptadas",{"$f":"+GETPIVOTDATA(\" BAS009\",TABLAS!$A$168)","v":4},{"$f":"+GETPIVOTDATA(\" BAS010\",TABLAS!$A$168)","v":0}]
[null,null,null,null,null,null,"TOTAL",{"$f":"SUM(H30+H31)","v":4},{"$f":"SUM(I30+I31)","v":0}]
[null,"COMORBILIDADES Y CONDICIONES ASOCIADAS",null,"N°"]
[null,"TB-VIH/SIDA",null,{"$f":"+GETPIVOTDATA(\" BAS011\",TABLAS!$A$168)","v":0},null,null,"TAMIZAJE DE COMORBILIDADES",null,"N°",null,null,null,null,null,null,null,{"$f":"+U30+1","v":11},null,null,null,null,null,null,null,null,null,null,null,{"$f":"IF(LEN(Q34)=1,CONCATENATE(\"00\",Q34),IF(LEN(Q34)=2,CONCATENATE(\"0\",Q34),Q34))","v":"011"},null,null,null,null,null,null,null,null,null,null,{"$f":"$AI$23&AC34&$AJ$22","v":"=+IMPORTARDATOSDINAMICOS(\" BAS011\";TABLAS!$A$281)"}]
[null,"TB-DM",null,{"$f":"+GETPIVOTDATA(\" BAS012\",TABLAS!$A$168)","v":0},null,null,"Tamizaje TB-VIH",null,{"$f":"+GETPIVOTDATA(\" BAS014\",TABLAS!$A$168)","v":9},null,null,null,null,null,null,null,{"$f":"+Q34+1","v":12},null,{"$f":"+Q36+1","v":14},null,null,null,null,null,null,null,null,null,"012",null,{"$f":"IF(LEN(S35)=1,CONCATENATE(\"00\",S35),IF(LEN(S35)=2,CONCATENATE(\"0\",S35),S35))","v":"014"},null,null,null,null,null,null,null,null,"=+IMPORTARDATOSDINAMICOS(\" BAS012\";TABLAS!$A$281)",null,{"$f":"$AI$23&AE35&$AJ$22","v":"=+IMPORTARDATOSDINAMICOS(\" BAS014\";TABLAS!$A$281)"}]
[null,"Reacción adversa a medicamentos para TB",null,{"$f":"+GETPIVOTDATA(\" BAS013\",TABLAS!$A$168)","v":0},null,null,"Tamizaje TB-DM",null,{"$f":"+GETPIVOTDATA(\" BAS015\",TABLAS!$A$168)","v":7},null,null,null,null,null,null,null,13,null,{"$f":"+S35+1","v":15},null,null,null,null,null,null,null,null,null,"013",null,"015",null,null,null,null,null,null,null,null,"=+IMPORTARDATOSDINAMICOS(\" BAS013\";TABLAS!$A$281)",null,"=+IMPORTARDATOSDINAMICOS(\" BAS015\";TABLAS!$A$281)"]
[]
[]
[null,"II. ACTIVIDADES PARA LA RECUPERACION DE LA PERSONA AFECTADA POR TUBERCULOSIS"]
[]
[null,"ATENCIÓN MULTIDISCIPLINARIA",null,"MODALIDAD","EN PAT CON TB SENSIBLE","EN PAT CON TB RESISTENTE","TOTAL",null,2,null,"N°"]
[null,"Evaluación médica",null,null,{"$f":"+GETPIVOTDATA(\" BAS016\",TABLAS!$A$168)","v":6},{"$f":"+GETPIVOTDATA(\" BAS017\",TABLAS!$A$168)","v":1},{"$f":"SUM(E42+F42)","v":7},null,"Administración de tratamiento para TB sensible",null,{"$f":"+GETPIVOTDATA(\" BAS028\",TABLAS!$A$168)","v":945},null,null,null,null,null,{"$f":"+S36+1","v":16},{"$f":"+Q42+1","v":17},null,null,null,{"$f":"+Q48+1","v":28},null,null,null,null,null,null,{"$f":"IF(LEN(Q42)=1,CONCATENATE(\"00\",Q42),IF(LEN(Q42)=2,CONCATENATE(\"0\",Q42),Q42))","v":"016"},"017",null,null,null,{"$f":"IF(LEN(V42)=1,CONCATENATE(\"00\",V42),IF(LEN(V42)=2,CONCATENATE(\"0\",V42),V42))","v":"028"},null,null,null,null,null,{"$f":"$AI$23&AC42&$AJ$22","v":"=+IMPORTARDATOSDINAMICOS(\" BAS016\";TABLAS!$A$281)"},"=+IMPORTARDATOSDINAMICOS(\" BAS017\";TABLAS!$A$281)",null,null,null,{"$f":"$AI$23&AH42&$AJ$22","v":"=+IMPORTARDATOSDINAMICOS(\" BAS028\";TABLAS!$A$281)"}]
[null,"Atención en consultorio de enfermería",null,null,{"$f":"+GETPIVOTDATA(\" BAS018\",TABLAS!$A$168)","v":0},{"$f":"+GETPIVOTDATA(\" BAS019\",TABLAS!$A$168)","v":0},{"$f":"SUM(E43+F43)","v":0},null,"Administración de tratamiento para TB resistente",null,{"$f":"+GETPIVOTDATA(\" BAS029\",TABLAS!$A$168)","v":75},null,null,null,null,null,{"$f":"+R42+1","v":18},{"$f":"+Q43+1","v":19},null,null,null,{"$f":"+V42+1","v":29},null,null,null,null,null,null,"018","019",null,null,null,"029",null,null,null,null,null,"=+IMPORTARDATOSDINAMICOS(\" BAS018\";TABLAS!$A$281)","=+IMPORTARDATOSDINAMICOS(\" BAS019\";TABLAS!$A$281)",null,null,null,"=+IMPORTARDATOSDINAMICOS(\" BAS029\";TABLAS!$A$281)"]
[null,"Atención de servicio social",null,"En el establecimiento de salud",{"$f":"+GETPIVOTDATA(\" BAS020\",TABLAS!$A$168)","v":0},{"$f":"+GETPIVOTDATA(\" BAS021\",TABLAS!$A$168)","v":0},{"$f":"SUM(E44+F44)","v":0},null,"Control de tratamiento",null,{"$f":"+GETPIVOTDATA(\" BAS030\",TABLAS!$A$168)","v":39},null,null,null,null,null,{"$f":"+R43+1","v":20},21,null,null,null,{"$f":"+V43+1","v":30},null,null,null,null,null,null,"020","021",null,null,null,"030",null,null,null,null,null,"=+IMPORTARDATOSDINAMICOS(\" BAS020\";TABLAS!$A$281)","=+IMPORTARDATOSDINAMICOS(\" BAS021\";TABLAS!$A$281)",null,null,null,"=+IMPORTARDATOSDINAMICOS(\" BAS030\";TABLAS!$A$281)"]
[null,null,null,"Mediante teleconsulta en línea",{"$f":"+GETPIVOTDATA(\" BAS022\",TABLAS!$A$168)","v":0},{"$f":"+GETPIVOTDATA(\" BAS023\",TABLAS!$A$168)","v":0},{"$f":"SUM(E45+F45)","v":0},null,null,null,null,null,null,null,null,null,22,23,null,null,null,null,null,null,null,null,null,null,"022","023",null,null,null,null,null,null,null,null,null,"=+IMPORTARDATOSDINAMICOS(\" BAS022\";TABLAS!$A$281)","=+IMPORTARDATOSDINAMICOS(\" BAS023\";TABLAS!$A$281)"]
[null,"Atención en nutrición",null,null,{"$f":"+GETPIVOTDATA(\" BAS024\",TABLAS!$A$168)","v":7},{"$f":"+GETPIVOTDATA(\" BAS025\",TABLAS!$A$168)","v":0},{"$f":"SUM(E46+F46)","v":7},null,"RETO ANTE REACCIONES ADVERSAS",null,null,null,null,null,null,null,24,25,null,null,null,null,null,null,null,null,null,null,"024","025",null,null,null,null,null,null,null,null,null,"=+IMPORTARDATOSDINAMICOS(\" BAS024\";TABLAS!$A$281)","=+IMPORTARDATOSDINAMICOS(\" BAS025\";TABLAS!$A$281)"]
[null,"Atención en salud mental",null,"En el establecimiento de salud",null,null,{"$f":"+GETPIVOTDATA(\" BAS026\",TABLAS!$A$168)","v":0},null,"Condición","N°",null,null,null,null,null,null,26,null,null,null,null,null,null,null,null,null,null,null,"026",null,null,null,null,null,null,null,null,null,null,"=+IMPORTARDATOSDINAMICOS(\" BAS026\";TABLAS!$A$281)"]
[null,null,null,"Mediante teleorientación síncrona",null,null,{"$f":"+GETPIVOTDATA(\" BAS027\",TABLAS!$A$168)","v":0},null,"Inicio",{"$f":"+GETPIVOTDATA(\" BAS031\",TABLAS!$A$168)","v":0},null,"REGISTRO EN EL PADRON DE BENEFICIARIOS PANTBC",null,null,null,null,{"$f":"+Q47+1","v":27},null,null,null,null,{"$f":"+V44+1","v":31},null,null,null,null,null,null,"027",null,null,null,null,{"$f":"IF(LEN(V48)=1,CONCATENATE(\"00\",V48),IF(LEN(V48)=2,CONCATENATE(\"0\",V48),V48))","v":"031"},null,null,null,null,null,"=+IMPORTARDATOSDINAMICOS(\" BAS027\";TABLAS!$A$281)",null,null,null,null,{"$f":"$AI$23&AH48&$AJ$22","v":"=+IMPORTARDATOSDINAMICOS(\" BAS031\";TABLAS!$A$281)"}]
[null,null,null,null,null,null,null,null,"Término",{"$f":"+GETPIVOTDATA(\" BAS032\",TABLAS!$A$168)","v":0},null,{"$f":"+GETPIVOTDATA(\" BAS033\",TABLAS!$A$168)","v":8},null,null,null,null,null,null,null,null,null,{"$f":"+V48+1","v":32},null,{"$f":"+V49+1","v":33},null,null,null,null,null,null,null,null,null,"032",null,{"$f":"IF(LEN(X49)=1,CONCATENATE(\"00\",X49),IF(LEN(X49)=2,CONCATENATE(\"0\",X49),X49))","v":"033"},null,null,null,null,null,null,null,null,"=+IMPORTARDATOSDINAMICOS(\" BAS032\";TABLAS!$A$281)",null,{"$f":"$AI$23&AJ49&$AJ$22","v":"=+IMPORTARDATOSDINAMICOS(\" BAS033\";TABLAS!$A$281)"}]
[]
[]
[null,"III. ACTIVIDADES DE PREVENCIÓN EN TUBERCULOSIS"]
[]
[null,"CENSO DE CONTACTOS","N°",null,"PRUEBA PARA DIAGNOSTICO DE TB LATENTE",null,"N°","POSITIVOS",null,"TERAPIA PREVENTIVA PARA TUBERCULOSIS LATENTE",null,"N°"]
[null,"En el establecimiento de salud",{"$f":"+GETPIVOTDATA(\" BAS034\",TABLAS!$A$168)","v":5},null,"PPD","Aplicación",{"$f":"M84","v":74},{"$f":"+GETPIVOTDATA(\" BAS037\",TABLAS!$A$168)","v":0},null,"Administración de terapia preventiva para contactos de TB sensible",null,{"$f":"+GETPIVOTDATA(\" BAS039\",TABLAS!$A$168)","v":8},null,null,null,null,{"$f":"+X49+1","v":34},null,{"$f":"+Q57+1","v":37},null,{"$f":"+S57+1","v":39},null,null,null,null,null,null,null,{"$f":"IF(LEN(Q55)=1,CONCATENATE(\"00\",Q55),IF(LEN(Q55)=2,CONCATENATE(\"0\",Q55),Q55))","v":"034"},null,{"$f":"IF(LEN(S55)=1,CONCATENATE(\"00\",S55),IF(LEN(S55)=2,CONCATENATE(\"0\",S55),S55))","v":"037"},null,{"$f":"IF(LEN(U55)=1,CONCATENATE(\"00\",U55),IF(LEN(U55)=2,CONCATENATE(\"0\",U55),U55))","v":"039"},null,null,null,null,null,null,{"$f":"$AI$23&AC55&$AJ$22","v":"=+IMPORTARDATOSDINAMICOS(\" BAS034\";TABLAS!$A$281)"},null,{"$f":"$AI$23&AE55&$AJ$22","v":"=+IMPORTARDATOSDINAMICOS(\" BAS037\";TABLAS!$A$281)"},null,{"$f":"$AI$23&AG55&$AJ$22","v":"=+IMPORTARDATOSDINAMICOS(\" BAS039\";TABLAS!$A$281)"}]
[null,"En el domicilio*",{"$f":"+GETPIVOTDATA(\" BAS035\",TABLAS!$A$168)","v":0},null,null,"Lectura",{"$f":"M85","v":37},null,null,"Administración de terapia preventiva para contactos de TB resistente",null,{"$f":"+GETPIVOTDATA(\" BAS040\",TABLAS!$A$168)","v":1},null,null,null,null,{"$f":"+Q55+1","v":35},null,null,null,{"$f":"+U55+1","v":40},null,null,null,null,null,null,null,"035",null,null,null,{"$f":"IF(LEN(U56)=1,CONCATENATE(\"00\",U56),IF(LEN(U56)=2,CONCATENATE(\"0\",U56),U56))","v":"040"},null,null,null,null,null,null,"=+IMPORTARDATOSDINAMICOS(\" BAS035\";TABLAS!$A$281)",null,null,null,"=+IMPORTARDATOSDINAMICOS(\" BAS040\";TABLAS!$A$281)"]
[null,"Mediante teleorientación síncrona",{"$f":"+GETPIVOTDATA(\" BAS036\",TABLAS!$A$168)","v":0},null,"IGRA","Aplicación",{"$f":"M86","v":0},{"$f":"+GETPIVOTDATA(\" BAS038\",TABLAS!$A$168)","v":0},null,"Administración de terapia preventiva para población vulnerable para TB",null,{"$f":"M90","v":0},null,null,null,null,{"$f":"+Q56+1","v":36},null,{"$f":"+S55+1","v":38},null,null,null,null,null,null,null,null,null,"036",null,{"$f":"IF(LEN(S57)=1,CONCATENATE(\"00\",S57),IF(LEN(S57)=2,CONCATENATE(\"0\",S57),S57))","v":"038"},null,null,null,null,null,null,null,null,"=+IMPORTARDATOSDINAMICOS(\" BAS036\";TABLAS!$A$281)",null,{"$f":"$AI$23&AE57&$AJ$22","v":"=+IMPORTARDATOSDINAMICOS(\" BAS038\";TABLAS!$A$281)"}]
[null,"Total",{"$f":"SUM(C55+C56+C57)","v":5},null,null,"Lectura",{"$f":"M87","v":0},null,null,"TOTAL",null,{"$f":"SUM(L55+L56+L57)","v":9}]
[null,"*Mediante visita familiar",null,null,"TOTAL",null,null,{"$f":"SUM(H55+H57)","v":0}]
[]
[null,"IV. ACTIVIDADES DE PROMOCIÓN DE LA SALUD EN TUBERCULOSIS"]
[null,"ACTIVIDADES",null,"MODALIDAD","N°","TOTAL"]
[null,"Consejeria para TB","Primera","Mediante visita familiar",{"$f":"+GETPIVOTDATA(\" BAS041\",TABLAS!$A$168)","v":0},{"$f":"SUM(E63+E64+E65+E66)","v":0},null,null,null,null,null,null,null,null,null,null,{"$f":"+U56+1","v":41},null,null,null,null,null,null,null,null,null,null,null,{"$f":"IF(LEN(Q63)=1,CONCATENATE(\"00\",Q63),IF(LEN(Q63)=2,CONCATENATE(\"0\",Q63),Q63))","v":"041"},null,null,null,null,null,null,null,null,null,null,{"$f":"$AI$23&AC63&$AJ$22","v":"=+IMPORTARDATOSDINAMICOS(\" BAS041\";TABLAS!$A$281)"}]
[null,null,null,"Mediante teleorientación síncrona",{"$f":"+GETPIVOTDATA(\" BAS042\",TABLAS!$A$168)","v":0},null,null,null,null,null,null,null,null,null,null,null,{"$f":"+Q63+1","v":42},null,null,null,null,null,null,null,null,null,null,null,"042",null,null,null,null,null,null,null,null,null,null,"=+IMPORTARDATOSDINAMICOS(\" BAS042\";TABLAS!$A$281)"]
[null,null,"Segunda","Mediante visita familiar",{"$f":"+GETPIVOTDATA(\" BAS043\",TABLAS!$A$168)","v":0},null,null,null,null,null,null,null,null,null,null,null,{"$f":"+Q64+1","v":43},null,null,null,null,null,null,null,null,null,null,null,"043",null,null,null,null,null,null,null,null,null,null,"=+IMPORTARDATOSDINAMICOS(\" BAS043\";TABLAS!$A$281)"]
[null,null,null,"Mediante teleorientación síncrona",{"$f":"+GETPIVOTDATA(\" BAS044\",TABLAS!$A$168)","v":0},null,null,null,null,null,null,null,null,null,null,null,44,null,null,null,null,null,null,null,null,null,null,null,"044",null,null,null,null,null,null,null,null,null,null,"=+IMPORTARDATOSDINAMICOS(\" BAS044\";TABLAS!$A$281)"]
[null,"Sesión educativa y demostrativa para TB","Primera",null,{"$f":"+GETPIVOTDATA(\" BAS045\",TABLAS!$A$168)","v":0},{"$f":"SUM(E67+E68)","v":0},null,null,null,null,null,null,null,null,null,null,45,null,null,null,null,null,null,null,null,null,null,null,"045",null,null,null,null,null,null,null,null,null,null,"=+IMPORTARDATOSDINAMICOS(\" BAS045\";TABLAS!$A$281)"]
[null,null,"Segunda",null,{"$f":"+GETPIVOTDATA(\" BAS046\",TABLAS!$A$168)","v":0},null,null,null,null,null,null,null,null,null,null,null,46,null,null,null,null,null,null,null,null,null,null,null,"046",null,null,null,null,null,null,null,null,null,null,"=+IMPORTARDATOSDINAMICOS(\" BAS046\";TABLAS!$A$281)"]
[null,"Visitas familiar",null,null,null,{"$f":"SUM(C56+E63+E65)","v":0}]
[null,"Otras consejerias",null,null,null,{"$f":"+GETPIVOTDATA(\" BAS047\",TABLAS!$A$168)","v":7},null,null,null,null,null,null,null,null,null,null,{"$f":"+Q68+1","v":47},null,null,null,null,null,null,null,null,null,null,null,{"$f":"IF(LEN(Q70)=1,CONCATENATE(\"00\",Q70),IF(LEN(Q70)=2,CONCATENATE(\"0\",Q70),Q70))","v":"047"},null,null,null,null,null,null,null,null,null,null,{"$f":"$AI$23&AC70&$AJ$22","v":"=+IMPORTARDATOSDINAMICOS(\" BAS047\";TABLAS!$A$281)"}]
[]
[]
[null,"V. ACTIVIDADES EN TELESALUD"]
[]
[null,"ACTIVIDADES","N°"]
[null,"Teleconsulta en línea",{"$f":"G45","v":0}]
[null,"Teleorientación síncrona",{"$f":"SUM(G48+C57)","v":0}]
[null,"Total",{"$f":"SUM(C76+C77+#REF!)","v":{"$error":"#REF!"}}]
[]
[null,"REPORTE DE ACTIVIDADES SEGMENTADO POR POBLACION AFECTADA Y VULNERABLE"]
[]
[null,"ACTIVIDADES","POBLACION AFECTADA Y VULNERABLE",null,null,null,null,null,null,null,null,null,"TOTAL"]
[null,null,"POBLACIÓN EN GENERAL","CONTACTOS","PERSONA VIVIENDO CON VIH/SIDA","TRABAJADOR DE SALUD","PERSONA CON DIABETES MELLITUS","PPL","PERSONA CON TERAPIA PROLONGADA CON CORTICOIDES","PERSONA CON HEMODIALISIS Y/O ENFERMEDAD RENAL CRÓNICA","PERSONAL PENITENCIARIO","OTRAS CONDICIONES DE SALUD SEGÚN NORMATIVIDAD VIGENTE"]
[null,"Aplicación de PPD",null,{"$f":"+GETPIVOTDATA(\" BAS048\",TABLAS!$A$168)","v":48},{"$f":"+GETPIVOTDATA(\" BAS049\",TABLAS!$A$168)","v":1},{"$f":"+GETPIVOTDATA(\" BAS050\",TABLAS!$A$168)","v":25},{"$f":"+GETPIVOTDATA(\" BAS051\",TABLAS!$A$168)","v":0},{"$f":"+GETPIVOTDATA(\" BAS052\",TABLAS!$A$168)","v":0},{"$f":"+GETPIVOTDATA(\" BAS053\",TABLAS!$A$168)","v":0},{"$f":"+GETPIVOTDATA(\" BAS054\",TABLAS!$A$168)","v":0},{"$f":"+GETPIVOTDATA(\" BAS055\",TABLAS!$A$168)","v":0},{"$f":"+GETPIVOTDATA(\" BAS056\",TABLAS!$A$168)","v":0},{"$f":"SUM(C84+D84+E84+F84+G84+H84+I84+J84+K84+L84)","v":74},null,null,null,{"$f":"+Q70+1","v":48},{"$f":"+Q84+1","v":49},{"$f":"+R84+1","v":50},51,52,53,54,55,56,null,null,null,{"$f":"IF(LEN(Q84)=1,CONCATENATE(\"00\",Q84),IF(LEN(Q84)=2,CONCATENATE(\"0\",Q84),Q84))","v":"048"},"049","050","051","052","053","054","055","056",null,null,{"$f":"$AI$23&AC84&$AJ$22","v":"=+IMPORTARDATOSDINAMICOS(\" BAS048\";TABLAS!$A$281)"},{"$f":"$AI$23&AD84&$AJ$22","v":"=+IMPORTARDATOSDINAMICOS(\" BAS049\";TABLAS!$A$281)"},"=+IMPORTARDATOSDINAMICOS(\" BAS050\";TABLAS!$A$281)","=+IMPORTARDATOSDINAMICOS(\" BAS051\";TABLAS!$A$281)","=+IMPORTARDATOSDINAMICOS(\" BAS052\";TABLAS!$A$281)","=+IMPORTARDATOSDINAMICOS(\" BAS053\";TABLAS!$A$281)","=+IMPORTARDATOSDINAMICOS(\" BAS054\";TABLAS!$A$281)","=+IMPORTARDATOSDINAMICOS(\" BAS055\";TABLAS!$A$281)","=+IMPORTARDATOSDINAMICOS(\" BAS056\";TABLAS!$A$281)"]
[null,"Lectura de PPD",null,{"$f":"+GETPIVOTDATA(\" BAS057\",TABLAS!$A$168)","v":12},{"$f":"+GETPIVOTDATA(\" BAS058\",TABLAS!$A$168)","v":0},{"$f":"+GETPIVOTDATA(\" BAS059\",TABLAS!$A$168)","v":25},{"$f":"+GETPIVOTDATA(\" BAS060\",TABLAS!$A$168)","v":0},{"$f":"+GETPIVOTDATA(\" BAS061\",TABLAS!$A$168)","v":0},{"$f":"+GETPIVOTDATA(\" BAS062\",TABLAS!$A$168)","v":0},{"$f":"+GETPIVOTDATA(\" BAS063\",TABLAS!$A$168)","v":0},{"$f":"+GETPIVOTDATA(\" BAS064\",TABLAS!$A$168)","v":0},{"$f":"+GETPIVOTDATA(\" BAS065\",TABLAS!$A$168)","v":0},37,null,null,null,{"$f":"+Y84+1","v":57},{"$f":"+Q85+1","v":58},59,60,61,62,63,64,65,null,null,null,"057","058","059","060","061","062","063","064","065",null,null,{"$f":"$AI$23&AC85&$AJ$22","v":"=+IMPORTARDATOSDINAMICOS(\" BAS057\";TABLAS!$A$281)"},"=+IMPORTARDATOSDINAMICOS(\" BAS058\";TABLAS!$A$281)","=+IMPORTARDATOSDINAMICOS(\" BAS059\";TABLAS!$A$281)","=+IMPORTARDATOSDINAMICOS(\" BAS060\";TABLAS!$A$281)","=+IMPORTARDATOSDINAMICOS(\" BAS061\";TABLAS!$A$281)","=+IMPORTARDATOSDINAMICOS(\" BAS062\";TABLAS!$A$281)","=+IMPORTARDATOSDINAMICOS(\" BAS063\";TABLAS!$A$281)","=+IMPORTARDATOSDINAMICOS(\" BAS064\";TABLAS!$A$281)","=+IMPORTARDATOSDINAMICOS(\" BAS065\";TABLAS!$A$281)"]
[null,"Aplicación de IGRA",null,{"$f":"+GETPIVOTDATA(\" BAS066\",TABLAS!$A$168)","v":0},{"$f":"+GETPIVOTDATA(\" BAS067\",TABLAS!$A$168)","v":0},{"$f":"+GETPIVOTDATA(\" BAS068\",TABLAS!$A$168)","v":0},{"$f":"+GETPIVOTDATA(\" BAS069\",TABLAS!$A$168)","v":0},{"$f":"+GETPIVOTDATA(\" BAS070\",TABLAS!$A$168)","v":0},{"$f":"+GETPIVOTDATA(\" BAS071\",TABLAS!$A$168)","v":0},{"$f":"+GETPIVOTDATA(\" BAS072\",TABLAS!$A$168)","v":0},{"$f":"+GETPIVOTDATA(\" BAS073\",TABLAS!$A$168)","v":0},{"$f":"+GETPIVOTDATA(\" BAS074\",TABLAS!$A$168)","v":0},0,null,null,null,{"$f":"+Y85+1","v":66},67,68,69,70,71,72,73,74,null,null,null,"066","067","068","069","070","071","072","073","074",null,null,"=+IMPORTARDATOSDINAMICOS(\" BAS066\";TABLAS!$A$281)","=+IMPORTARDATOSDINAMICOS(\" BAS067\";TABLAS!$A$281)","=+IMPORTARDATOSDINAMICOS(\" BAS068\";TABLAS!$A$281)","=+IMPORTARDATOSDINAMICOS(\" BAS069\";TABLAS!$A$281)","=+IMPORTARDATOSDINAMICOS(\" BAS070\";TABLAS!$A$281)","=+IMPORTARDATOSDINAMICOS(\" BAS071\";TABLAS!$A$281)","=+IMPORTARDATOSDINAMICOS(\" BAS072\";TABLAS!$A$281)","=+IMPORTARDATOSDINAMICOS(\" BAS073\";TABLAS!$A$281)","=+IMPORTARDATOSDINAMICOS(\" BAS074\";TABLAS!$A$281)"]
[null,"Lectura de IGRA",null,{"$f":"+GETPIVOTDATA(\" BAS075\",TABLAS!$A$168)","v":0},{"$f":"+GETPIVOTDATA(\" BAS076\",TABLAS!$A$168)","v":0},{"$f":"+GETPIVOTDATA(\" BAS077\",TABLAS!$A$168)","v":0},{"$f":"+GETPIVOTDATA(\" BAS078\",TABLAS!$A$168)","v":0},{"$f":"+GETPIVOTDATA(\" BAS079\",TABLAS!$A$168)","v":0},{"$f":"+GETPIVOTDATA(\" BAS080\",TABLAS!$A$168)","v":0},{"$f":"+GETPIVOTDATA(\" BAS081\",TABLAS!$A$168)","v":0},{"$f":"+GETPIVOTDATA(\" BAS082\",TABLAS!$A$168)","v":0},{"$f":"+GETPIVOTDATA(\" BAS083\",TABLAS!$A$168)","v":0},0,null,null,null,75,76,77,78,79,80,81,82,83,null,null,null,"075","076","077","078","079","080","081","082","083",null,null,"=+IMPORTARDATOSDINAMICOS(\" BAS075\";TABLAS!$A$281)","=+IMPORTARDATOSDINAMICOS(\" BAS076\";TABLAS!$A$281)","=+IMPORTARDATOSDINAMICOS(\" BAS077\";TABLAS!$A$281)","=+IMPORTARDATOSDINAMICOS(\" BAS078\";TABLAS!$A$281)","=+IMPORTARDATOSDINAMICOS(\" BAS079\";TABLAS!$A$281)","=+IMPORTARDATOSDINAMICOS(\" BAS080\";TABLAS!$A$281)","=+IMPORTARDATOSDINAMICOS(\" BAS081\";TABLAS!$A$281)","=+IMPORTARDATOSDINAMICOS(\" BAS082\";TABLAS!$A$281)","=+IMPORTARDATOSDINAMICOS(\" BAS083\";TABLAS!$A$281)"]
[null,"Administración de terapia preventiva para contactos de TB sensible",null,{"$f":"+GETPIVOTDATA(\" BAS084\",TABLAS!$A$168)","v":9},null,null,null,null,null,null,null,null,9,null,null,null,84,null,null,null,null,null,null,null,null,null,null,null,"084",null,null,null,null,null,null,null,null,null,null,"=+IMPORTARDATOSDINAMICOS(\" BAS084\";TABLAS!$A$281)"]
[null,"Administración de terapia preventiva para contactos de TB resistente",null,{"$f":"+GETPIVOTDATA(\" BAS085\",TABLAS!$A$168)","v":1},null,null,null,null,null,null,null,null,1,null,null,null,{"$f":"+Q88+1","v":85},null,null,null,null,null,null,null,null,null,null,null,"085",null,null,null,null,null,null,null,null,null,null,"=+IMPORTARDATOSDINAMICOS(\" BAS085\";TABLAS!$A$281)"]
[null,"Administración de terapia preventiva para población vulnerable para TB",null,null,{"$f":"+GETPIVOTDATA(\" BAS086\",TABLAS!$A$168)","v":0},{"$f":"+GETPIVOTDATA(\" BAS087\",TABLAS!$A$168)","v":0},{"$f":"+GETPIVOTDATA(\" BAS088\",TABLAS!$A$168)","v":0},{"$f":"+GETPIVOTDATA(\" BAS089\",TABLAS!$A$168)","v":0},{"$f":"+GETPIVOTDATA(\" BAS090\",TABLAS!$A$168)","v":0},{"$f":"+GETPIVOTDATA(\" BAS091\",TABLAS!$A$168)","v":0},{"$f":"+GETPIVOTDATA(\" BAS092\",TABLAS!$A$168)","v":0},{"$f":"+GETPIVOTDATA(\" BAS093\",TABLAS!$A$168)","v":0},0,null,null,null,null,{"$f":"+Q89+1","v":86},{"$f":"+R90+1","v":87},88,89,90,91,92,93,null,null,null,null,{"$f":"IF(LEN(R90)=1,CONCATENATE(\"00\",R90),IF(LEN(R90)=2,CONCATENATE(\"0\",R90),R90))","v":"086"},"087","088","089","090","091","092","093",null,null,null,{"$f":"$AI$23&AD90&$AJ$22","v":"=+IMPORTARDATOSDINAMICOS(\" BAS086\";TABLAS!$A$281)"},"=+IMPORTARDATOSDINAMICOS(\" BAS087\";TABLAS!$A$281)","=+IMPORTARDATOSDINAMICOS(\" BAS088\";TABLAS!$A$281)","=+IMPORTARDATOSDINAMICOS(\" BAS089\";TABLAS!$A$281)","=+IMPORTARDATOSDINAMICOS(\" BAS090\";TABLAS!$A$281)","=+IMPORTARDATOSDINAMICOS(\" BAS091\";TABLAS!$A$281)","=+IMPORTARDATOSDINAMICOS(\" BAS092\";TABLAS!$A$281)","=+IMPORTARDATOSDINAMICOS(\" BAS093\";TABLAS!$A$281)"]
[null,"Caso probable",{"$f":"+GETPIVOTDATA(\" BAS094\",TABLAS!$A$168)","v":0},{"$f":"+GETPIVOTDATA(\" BAS095\",TABLAS!$A$168)","v":0},{"$f":"+GETPIVOTDATA(\" BAS096\",TABLAS!$A$168)","v":0},{"$f":"+GETPIVOTDATA(\" BAS097\",TABLAS!$A$168)","v":0},{"$f":"+GETPIVOTDATA(\" BAS098\",TABLAS!$A$168)","v":0},{"$f":"+GETPIVOTDATA(\" BAS099\",TABLAS!$A$168)","v":0},{"$f":"+GETPIVOTDATA(\" BAS100\",TABLAS!$A$168)","v":0},{"$f":"+GETPIVOTDATA(\" BAS101\",TABLAS!$A$168)","v":0},{"$f":"+GETPIVOTDATA(\" BAS102\",TABLAS!$A$168)","v":0},{"$f":"+GETPIVOTDATA(\" BAS103\",TABLAS!$A$168)","v":0},0,null,null,null,94,{"$f":"+Q91+1","v":95},96,97,98,99,100,101,102,103,null,null,{"$f":"IF(LEN(Q91)=1,CONCATENATE(\"00\",Q91),IF(LEN(Q91)=2,CONCATENATE(\"0\",Q91),Q91))","v":"094"},"095","096","097","098","099",100,101,102,103,null,{"$f":"$AI$23&AC91&$AJ$22","v":"=+IMPORTARDATOSDINAMICOS(\" BAS094\";TABLAS!$A$281)"},"=+IMPORTARDATOSDINAMICOS(\" BAS095\";TABLAS!$A$281)","=+IMPORTARDATOSDINAMICOS(\" BAS096\";TABLAS!$A$281)","=+IMPORTARDATOSDINAMICOS(\" BAS097\";TABLAS!$A$281)","=+IMPORTARDATOSDINAMICOS(\" BAS098\";TABLAS!$A$281)","=+IMPORTARDATOSDINAMICOS(\" BAS099\";TABLAS!$A$281)","=+IMPORTARDATOSDINAMICOS(\" BAS100\";TABLAS!$A$281)","=+IMPORTARDATOSDINAMICOS(\" BAS101\";TABLAS!$A$281)","=+IMPORTARDATOSDINAMICOS(\" BAS102\";TABLAS!$A$281)","=+IMPORTARDATOSDINAMICOS(\" BAS103\";TABLAS!$A$281)"]
[null,"Sintomático respiratorio identificado",{"$f":"+GETPIVOTDATA(\" BAS104\",TABLAS!$A$168)","v":512},{"$f":"+GETPIVOTDATA(\" BAS105\",TABLAS!$A$168)","v":3},{"$f":"+GETPIVOTDATA(\" BAS106\",TABLAS!$A$168)","v":2},{"$f":"+GETPIVOTDATA(\" BAS107\",TABLAS!$A$168)","v":2},{"$f":"+GETPIVOTDATA(\" BAS108\",TABLAS!$A$168)","v":0},{"$f":"+GETPIVOTDATA(\" BAS109\",TABLAS!$A$168)","v":34},{"$f":"+GETPIVOTDATA(\" BAS110\",TABLAS!$A$168)","v":0},{"$f":"+GETPIVOTDATA(\" BAS111\",TABLAS!$A$168)","v":0},{"$f":"+GETPIVOTDATA(\" BAS112\",TABLAS!$A$168)","v":0},{"$f":"+GETPIVOTDATA(\" BAS113\",TABLAS!$A$168)","v":1},554,null,null,null,{"$f":"+Z91+1","v":104},105,106,107,108,109,110,111,112,113,null,null,104,105,106,107,108,109,110,111,112,113,null,"=+IMPORTARDATOSDINAMICOS(\" BAS104\";TABLAS!$A$281)","=+IMPORTARDATOSDINAMICOS(\" BAS105\";TABLAS!$A$281)","=+IMPORTARDATOSDINAMICOS(\" BAS106\";TABLAS!$A$281)","=+IMPORTARDATOSDINAMICOS(\" BAS107\";TABLAS!$A$281)","=+IMPORTARDATOSDINAMICOS(\" BAS108\";TABLAS!$A$281)","=+IMPORTARDATOSDINAMICOS(\" BAS109\";TABLAS!$A$281)","=+IMPORTARDATOSDINAMICOS(\" BAS110\";TABLAS!$A$281)","=+IMPORTARDATOSDINAMICOS(\" BAS111\";TABLAS!$A$281)","=+IMPORTARDATOSDINAMICOS(\" BAS112\";TABLAS!$A$281)","=+IMPORTARDATOSDINAMICOS(\" BAS113\";TABLAS!$A$281)"]
[null,"Sintomático respiratorio examinado",{"$f":"+GETPIVOTDATA(\" BAS114\",TABLAS!$A$168)","v":456},{"$f":"+GETPIVOTDATA(\" BAS115\",TABLAS!$A$168)","v":4},{"$f":"+GETPIVOTDATA(\" BAS116\",TABLAS!$A$168)","v":1},{"$f":"+GETPIVOTDATA(\" BAS117\",TABLAS!$A$168)","v":2},{"$f":"+GETPIVOTDATA(\" BAS118\",TABLAS!$A$168)","v":0},{"$f":"+GETPIVOTDATA(\" BAS119\",TABLAS!$A$168)","v":63},{"$f":"+GETPIVOTDATA(\" BAS120\",TABLAS!$A$168)","v":0},{"$f":"+GETPIVOTDATA(\" BAS121\",TABLAS!$A$168)","v":0},{"$f":"+GETPIVOTDATA(\" BAS122\",TABLAS!$A$168)","v":0},{"$f":"+GETPIVOTDATA(\" BAS123\",TABLAS!$A$168)","v":1},527,null,null,null,{"$f":"+Z92+1","v":114},115,116,117,118,119,120,121,122,123,null,null,114,115,116,117,118,119,120,121,122,123,null,"=+IMPORTARDATOSDINAMICOS(\" BAS114\";TABLAS!$A$281)","=+IMPORTARDATOSDINAMICOS(\" BAS115\";TABLAS!$A$281)","=+IMPORTARDATOSDINAMICOS(\" BAS116\";TABLAS!$A$281)","=+IMPORTARDATOSDINAMICOS(\" BAS117\";TABLAS!$A$281)","=+IMPORTARDATOSDINAMICOS(\" BAS118\";TABLAS!$A$281)","=+IMPORTARDATOSDINAMICOS(\" BAS119\";TABLAS!$A$281)","=+IMPORTARDATOSDINAMICOS(\" BAS120\";TABLAS!$A$281)","=+IMPORTARDATOSDINAMICOS(\" BAS121\";TABLAS!$A$281)","=+IMPORTARDATOSDINAMICOS(\" BAS122\";TABLAS!$A$281)","=+IMPORTARDATOSDINAMICOS(\" BAS123\";TABLAS!$A$281)"]
[null,"SR examinados con bacteriología confirmada",{"$f":"+GETPIVOTDATA(\" BAS124\",TABLAS!$A$168)","v":4},{"$f":"+GETPIVOTDATA(\" BAS125\",TABLAS!$A$168)","v":0},{"$f":"+GETPIVOTDATA(\" BAS126\",TABLAS!$A$168)","v":0},{"$f":"+GETPIVOTDATA(\" BAS127\",TABLAS!$A$168)","v":0},{"$f":"+GETPIVOTDATA(\" BAS128\",TABLAS!$A$168)","v":0},{"$f":"+GETPIVOTDATA(\" BAS129\",TABLAS!$A$168)","v":0},{"$f":"+GETPIVOTDATA(\" BAS130\",TABLAS!$A$168)","v":0},{"$f":"+GETPIVOTDATA(\" BAS131\",TABLAS!$A$168)","v":0},{"$f":"+GETPIVOTDATA(\" BAS132\",TABLAS!$A$168)","v":0},{"$f":"+GETPIVOTDATA(\" BAS133\",TABLAS!$A$168)","v":0},4,null,null,null,124,125,126,127,128,129,130,131,132,133,null,null,124,125,126,127,128,129,130,131,132,133,null,"=+IMPORTARDATOSDINAMICOS(\" BAS124\";TABLAS!$A$281)","=+IMPORTARDATOSDINAMICOS(\" BAS125\";TABLAS!$A$281)","=+IMPORTARDATOSDINAMICOS(\" BAS126\";TABLAS!$A$281)","=+IMPORTARDATOSDINAMICOS(\" BAS127\";TABLAS!$A$281)","=+IMPORTARDATOSDINAMICOS(\" BAS128\";TABLAS!$A$281)","=+IMPORTARDATOSDINAMICOS(\" BAS129\";TABLAS!$A$281)","=+IMPORTARDATOSDINAMICOS(\" BAS130\";TABLAS!$A$281)","=+IMPORTARDATOSDINAMICOS(\" BAS131\";TABLAS!$A$281)","=+IMPORTARDATOSDINAMICOS(\" BAS132\";TABLAS!$A$281)","=+IMPORTARDATOSDINAMICOS(\" BAS133\";TABLAS!$A$281)"]

{"sheet":"TBC6099","index":7,"n_rows":94,"n_cols":49,"rows_kept":94,"cut":false,"hidden":false,"merged":[[81,12,82,12],[66,1,67,1],[66,3,67,3],[66,5,67,5],[68,2,68,4],[69,2,69,4],[81,1,82,1],[81,2,81,11],[58,1,58,2],[58,4,58,6],[61,1,61,2],[62,1,65,1],[62,2,63,2],[62,5,65,5],[64,2,65,2],[56,7,57,7],[56,9,56,10],[57,9,57,10],[43,1,44,2],[43,8,43,9],[45,1,45,2],[45,8,45,9],[46,1,47,2],[46,4,47,5],[53,4,53,5],[53,9,53,10],[54,7,55,7],[54,9,54,10],[55,9,55,10],[40,1,40,2],[40,8,40,9],[41,1,41,2],[41,8,41,9],[42,1,42,2],[42,8,42,9],[33,1,33,2],[33,6,33,7],[34,1,34,2],[34,6,34,7],[35,1,35,2],[35,6,35,7],[32,1,32,2],[22,1,22,3],[22,4,23,4],[22,6,22,7],[23,6,24,6],[25,6,25,7],[26,1,26,3],[26,6,26,8],[27,1,27,2],[27,6,27,8],[28,1,28,2],[29,1,29,2],[30,1,30,2],[21,6,21,7],[8,2,8,3],[9,2,9,3],[9,6,9,9],[10,2,10,3],[11,2,11,3],[11,6,11,7],[12,2,12,3],[13,2,13,3],[14,2,14,3],[15,2,15,3],[21,1,21,4],[7,2,7,3],[7,6,7,9],[1,1,1,11],[2,1,2,12],[5,2,5,3],[5,6,5,7],[6,2,6,3],[3,1,3,12]]}
[]
[]
[null,"REPORTE MENSUAL DE ACTIVIDADES DE PREVENCION Y CONTROL DE TUBERCULOSIS [60-120]"]
[null,"CURSO DE VIDA : ADULTO MAYOR"]
[]
[null,"DIRESA","CUSCO",null,null,"REGION","CUSCO"]
[]
[null,"RED DE SALUD ",{"$f":"+TABLAS!O9","v":"03 - LA CONVENCION"},null,null,"EJECUTORA",{"$f":"+TABLAS!O14","v":""}]
[]
[null,"MICRO RED",{"$f":"+TABLAS!O10","v":""},null,null,"RESPONSABLE"]
[]
[null,"EE.SS.",{"$f":"+TABLAS!O11","v":""},null,null,"COD. RENAES",{"$f":"+TABLAS!Q11","v":""}]
[]
[null,"PROVINCIA",{"$f":"+TABLAS!O12","v":""},null,null,"AÑO",{"$f":"+TABLAS!J16","v":"2025"}]
[]
[null,"DISTRITO",{"$f":"+TABLAS!O13","v":""},null,null,"MES",{"$f":"+TABLAS!N26","v":"ENE - MAR"}]
[]
[null,"INSTITUCION :  MINSA (  X  )   ESSALUD (     )   FFAA  (     )   PNP  (     )   INPE  (     )   OTROS  (     )"]
[]
[null,"I. ACTIVIDADES DE DETECCION Y DIAGNOSTICO PARA TUBERCULOSIS"]
[]
[null,"DETECCIÓN DE CASOS",null,null,null,null,"RECOLECCIÓN DE MUESTRAS PARA EXAMEN BACTERIOLÓGICO",null,"N°",null,null,null,null,null,null,null,null,null,null,null,null,null,null,null,null,null,null,null,null,null,null,null,null,null,null,"\";TABLAS!$A$281)"]
[null,"Sintomático respiratorio (SR)",null,null,"Caso probable de TB",null,"RECOLECCIÓN DE MUESTRAS PARA TB*",null,{"$f":"+GETPIVOTDATA(\" BAS001\",TABLAS!$A$203)","v":1373},null,null,null,null,null,null,null,1,null,null,null,null,null,null,null,null,null,null,null,{"$f":"IF(LEN(Q23)=1,CONCATENATE(\"00\",Q23),IF(LEN(Q23)=2,CONCATENATE(\"0\",Q23),Q23))","v":"001"},null,null,null,null,null,"=+IMPORTARDATOSDINAMICOS(\" BAS",null,null,null,null,{"$f":"$AI$23&AC23&$AJ$22","v":"=+IMPORTARDATOSDINAMICOS(\" BAS001\";TABLAS!$A$281)"}]
[null,"SR Identificado","SR Examinado","SR examinados con bacteriología confirmada",null,null,"PROCEDIMIENTOS ESPECIALES PARA OBTENCION DE MUESTRAS","Lavado gástrico",{"$f":"+GETPIVOTDATA(\" BAS002\",TABLAS!$A$203)","v":0},null,null,null,null,null,null,null,{"$f":"+Q23+1","v":2},null,null,null,null,null,null,null,null,null,null,null,"002",null,null,null,null,null,null,null,null,null,null,{"$f":"$AI$23&AC24&$AJ$22","v":"=+IMPORTARDATOSDINAMICOS(\" BAS002\";TABLAS!$A$281)"}]
[null,{"$f":"M92","v":398},{"$f":"M93","v":376},{"$f":"M94","v":0},{"$f":"M91","v":0},null,null,"Inducción del esputo",{"$f":"+GETPIVOTDATA(\" BAS003\",TABLAS!$A$203)","v":0},null,null,null,null,null,null,null,{"$f":"+Q24+1","v":3},null,null,null,null,null,null,null,null,null,null,null,"003",null,null,null,null,null,null,null,null,null,null,"=+IMPORTARDATOSDINAMICOS(\" BAS003\";TABLAS!$A$281)"]
[null,null,null,null,null,null,"TOTAL",null,{"$f":"SUM(I23+I24+I25)","v":1373}]
[null,"SR examinados con bacteriología confirmada",null,null,null,null,"*Muestra recolectada por expectoración espontánea"]
[null,"Por baciloscopia",null,{"$f":"+GETPIVOTDATA(\" BAS004\",TABLAS!$A$203)","v":0},null,null,"REFERENCIAS",null,null,null,null,null,null,null,null,null,{"$f":"+Q25+1","v":4},null,null,null,null,null,null,null,null,null,null,null,{"$f":"IF(LEN(Q28)=1,CONCATENATE(\"00\",Q28),IF(LEN(Q28)=2,CONCATENATE(\"0\",Q28),Q28))","v":"004"},null,null,null,null,null,null,null,null,null,null,{"$f":"$AI$23&AC28&$AJ$22","v":"=+IMPORTARDATOSDINAMICOS(\" BAS004\";TABLAS!$A$281)"}]
[null,"Por prueba molecular",null,{"$f":"+GETPIVOTDATA(\" BAS005\",TABLAS!$A$203)","v":0},null,null,"Condición","Derivaciones","Transferencias",null,null,null,null,null,null,null,{"$f":"+Q28+1","v":5},null,null,{"$f":"+Q30+1","v":7},{"$f":"+T29+1","v":8},null,null,null,null,null,null,null,"005",null,null,{"$f":"IF(LEN(T29)=1,CONCATENATE(\"00\",T29),IF(LEN(T29)=2,CONCATENATE(\"0\",T29),T29))","v":"007"},"008",null,null,null,null,null,null,"=+IMPORTARDATOSDINAMICOS(\" BAS005\";TABLAS!$A$281)",null,null,{"$f":"$AI$23&AF29&$AJ$22","v":"=+IMPORTARDATOSDINAMICOS(\" BAS007\";TABLAS!$A$281)"},"=+IMPORTARDATOSDINAMICOS(\" BAS008\";TABLAS!$A$281)"]
[null,"Por cultivo",null,{"$f":"+GETPIVOTDATA(\" BAS006\",TABLAS!$A$203)","v":0},null,null,"Realizadas",{"$f":"+GETPIVOTDATA(\" BAS007\",TABLAS!$A$203)","v":1},{"$f":"+GETPIVOTDATA(\" BAS008\",TABLAS!$A$203)","v":1},null,null,null,null,null,null,null,{"$f":"+Q29+1","v":6},null,null,{"$f":"+U29+1","v":9},{"$f":"+T30+1","v":10},null,null,null,null,null,null,null,"006",null,null,"009","010",null,null,null,null,null,null,"=+IMPORTARDATOSDINAMICOS(\" BAS006\";TABLAS!$A$281)",null,null,"=+IMPORTARDATOSDINAMICOS(\" BAS009\";TABLAS!$A$281)","=+IMPORTARDATOSDINAMICOS(\" BAS010\";TABLAS!$A$281)"]
[null,"TOTAL",null,{"$f":"SUM(D28+D29+D30)","v":0},null,null,"Aceptadas",{"$f":"+GETPIVOTDATA(\" BAS009\",TABLAS!$A$203)","v":0},{"$f":"+GETPIVOTDATA(\" BAS010\",TABLAS!$A$203)","v":0}]
[null,null,null,null,null,null,"TOTAL",{"$f":"SUM(H30+H31)","v":1},{"$f":"SUM(I30+I31)","v":1}]
[null,"COMORBILIDADES Y CONDICIONES ASOCIADAS",null,"N°"]
[null,"TB-VIH/SIDA",null,{"$f":"+GETPIVOTDATA(\" BAS011\",TABLAS!$A$203)","v":0},null,null,"TAMIZAJE DE COMORBILIDADES",null,"N°",null,null,null,null,null,null,null,{"$f":"+U30+1","v":11},null,null,null,null,null,null,null,null,null,null,null,{"$f":"IF(LEN(Q34)=1,CONCATENATE(\"00\",Q34),IF(LEN(Q34)=2,CONCATENATE(\"0\",Q34),Q34))","v":"011"},null,null,null,null,null,null,null,null,null,null,{"$f":"$AI$23&AC34&$AJ$22","v":"=+IMPORTARDATOSDINAMICOS(\" BAS011\";TABLAS!$A$281)"}]
[null,"TB-DM",null,{"$f":"+GETPIVOTDATA(\" BAS012\",TABLAS!$A$203)","v":0},null,null,"Tamizaje TB-VIH",null,{"$f":"+GETPIVOTDATA(\" BAS014\",TABLAS!$A$203)","v":2},null,null,null,null,null,null,null,{"$f":"+Q34+1","v":12},null,{"$f":"+Q36+1","v":14},null,null,null,null,null,null,null,null,null,"012",null,{"$f":"IF(LEN(S35)=1,CONCATENATE(\"00\",S35),IF(LEN(S35)=2,CONCATENATE(\"0\",S35),S35))","v":"014"},null,null,null,null,null,null,null,null,"=+IMPORTARDATOSDINAMICOS(\" BAS012\";TABLAS!$A$281)",null,{"$f":"$AI$23&AE35&$AJ$22","v":"=+IMPORTARDATOSDINAMICOS(\" BAS014\";TABLAS!$A$281)"}]
[null,"Reacción adversa a medicamentos para TB",null,{"$f":"+GETPIVOTDATA(\" BAS013\",TABLAS!$A$203)","v":0},null,null,"Tamizaje TB-DM",null,{"$f":"+GETPIVOTDATA(\" BAS015\",TABLAS!$A$203)","v":2},null,null,null,null,null,null,null,13,null,{"$f":"+S35+1","v":15},null,null,null,null,null,null,null,null,null,"013",null,"015",null,null,null,null,null,null,null,null,"=+IMPORTARDATOSDINAMICOS(\" BAS013\";TABLAS!$A$281)",null,"=+IMPORTARDATOSDINAMICOS(\" BAS015\";TABLAS!$A$281)"]
[]
[]
[null,"II. ACTIVIDADES PARA LA RECUPERACION DE LA PERSONA AFECTADA POR TUBERCULOSIS"]
[]
[null,"ATENCIÓN MULTIDISCIPLINARIA",null,"MODALIDAD","EN PAT CON TB SENSIBLE","EN PAT CON TB RESISTENTE","TOTAL",null,2,null,"N°"]
[null,"Evaluación médica",null,null,{"$f":"+GETPIVOTDATA(\" BAS016\",TABLAS!$A$203)","v":0},{"$f":"+GETPIVOTDATA(\" BAS017\",TABLAS!$A$203)","v":1},{"$f":"SUM(E42+F42)","v":1},null,"Administración de tratamiento para TB sensible",null,{"$f":"+GETPIVOTDATA(\" BAS028\",TABLAS!$A$203)","v":206},null,null,null,null,null,{"$f":"+S36+1","v":16},{"$f":"+Q42+1","v":17},null,null,null,{"$f":"+Q48+1","v":28},null,null,null,null,null,null,{"$f":"IF(LEN(Q42)=1,CONCATENATE(\"00\",Q42),IF(LEN(Q42)=2,CONCATENATE(\"0\",Q42),Q42))","v":"016"},"017",null,null,null,{"$f":"IF(LEN(V42)=1,CONCATENATE(\"00\",V42),IF(LEN(V42)=2,CONCATENATE(\"0\",V42),V42))","v":"028"},null,null,null,null,null,{"$f":"$AI$23&AC42&$AJ$22","v":"=+IMPORTARDATOSDINAMICOS(\" BAS016\";TABLAS!$A$281)"},"=+IMPORTARDATOSDINAMICOS(\" BAS017\";TABLAS!$A$281)",null,null,null,{"$f":"$AI$23&AH42&$AJ$22","v":"=+IMPORTARDATOSDINAMICOS(\" BAS028\";TABLAS!$A$281)"}]
[null,"Atención en consultorio de enfermería",null,null,{"$f":"+GETPIVOTDATA(\" BAS018\",TABLAS!$A$203)","v":0},{"$f":"+GETPIVOTDATA(\" BAS019\",TABLAS!$A$203)","v":0},{"$f":"SUM(E43+F43)","v":0},null,"Administración de tratamiento para TB resistente",null,{"$f":"+GETPIVOTDATA(\" BAS029\",TABLAS!$A$203)","v":218},null,null,null,null,null,{"$f":"+R42+1","v":18},{"$f":"+Q43+1","v":19},null,null,null,{"$f":"+V42+1","v":29},null,null,null,null,null,null,"018","019",null,null,null,"029",null,null,null,null,null,"=+IMPORTARDATOSDINAMICOS(\" BAS018\";TABLAS!$A$281)","=+IMPORTARDATOSDINAMICOS(\" BAS019\";TABLAS!$A$281)",null,null,null,"=+IMPORTARDATOSDINAMICOS(\" BAS029\";TABLAS!$A$281)"]
[null,"Atención de servicio social",null,"En el establecimiento de salud",{"$f":"+GETPIVOTDATA(\" BAS020\",TABLAS!$A$203)","v":0},{"$f":"+GETPIVOTDATA(\" BAS021\",TABLAS!$A$203)","v":0},{"$f":"SUM(E44+F44)","v":0},null,"Control de tratamiento",null,{"$f":"+GETPIVOTDATA(\" BAS030\",TABLAS!$A$203)","v":13},null,null,null,null,null,{"$f":"+R43+1","v":20},21,null,null,null,{"$f":"+V43+1","v":30},null,null,null,null,null,null,"020","021",null,null,null,"030",null,null,null,null,null,"=+IMPORTARDATOSDINAMICOS(\" BAS020\";TABLAS!$A$281)","=+IMPORTARDATOSDINAMICOS(\" BAS021\";TABLAS!$A$281)",null,null,null,"=+IMPORTARDATOSDINAMICOS(\" BAS030\";TABLAS!$A$281)"]
[null,null,null,"Mediante teleconsulta en línea",{"$f":"+GETPIVOTDATA(\" BAS022\",TABLAS!$A$203)","v":0},{"$f":"+GETPIVOTDATA(\" BAS023\",TABLAS!$A$203)","v":0},{"$f":"SUM(E45+F45)","v":0},null,null,null,null,null,null,null,null,null,22,23,null,null,null,null,null,null,null,null,null,null,"022","023",null,null,null,null,null,null,null,null,null,"=+IMPORTARDATOSDINAMICOS(\" BAS022\";TABLAS!$A$281)","=+IMPORTARDATOSDINAMICOS(\" BAS023\";TABLAS!$A$281)"]
[null,"Atención en nutrición",null,null,{"$f":"+GETPIVOTDATA(\" BAS024\",TABLAS!$A$203)","v":3},{"$f":"+GETPIVOTDATA(\" BAS025\",TABLAS!$A$203)","v":0},{"$f":"SUM(E46+F46)","v":3},null,"RETO ANTE REACCIONES ADVERSAS",null,null,null,null,null,null,null,24,25,null,null,null,null,null,null,null,null,null,null,"024","025",null,null,null,null,null,null,null,null,null,"=+IMPORTARDATOSDINAMICOS(\" BAS024\";TABLAS!$A$281)","=+IMPORTARDATOSDINAMICOS(\" BAS025\";TABLAS!$A$281)"]
[null,"Atención en salud mental",null,"En el establecimiento de salud",null,null,{"$f":"+GETPIVOTDATA(\" BAS026\",TABLAS!$A$203)","v":0},null,"Condición","N°",null,null,null,null,null,null,26,null,null,null,null,null,null,null,null,null,null,null,"026",null,null,null,null,null,null,null,null,null,null,"=+IMPORTARDATOSDINAMICOS(\" BAS026\";TABLAS!$A$281)"]
[null,null,null,"Mediante teleorientación síncrona",null,null,{"$f":"+GETPIVOTDATA(\" BAS027\",TABLAS!$A$203)","v":0},null,"Inicio",{"$f":"+GETPIVOTDATA(\" BAS031\",TABLAS!$A$203)","v":0},null,"REGISTRO EN EL PADRON DE BENEFICIARIOS PANTBC",null,null,null,null,{"$f":"+Q47+1","v":27},null,null,null,null,{"$f":"+V44+1","v":31},null,null,null,null,null,null,"027",null,null,null,null,{"$f":"IF(LEN(V48)=1,CONCATENATE(\"00\",V48),IF(LEN(V48)=2,CONCATENATE(\"0\",V48),V48))","v":"031"},null,null,null,null,null,"=+IMPORTARDATOSDINAMICOS(\" BAS027\";TABLAS!$A$281)",null,null,null,null,{"$f":"$AI$23&AH48&$AJ$22","v":"=+IMPORTARDATOSDINAMICOS(\" BAS031\";TABLAS!$A$281)"}]
[null,null,null,null,null,null,null,null,"Término",{"$f":"+GETPIVOTDATA(\" BAS032\",TABLAS!$A$203)","v":0},null,{"$f":"+GETPIVOTDATA(\" BAS033\",TABLAS!$A$203)","v":2},null,null,null,null,null,null,null,null,null,{"$f":"+V48+1","v":32},null,{"$f":"+V49+1","v":33},null,null,null,null,null,null,null,null,null,"032",null,{"$f":"IF(LEN(X49)=1,CONCATENATE(\"00\",X49),IF(LEN(X49)=2,CONCATENATE(\"0\",X49),X49))","v":"033"},null,null,null,null,null,null,null,null,"=+IMPORTARDATOSDINAMICOS(\" BAS032\";TABLAS!$A$281)",null,{"$f":"$AI$23&AJ49&$AJ$22","v":"=+IMPORTARDATOSDINAMICOS(\" BAS033\";TABLAS!$A$281)"}]
[]
[]
[null,"III. ACTIVIDADES DE PREVENCIÓN EN TUBERCULOSIS"]
[]
[null,"CENSO DE CONTACTOS","N°",null,"PRUEBA PARA DIAGNOSTICO DE TB LATENTE",null,"N°","POSITIVOS",null,"TERAPIA PREVENTIVA PARA TUBERCULOSIS LATENTE",null,"N°"]
[null,"En el establecimiento de salud",{"$f":"+GETPIVOTDATA(\" BAS034\",TABLAS!$A$203)","v":0},null,"PPD","Aplicación",{"$f":"M84","v":22},{"$f":"+GETPIVOTDATA(\" BAS037\",TABLAS!$A$203)","v":0},null,"Administración de terapia preventiva para contactos de TB sensible",null,{"$f":"+GETPIVOTDATA(\" BAS039\",TABLAS!$A$203)","v":1},null,null,null,null,{"$f":"+X49+1","v":34},null,{"$f":"+Q57+1","v":37},null,{"$f":"+S57+1","v":39},null,null,null,null,null,null,null,{"$f":"IF(LEN(Q55)=1,CONCATENATE(\"00\",Q55),IF(LEN(Q55)=2,CONCATENATE(\"0\",Q55),Q55))","v":"034"},null,{"$f":"IF(LEN(S55)=1,CONCATENATE(\"00\",S55),IF(LEN(S55)=2,CONCATENATE(\"0\",S55),S55))","v":"037"},null,{"$f":"IF(LEN(U55)=1,CONCATENATE(\"00\",U55),IF(LEN(U55)=2,CONCATENATE(\"0\",U55),U55))","v":"039"},null,null,null,null,null,null,{"$f":"$AI$23&AC55&$AJ$22","v":"=+IMPORTARDATOSDINAMICOS(\" BAS034\";TABLAS!$A$281)"},null,{"$f":"$AI$23&AE55&$AJ$22","v":"=+IMPORTARDATOSDINAMICOS(\" BAS037\";TABLAS!$A$281)"},null,{"$f":"$AI$23&AG55&$AJ$22","v":"=+IMPORTARDATOSDINAMICOS(\" BAS039\";TABLAS!$A$281)"}]
[null,"En el domicilio*",{"$f":"+GETPIVOTDATA(\" BAS035\",TABLAS!$A$203)","v":0},null,null,"Lectura",{"$f":"M85","v":20},null,null,"Administración de terapia preventiva para contactos de TB resistente",null,{"$f":"+GETPIVOTDATA(\" BAS040\",TABLAS!$A$203)","v":0},null,null,null,null,{"$f":"+Q55+1","v":35},null,null,null,{"$f":"+U55+1","v":40},null,null,null,null,null,null,null,"035",null,null,null,{"$f":"IF(LEN(U56)=1,CONCATENATE(\"00\",U56),IF(LEN(U56)=2,CONCATENATE(\"0\",U56),U56))","v":"040"},null,null,null,null,null,null,"=+IMPORTARDATOSDINAMICOS(\" BAS035\";TABLAS!$A$281)",null,null,null,"=+IMPORTARDATOSDINAMICOS(\" BAS040\";TABLAS!$A$281)"]
[null,"Mediante teleorientación síncrona",{"$f":"+GETPIVOTDATA(\" BAS036\",TABLAS!$A$203)","v":0},null,"IGRA","Aplicación",{"$f":"M86","v":0},{"$f":"+GETPIVOTDATA(\" BAS038\",TABLAS!$A$203)","v":0},null,"Administración de terapia preventiva para población vulnerable para TB",null,{"$f":"M90","v":0},null,null,null,null,{"$f":"+Q56+1","v":36},null,{"$f":"+S55+1","v":38},null,null,null,null,null,null,null,null,null,"036",null,{"$f":"IF(LEN(S57)=1,CONCATENATE(\"00\",S57),IF(LEN(S57)=2,CONCATENATE(\"0\",S57),S57))","v":"038"},null,null,null,null,null,null,null,null,"=+IMPORTARDATOSDINAMICOS(\" BAS036\";TABLAS!$A$281)",null,{"$f":"$AI$23&AE57&$AJ$22","v":"=+IMPORTARDATOSDINAMICOS(\" BAS038\";TABLAS!$A$281)"}]
[null,"Total",{"$f":"SUM(C55+C56+C57)","v":0},null,null,"Lectura",{"$f":"M87","v":0},null,null,"TOTAL",null,{"$f":"SUM(L55+L56+L57)","v":1}]
[null,"*Mediante visita familiar",null,null,"TOTAL",null,null,{"$f":"SUM(H55+H57)","v":0}]
[]
[null,"IV. ACTIVIDADES DE PROMOCIÓN DE LA SALUD EN TUBERCULOSIS"]
[null,"ACTIVIDADES",null,"MODALIDAD","N°","TOTAL"]
[null,"Consejeria para TB","Primera","Mediante visita familiar",{"$f":"+GETPIVOTDATA(\" BAS041\",TABLAS!$A$203)","v":0},{"$f":"SUM(E63+E64+E65+E66)","v":0},null,null,null,null,null,null,null,null,null,null,{"$f":"+U56+1","v":41},null,null,null,null,null,null,null,null,null,null,null,{"$f":"IF(LEN(Q63)=1,CONCATENATE(\"00\",Q63),IF(LEN(Q63)=2,CONCATENATE(\"0\",Q63),Q63))","v":"041"},null,null,null,null,null,null,null,null,null,null,{"$f":"$AI$23&AC63&$AJ$22","v":"=+IMPORTARDATOSDINAMICOS(\" BAS041\";TABLAS!$A$281)"}]
[null,null,null,"Mediante teleorientación síncrona",{"$f":"+GETPIVOTDATA(\" BAS042\",TABLAS!$A$203)","v":0},null,null,null,null,null,null,null,null,null,null,null,{"$f":"+Q63+1","v":42},null,null,null,null,null,null,null,null,null,null,null,"042",null,null,null,null,null,null,null,null,null,null,"=+IMPORTARDATOSDINAMICOS(\" BAS042\";TABLAS!$A$281)"]
[null,null,"Segunda","Mediante visita familiar",{"$f":"+GETPIVOTDATA(\" BAS043\",TABLAS!$A$203)","v":0},null,null,null,null,null,null,null,null,null,null,null,{"$f":"+Q64+1","v":43},null,null,null,null,null,null,null,null,null,null,null,"043",null,null,null,null,null,null,null,null,null,null,"=+IMPORTARDATOSDINAMICOS(\" BAS043\";TABLAS!$A$281)"]
[null,null,null,"Mediante teleorientación síncrona",{"$f":"+GETPIVOTDATA(\" BAS044\",TABLAS!$A$203)","v":0},null,null,null,null,null,null,null,null,null,null,null,44,null,null,null,null,null,null,null,null,null,null,null,"044",null,null,null,null,null,null,null,null,null,null,"=+IMPORTARDATOSDINAMICOS(\" BAS044\";TABLAS!$A$281)"]
[null,"Sesión educativa y demostrativa para TB","Primera",null,{"$f":"+GETPIVOTDATA(\" BAS045\",TABLAS!$A$203)","v":0},{"$f":"SUM(E67+E68)","v":0},null,null,null,null,null,null,null,null,null,null,45,null,null,null,null,null,null,null,null,null,null,null,"045",null,null,null,null,null,null,null,null,null,null,"=+IMPORTARDATOSDINAMICOS(\" BAS045\";TABLAS!$A$281)"]
[null,null,"Segunda",null,{"$f":"+GETPIVOTDATA(\" BAS046\",TABLAS!$A$203)","v":0},null,null,null,null,null,null,null,null,null,null,null,46,null,null,null,null,null,null,null,null,null,null,null,"046",null,null,null,null,null,null,null,null,null,null,"=+IMPORTARDATOSDINAMICOS(\" BAS046\";TABLAS!$A$281)"]
[null,"Visitas familiar",null,null,null,{"$f":"SUM(C56+E63+E65)","v":0}]
[null,"Otras consejerias",null,null,null,{"$f":"+GETPIVOTDATA(\" BAS047\",TABLAS!$A$203)","v":2},null,null,null,null,null,null,null,null,null,null,{"$f":"+Q68+1","v":47},null,null,null,null,null,null,null,null,null,null,null,{"$f":"IF(LEN(Q70)=1,CONCATENATE(\"00\",Q70),IF(LEN(Q70)=2,CONCATENATE(\"0\",Q70),Q70))","v":"047"},null,null,null,null,null,null,null,null,null,null,{"$f":"$AI$23&AC70&$AJ$22","v":"=+IMPORTARDATOSDINAMICOS(\" BAS047\";TABLAS!$A$281)"}]
[]
[]
[null,"V. ACTIVIDADES EN TELESALUD"]
[]
[null,"ACTIVIDADES","N°"]
[null,"Teleconsulta en línea",{"$f":"G45","v":0}]
[null,"Teleorientación síncrona",{"$f":"SUM(G48+C57)","v":0}]
[null,"Total",{"$f":"SUM(C76+C77)","v":0}]
[]
[null,"REPORTE DE ACTIVIDADES SEGMENTADO POR POBLACION AFECTADA Y VULNERABLE"]
[]
[null,"ACTIVIDADES","POBLACION AFECTADA Y VULNERABLE",null,null,null,null,null,null,null,null,null,"TOTAL"]
[null,null,"POBLACIÓN EN GENERAL","CONTACTOS","PERSONA VIVIENDO CON VIH/SIDA","TRABAJADOR DE SALUD","PERSONA CON DIABETES MELLITUS","PPL","PERSONA CON TERAPIA PROLONGADA CON CORTICOIDES","PERSONA CON HEMODIALISIS Y/O ENFERMEDAD RENAL CRÓNICA","PERSONAL PENITENCIARIO","OTRAS CONDICIONES DE SALUD SEGÚN NORMATIVIDAD VIGENTE"]
[null,"Aplicación de PPD",null,{"$f":"+GETPIVOTDATA(\" BAS048\",TABLAS!$A$203)","v":20},{"$f":"+GETPIVOTDATA(\" BAS049\",TABLAS!$A$203)","v":0},{"$f":"+GETPIVOTDATA(\" BAS050\",TABLAS!$A$203)","v":2},{"$f":"+GETPIVOTDATA(\" BAS051\",TABLAS!$A$203)","v":0},{"$f":"+GETPIVOTDATA(\" BAS052\",TABLAS!$A$203)","v":0},{"$f":"+GETPIVOTDATA(\" BAS053\",TABLAS!$A$203)","v":0},{"$f":"+GETPIVOTDATA(\" BAS054\",TABLAS!$A$203)","v":0},{"$f":"+GETPIVOTDATA(\" BAS055\",TABLAS!$A$203)","v":0},{"$f":"+GETPIVOTDATA(\" BAS056\",TABLAS!$A$203)","v":0},{"$f":"SUM(C84+D84+E84+F84+G84+H84+I84+J84+K84+L84)","v":22},null,null,null,{"$f":"+Q70+1","v":48},{"$f":"+Q84+1","v":49},{"$f":"+R84+1","v":50},51,52,53,54,55,56,null,null,null,{"$f":"IF(LEN(Q84)=1,CONCATENATE(\"00\",Q84),IF(LEN(Q84)=2,CONCATENATE(\"0\",Q84),Q84))","v":"048"},"049","050","051","052","053","054","055","056",null,null,{"$f":"$AI$23&AC84&$AJ$22","v":"=+IMPORTARDATOSDINAMICOS(\" BAS048\";TABLAS!$A$281)"},{"$f":"$AI$23&AD84&$AJ$22","v":"=+IMPORTARDATOSDINAMICOS(\" BAS049\";TABLAS!$A$281)"},"=+IMPORTARDATOSDINAMICOS(\" BAS050\";TABLAS!$A$281)","=+IMPORTARDATOSDINAMICOS(\" BAS051\";TABLAS!$A$281)","=+IMPORTARDATOSDINAMICOS(\" BAS052\";TABLAS!$A$281)","=+IMPORTARDATOSDINAMICOS(\" BAS053\";TABLAS!$A$281)","=+IMPORTARDATOSDINAMICOS(\" BAS054\";TABLAS!$A$281)","=+IMPORTARDATOSDINAMICOS(\" BAS055\";TABLAS!$A$281)","=+IMPORTARDATOSDINAMICOS(\" BAS056\";TABLAS!$A$281)"]
[null,"Lectura de PPD",null,{"$f":"+GETPIVOTDATA(\" BAS057\",TABLAS!$A$203)","v":18},{"$f":"+GETPIVOTDATA(\" BAS058\",TABLAS!$A$203)","v":0},{"$f":"+GETPIVOTDATA(\" BAS059\",TABLAS!$A$203)","v":2},{"$f":"+GETPIVOTDATA(\" BAS060\",TABLAS!$A$203)","v":0},{"$f":"+GETPIVOTDATA(\" BAS061\",TABLAS!$A$203)","v":0},{"$f":"+GETPIVOTDATA(\" BAS062\",TABLAS!$A$203)","v":0},{"$f":"+GETPIVOTDATA(\" BAS063\",TABLAS!$A$203)","v":0},{"$f":"+GETPIVOTDATA(\" BAS064\",TABLAS!$A$203)","v":0},{"$f":"+GETPIVOTDATA(\" BAS065\",TABLAS!$A$203)","v":0},20,null,null,null,{"$f":"+Y84+1","v":57},{"$f":"+Q85+1","v":58},59,60,61,62,63,64,65,null,null,null,"057","058","059","060","061","062","063","064","065",null,null,{"$f":"$AI$23&AC85&$AJ$22","v":"=+IMPORTARDATOSDINAMICOS(\" BAS057\";TABLAS!$A$281)"},"=+IMPORTARDATOSDINAMICOS(\" BAS058\";TABLAS!$A$281)","=+IMPORTARDATOSDINAMICOS(\" BAS059\";TABLAS!$A$281)","=+IMPORTARDATOSDINAMICOS(\" BAS060\";TABLAS!$A$281)","=+IMPORTARDATOSDINAMICOS(\" BAS061\";TABLAS!$A$281)","=+IMPORTARDATOSDINAMICOS(\" BAS062\";TABLAS!$A$281)","=+IMPORTARDATOSDINAMICOS(\" BAS063\";TABLAS!$A$281)","=+IMPORTARDATOSDINAMICOS(\" BAS064\";TABLAS!$A$281)","=+IMPORTARDATOSDINAMICOS(\" BAS065\";TABLAS!$A$281)"]
[null,"Aplicación de IGRA",null,{"$f":"+GETPIVOTDATA(\" BAS066\",TABLAS!$A$203)","v":0},{"$f":"+GETPIVOTDATA(\" BAS067\",TABLAS!$A$203)","v":0},{"$f":"+GETPIVOTDATA(\" BAS068\",TABLAS!$A$203)","v":0},{"$f":"+GETPIVOTDATA(\" BAS069\",TABLAS!$A$203)","v":0},{"$f":"+GETPIVOTDATA(\" BAS070\",TABLAS!$A$203)","v":0},{"$f":"+GETPIVOTDATA(\" BAS071\",TABLAS!$A$203)","v":0},{"$f":"+GETPIVOTDATA(\" BAS072\",TABLAS!$A$203)","v":0},{"$f":"+GETPIVOTDATA(\" BAS073\",TABLAS!$A$203)","v":0},{"$f":"+GETPIVOTDATA(\" BAS074\",TABLAS!$A$203)","v":0},0,null,null,null,{"$f":"+Y85+1","v":66},67,68,69,70,71,72,73,74,null,null,null,"066","067","068","069","070","071","072","073","074",null,null,"=+IMPORTARDATOSDINAMICOS(\" BAS066\";TABLAS!$A$281)","=+IMPORTARDATOSDINAMICOS(\" BAS067\";TABLAS!$A$281)","=+IMPORTARDATOSDINAMICOS(\" BAS068\";TABLAS!$A$281)","=+IMPORTARDATOSDINAMICOS(\" BAS069\";TABLAS!$A$281)","=+IMPORTARDATOSDINAMICOS(\" BAS070\";TABLAS!$A$281)","=+IMPORTARDATOSDINAMICOS(\" BAS071\";TABLAS!$A$281)","=+IMPORTARDATOSDINAMICOS(\" BAS072\";TABLAS!$A$281)","=+IMPORTARDATOSDINAMICOS(\" BAS073\";TABLAS!$A$281)","=+IMPORTARDATOSDINAMICOS(\" BAS074\";TABLAS!$A$281)"]
[null,"Lectura de IGRA",null,{"$f":"+GETPIVOTDATA(\" BAS075\",TABLAS!$A$203)","v":0},{"$f":"+GETPIVOTDATA(\" BAS076\",TABLAS!$A$203)","v":0},{"$f":"+GETPIVOTDATA(\" BAS077\",TABLAS!$A$203)","v":0},{"$f":"+GETPIVOTDATA(\" BAS078\",TABLAS!$A$203)","v":0},{"$f":"+GETPIVOTDATA(\" BAS079\",TABLAS!$A$203)","v":0},{"$f":"+GETPIVOTDATA(\" BAS080\",TABLAS!$A$203)","v":0},{"$f":"+GETPIVOTDATA(\" BAS081\",TABLAS!$A$203)","v":0},{"$f":"+GETPIVOTDATA(\" BAS082\",TABLAS!$A$203)","v":0},{"$f":"+GETPIVOTDATA(\" BAS083\",TABLAS!$A$203)","v":0},0,null,null,null,75,76,77,78,79,80,81,82,83,null,null,null,"075","076","077","078","079","080","081","082","083",null,null,"=+IMPORTARDATOSDINAMICOS(\" BAS075\";TABLAS!$A$281)","=+IMPORTARDATOSDINAMICOS(\" BAS076\";TABLAS!$A$281)","=+IMPORTARDATOSDINAMICOS(\" BAS077\";TABLAS!$A$281)","=+IMPORTARDATOSDINAMICOS(\" BAS078\";TABLAS!$A$281)","=+IMPORTARDATOSDINAMICOS(\" BAS079\";TABLAS!$A$281)","=+IMPORTARDATOSDINAMICOS(\" BAS080\";TABLAS!$A$281)","=+IMPORTARDATOSDINAMICOS(\" BAS081\";TABLAS!$A$281)","=+IMPORTARDATOSDINAMICOS(\" BAS082\";TABLAS!$A$281)","=+IMPORTARDATOSDINAMICOS(\" BAS083\";TABLAS!$A$281)"]
[null,"Administración de terapia preventiva para contactos de TB sensible",null,{"$f":"+GETPIVOTDATA(\" BAS084\",TABLAS!$A$203)","v":1},null,null,null,null,null,null,null,null,1,null,null,null,84,null,null,null,null,null,null,null,null,null,null,null,"084",null,null,null,null,null,null,null,null,null,null,"=+IMPORTARDATOSDINAMICOS(\" BAS084\";TABLAS!$A$281)"]
[null,"Administración de terapia preventiva para contactos de TB resistente",null,{"$f":"+GETPIVOTDATA(\" BAS085\",TABLAS!$A$203)","v":0},null,null,null,null,null,null,null,null,0,null,null,null,{"$f":"+Q88+1","v":85},null,null,null,null,null,null,null,null,null,null,null,"085",null,null,null,null,null,null,null,null,null,null,"=+IMPORTARDATOSDINAMICOS(\" BAS085\";TABLAS!$A$281)"]
[null,"Administración de terapia preventiva para población vulnerable para TB",null,null,{"$f":"+GETPIVOTDATA(\" BAS086\",TABLAS!$A$203)","v":0},{"$f":"+GETPIVOTDATA(\" BAS087\",TABLAS!$A$203)","v":0},{"$f":"+GETPIVOTDATA(\" BAS088\",TABLAS!$A$203)","v":0},{"$f":"+GETPIVOTDATA(\" BAS089\",TABLAS!$A$203)","v":0},{"$f":"+GETPIVOTDATA(\" BAS090\",TABLAS!$A$203)","v":0},{"$f":"+GETPIVOTDATA(\" BAS091\",TABLAS!$A$203)","v":0},{"$f":"+GETPIVOTDATA(\" BAS092\",TABLAS!$A$203)","v":0},{"$f":"+GETPIVOTDATA(\" BAS093\",TABLAS!$A$203)","v":0},0,null,null,null,null,{"$f":"+Q89+1","v":86},{"$f":"+R90+1","v":87},88,89,90,91,92,93,null,null,null,null,{"$f":"IF(LEN(R90)=1,CONCATENATE(\"00\",R90),IF(LEN(R90)=2,CONCATENATE(\"0\",R90),R90))","v":"086"},"087","088","089","090","091","092","093",null,null,null,{"$f":"$AI$23&AD90&$AJ$22","v":"=+IMPORTARDATOSDINAMICOS(\" BAS086\";TABLAS!$A$281)"},"=+IMPORTARDATOSDINAMICOS(\" BAS087\";TABLAS!$A$281)","=+IMPORTARDATOSDINAMICOS(\" BAS088\";TABLAS!$A$281)","=+IMPORTARDATOSDINAMICOS(\" BAS089\";TABLAS!$A$281)","=+IMPORTARDATOSDINAMICOS(\" BAS090\";TABLAS!$A$281)","=+IMPORTARDATOSDINAMICOS(\" BAS091\";TABLAS!$A$281)","=+IMPORTARDATOSDINAMICOS(\" BAS092\";TABLAS!$A$281)","=+IMPORTARDATOSDINAMICOS(\" BAS093\";TABLAS!$A$281)"]
[null,"Caso probable",{"$f":"+GETPIVOTDATA(\" BAS094\",TABLAS!$A$203)","v":0},{"$f":"+GETPIVOTDATA(\" BAS095\",TABLAS!$A$203)","v":0},{"$f":"+GETPIVOTDATA(\" BAS096\",TABLAS!$A$203)","v":0},{"$f":"+GETPIVOTDATA(\" BAS097\",TABLAS!$A$203)","v":0},{"$f":"+GETPIVOTDATA(\" BAS098\",TABLAS!$A$203)","v":0},{"$f":"+GETPIVOTDATA(\" BAS099\",TABLAS!$A$203)","v":0},{"$f":"+GETPIVOTDATA(\" BAS100\",TABLAS!$A$203)","v":0},{"$f":"+GETPIVOTDATA(\" BAS101\",TABLAS!$A$203)","v":0},{"$f":"+GETPIVOTDATA(\" BAS102\",TABLAS!$A$203)","v":0},{"$f":"+GETPIVOTDATA(\" BAS103\",TABLAS!$A$203)","v":0},0,null,null,null,94,{"$f":"+Q91+1","v":95},96,97,98,99,100,101,102,103,null,null,{"$f":"IF(LEN(Q91)=1,CONCATENATE(\"00\",Q91),IF(LEN(Q91)=2,CONCATENATE(\"0\",Q91),Q91))","v":"094"},"095","096","097","098","099",100,101,102,103,null,{"$f":"$AI$23&AC91&$AJ$22","v":"=+IMPORTARDATOSDINAMICOS(\" BAS094\";TABLAS!$A$281)"},"=+IMPORTARDATOSDINAMICOS(\" BAS095\";TABLAS!$A$281)","=+IMPORTARDATOSDINAMICOS(\" BAS096\";TABLAS!$A$281)","=+IMPORTARDATOSDINAMICOS(\" BAS097\";TABLAS!$A$281)","=+IMPORTARDATOSDINAMICOS(\" BAS098\";TABLAS!$A$281)","=+IMPORTARDATOSDINAMICOS(\" BAS099\";TABLAS!$A$281)","=+IMPORTARDATOSDINAMICOS(\" BAS100\";TABLAS!$A$281)","=+IMPORTARDATOSDINAMICOS(\" BAS101\";TABLAS!$A$281)","=+IMPORTARDATOSDINAMICOS(\" BAS102\";TABLAS!$A$281)","=+IMPORTARDATOSDINAMICOS(\" BAS103\";TABLAS!$A$281)"]
[null,"Sintomático respiratorio identificado",{"$f":"+GETPIVOTDATA(\" BAS104\",TABLAS!$A$203)","v":389},{"$f":"+GETPIVOTDATA(\" BAS105\",TABLAS!$A$203)","v":3},{"$f":"+GETPIVOTDATA(\" BAS106\",TABLAS!$A$203)","v":0},{"$f":"+GETPIVOTDATA(\" BAS107\",TABLAS!$A$203)","v":0},{"$f":"+GETPIVOTDATA(\" BAS108\",TABLAS!$A$203)","v":0},{"$f":"+GETPIVOTDATA(\" BAS109\",TABLAS!$A$203)","v":6},{"$f":"+GETPIVOTDATA(\" BAS110\",TABLAS!$A$203)","v":0},{"$f":"+GETPIVOTDATA(\" BAS111\",TABLAS!$A$203)","v":0},{"$f":"+GETPIVOTDATA(\" BAS112\",TABLAS!$A$203)","v":0},{"$f":"+GETPIVOTDATA(\" BAS113\",TABLAS!$A$203)","v":0},398,null,null,null,{"$f":"+Z91+1","v":104},105,106,107,108,109,110,111,112,113,null,null,104,105,106,107,108,109,110,111,112,113,null,"=+IMPORTARDATOSDINAMICOS(\" BAS104\";TABLAS!$A$281)","=+IMPORTARDATOSDINAMICOS(\" BAS105\";TABLAS!$A$281)","=+IMPORTARDATOSDINAMICOS(\" BAS106\";TABLAS!$A$281)","=+IMPORTARDATOSDINAMICOS(\" BAS107\";TABLAS!$A$281)","=+IMPORTARDATOSDINAMICOS(\" BAS108\";TABLAS!$A$281)","=+IMPORTARDATOSDINAMICOS(\" BAS109\";TABLAS!$A$281)","=+IMPORTARDATOSDINAMICOS(\" BAS110\";TABLAS!$A$281)","=+IMPORTARDATOSDINAMICOS(\" BAS111\";TABLAS!$A$281)","=+IMPORTARDATOSDINAMICOS(\" BAS112\";TABLAS!$A$281)","=+IMPORTARDATOSDINAMICOS(\" BAS113\";TABLAS!$A$281)"]
[null,"Sintomático respiratorio examinado",{"$f":"+GETPIVOTDATA(\" BAS114\",TABLAS!$A$203)","v":367},{"$f":"+GETPIVOTDATA(\" BAS115\",TABLAS!$A$203)","v":1},{"$f":"+GETPIVOTDATA(\" BAS116\",TABLAS!$A$203)","v":0},{"$f":"+GETPIVOTDATA(\" BAS117\",TABLAS!$A$203)","v":0},{"$f":"+GETPIVOTDATA(\" BAS118\",TABLAS!$A$203)","v":0},{"$f":"+GETPIVOTDATA(\" BAS119\",TABLAS!$A$203)","v":8},{"$f":"+GETPIVOTDATA(\" BAS120\",TABLAS!$A$203)","v":0},{"$f":"+GETPIVOTDATA(\" BAS121\",TABLAS!$A$203)","v":0},{"$f":"+GETPIVOTDATA(\" BAS122\",TABLAS!$A$203)","v":0},{"$f":"+GETPIVOTDATA(\" BAS123\",TABLAS!$A$203)","v":0},376,null,null,null,{"$f":"+Z92+1","v":114},115,116,117,118,119,120,121,122,123,null,null,114,115,116,117,118,119,120,121,122,123,null,"=+IMPORTARDATOSDINAMICOS(\" BAS114\";TABLAS!$A$281)","=+IMPORTARDATOSDINAMICOS(\" BAS115\";TABLAS!$A$281)","=+IMPORTARDATOSDINAMICOS(\" BAS116\";TABLAS!$A$281)","=+IMPORTARDATOSDINAMICOS(\" BAS117\";TABLAS!$A$281)","=+IMPORTARDATOSDINAMICOS(\" BAS118\";TABLAS!$A$281)","=+IMPORTARDATOSDINAMICOS(\" BAS119\";TABLAS!$A$281)","=+IMPORTARDATOSDINAMICOS(\" BAS120\";TABLAS!$A$281)","=+IMPORTARDATOSDINAMICOS(\" BAS121\";TABLAS!$A$281)","=+IMPORTARDATOSDINAMICOS(\" BAS122\";TABLAS!$A$281)","=+IMPORTARDATOSDINAMICOS(\" BAS123\";TABLAS!$A$281)"]
[null,"SR examinados con bacteriología confirmada",{"$f":"+GETPIVOTDATA(\" BAS124\",TABLAS!$A$203)","v":0},{"$f":"+GETPIVOTDATA(\" BAS125\",TABLAS!$A$203)","v":0},{"$f":"+GETPIVOTDATA(\" BAS126\",TABLAS!$A$203)","v":0},{"$f":"+GETPIVOTDATA(\" BAS127\",TABLAS!$A$203)","v":0},{"$f":"+GETPIVOTDATA(\" BAS128\",TABLAS!$A$203)","v":0},{"$f":"+GETPIVOTDATA(\" BAS129\",TABLAS!$A$203)","v":0},{"$f":"+GETPIVOTDATA(\" BAS130\",TABLAS!$A$203)","v":0},{"$f":"+GETPIVOTDATA(\" BAS131\",TABLAS!$A$203)","v":0},{"$f":"+GETPIVOTDATA(\" BAS132\",TABLAS!$A$203)","v":0},{"$f":"+GETPIVOTDATA(\" BAS133\",TABLAS!$A$203)","v":0},0,null,null,null,124,125,126,127,128,129,130,131,132,133,null,null,124,125,126,127,128,129,130,131,132,133,null,"=+IMPORTARDATOSDINAMICOS(\" BAS124\";TABLAS!$A$281)","=+IMPORTARDATOSDINAMICOS(\" BAS125\";TABLAS!$A$281)","=+IMPORTARDATOSDINAMICOS(\" BAS126\";TABLAS!$A$281)","=+IMPORTARDATOSDINAMICOS(\" BAS127\";TABLAS!$A$281)","=+IMPORTARDATOSDINAMICOS(\" BAS128\";TABLAS!$A$281)","=+IMPORTARDATOSDINAMICOS(\" BAS129\";TABLAS!$A$281)","=+IMPORTARDATOSDINAMICOS(\" BAS130\";TABLAS!$A$281)","=+IMPORTARDATOSDINAMICOS(\" BAS131\";TABLAS!$A$281)","=+IMPORTARDATOSDINAMICOS(\" BAS132\";TABLAS!$A$281)","=+IMPORTARDATOSDINAMICOS(\" BAS133\";TABLAS!$A$281)"]

{"sheet":"TOTAL","index":8,"n_rows":94,"n_cols":49,"rows_kept":94,"cut":false,"hidden":false,"merged":[[7,2,7,3],[7,6,7,9],[1,1,1,11],[2,1,2,12],[5,2,5,3],[5,6,5,7],[6,2,6,3],[3,1,3,12],[21,6,21,7],[8,2,8,3],[9,2,9,3],[9,6,9,9],[10,2,10,3],[11,2,11,3],[11,6,11,7],[12,2,12,3],[13,2,13,3],[14,2,14,3],[15,2,15,3],[21,1,21,4],[32,1,32,2],[22,1,22,3],[22,4,23,4],[22,6,22,7],[23,6,24,6],[25,6,25,7],[26,1,26,3],[26,6,26,8],[27,1,27,2],[27,6,27,8],[28,1,28,2],[29,1,29,2],[30,1,30,2],[33,1,33,2],[33,6,33,7],[34,1,34,2],[34,6,34,7],[35,1,35,2],[35,6,35,7],[40,1,40,2],[40,8,40,9],[41,1,41,2],[41,8,41,9],[42,1,42,2],[42,8,42,9],[56,7,57,7],[56,9,56,10],[57,9,57,10],[43,1,44,2],[43,8,43,9],[45,1,45,2],[45,8,45,9],[46,1,47,2],[46,4,47,5],[53,4,53,5],[53,9,53,10],[54,7,55,7],[54,9,54,10],[55,9,55,10],[58,1,58,2],[58,4,58,6],[61,1,61,2],[62,1,65,1],[62,2,63,2],[62,5,65,5],[64,2,65,2],[81,12,82,12],[66,1,67,1],[66,3,67,3],[66,5,67,5],[68,2,68,4],[69,2,69,4],[81,1,82,1],[81,2,81,11]]}
[]
[]
[null,"REPORTE MENSUAL DE ACTIVIDADES DE PREVENCION Y CONTROL DE TUBERCULOSIS"]
[null,"CURSO DE VIDA : TODOS"]
[]
[null,"DIRESA","CUSCO",null,null,"REGION","CUSCO"]
[]
[null,"RED DE SALUD ",{"$f":"+TABLAS!O9","v":"03 - LA CONVENCION"},null,null,"EJECUTORA",{"$f":"+TABLAS!O14","v":""}]
[]
[null,"MICRO RED",{"$f":"+TABLAS!O10","v":""},null,null,"RESPONSABLE"]
[]
[null,"EE.SS.",{"$f":"+TABLAS!O11","v":""},null,null,"COD. RENAES",{"$f":"+TABLAS!Q11","v":""}]
[]
[null,"PROVINCIA",{"$f":"+TABLAS!O12","v":""},null,null,"AÑO",{"$f":"+TABLAS!J16","v":"2025"}]
[]
[null,"DISTRITO",{"$f":"+TABLAS!O13","v":""},null,null,"MES",{"$f":"+TABLAS!N26","v":"ENE - MAR"}]
[]
[null,"INSTITUCION :  MINSA (  X  )   ESSALUD (     )   FFAA  (     )   PNP  (     )   INPE  (     )   OTROS  (     )"]
[]
[null,"I. ACTIVIDADES DE DETECCION Y DIAGNOSTICO PARA TUBERCULOSIS"]
[]
[null,"DETECCIÓN DE CASOS",null,null,null,null,"RECOLECCIÓN DE MUESTRAS PARA EXAMEN BACTERIOLÓGICO",null,"N°",null,null,null,null,null,null,null,null,null,null,null,null,null,null,null,null,null,null,null,null,null,null,null,null,null,null,"\";TABLAS!$A$281)"]
[null,"Sintomático respiratorio (SR)",null,null,"Caso probable de TB",null,"RECOLECCIÓN DE MUESTRAS PARA TB*",null,{"$f":"+'TBC0011'!I23+'TBC1217'!I23+'TBC1829'!I23+'TBC3059'!I23+'TBC6099'!I23","v":4061},null,null,null,null,null,null,null,1,null,null,null,null,null,null,null,null,null,null,null,{"$f":"IF(LEN(Q23)=1,CONCATENATE(\"00\",Q23),IF(LEN(Q23)=2,CONCATENATE(\"0\",Q23),Q23))","v":"001"},null,null,null,null,null,"=+IMPORTARDATOSDINAMICOS(\" BAS",null,null,null,null,{"$f":"$AI$23&AC23&$AJ$22","v":"=+IMPORTARDATOSDINAMICOS(\" BAS001\";TABLAS!$A$281)"}]
[null,"SR Identificado","SR Examinado","SR examinados con bacteriología confirmada",null,null,"PROCEDIMIENTOS ESPECIALES PARA OBTENCION DE MUESTRAS","Lavado gástrico",{"$f":"+'TBC0011'!I24+'TBC1217'!I24+'TBC1829'!I24+'TBC3059'!I24+'TBC6099'!I24","v":0},null,null,null,null,null,null,null,{"$f":"+Q23+1","v":2},null,null,null,null,null,null,null,null,null,null,null,"002",null,null,null,null,null,null,null,null,null,null,{"$f":"$AI$23&AC24&$AJ$22","v":"=+IMPORTARDATOSDINAMICOS(\" BAS002\";TABLAS!$A$281)"}]
[null,{"$f":"M92","v":1155},{"$f":"M93","v":1099},{"$f":"M94","v":4},{"$f":"M91","v":0},null,null,"Inducción del esputo",{"$f":"+'TBC0011'!I25+'TBC1217'!I25+'TBC1829'!I25+'TBC3059'!I25+'TBC6099'!I25","v":0},null,null,null,null,null,null,null,{"$f":"+Q24+1","v":3},null,null,null,null,null,null,null,null,null,null,null,"003",null,null,null,null,null,null,null,null,null,null,"=+IMPORTARDATOSDINAMICOS(\" BAS003\";TABLAS!$A$281)"]
[null,null,null,null,null,null,"TOTAL",null,{"$f":"SUM(I23+I24+I25)","v":4061}]
[null,"SR examinados con bacteriología confirmada",null,null,null,null,"*Muestra recolectada por expectoración espontánea"]
[null,"Por baciloscopia",null,{"$f":"+'TBC0011'!D28+'TBC1217'!D28+'TBC1829'!D28+'TBC3059'!D28+'TBC6099'!D28","v":3},null,null,"REFERENCIAS",null,null,null,null,null,null,null,null,null,{"$f":"+Q25+1","v":4},null,null,null,null,null,null,null,null,null,null,null,{"$f":"IF(LEN(Q28)=1,CONCATENATE(\"00\",Q28),IF(LEN(Q28)=2,CONCATENATE(\"0\",Q28),Q28))","v":"004"},null,null,null,null,null,null,null,null,null,null,{"$f":"$AI$23&AC28&$AJ$22","v":"=+IMPORTARDATOSDINAMICOS(\" BAS004\";TABLAS!$A$281)"}]
[null,"Por prueba molecular",null,{"$f":"+'TBC0011'!D29+'TBC1217'!D29+'TBC1829'!D29+'TBC3059'!D29+'TBC6099'!D29","v":1},null,null,"Condición","Derivaciones","Transferencias",null,null,null,null,null,null,null,{"$f":"+Q28+1","v":5},null,null,{"$f":"+Q30+1","v":7},{"$f":"+T29+1","v":8},null,null,null,null,null,null,null,"005",null,null,{"$f":"IF(LEN(T29)=1,CONCATENATE(\"00\",T29),IF(LEN(T29)=2,CONCATENATE(\"0\",T29),T29))","v":"007"},"008",null,null,null,null,null,null,"=+IMPORTARDATOSDINAMICOS(\" BAS005\";TABLAS!$A$281)",null,null,{"$f":"$AI$23&AF29&$AJ$22","v":"=+IMPORTARDATOSDINAMICOS(\" BAS007\";TABLAS!$A$281)"},"=+IMPORTARDATOSDINAMICOS(\" BAS008\";TABLAS!$A$281)"]
[null,"Por cultivo",null,{"$f":"+'TBC0011'!D30+'TBC1217'!D30+'TBC1829'!D30+'TBC3059'!D30+'TBC6099'!D30","v":0},null,null,"Realizadas",{"$f":"+'TBC0011'!H30+'TBC1217'!H30+'TBC1829'!H30+'TBC3059'!H30+'TBC6099'!H30","v":1},{"$f":"+'TBC0011'!I30+'TBC1217'!I30+'TBC1829'!I30+'TBC3059'!I30+'TBC6099'!I30","v":1},null,null,null,null,null,null,null,{"$f":"+Q29+1","v":6},null,null,{"$f":"+U29+1","v":9},{"$f":"+T30+1","v":10},null,null,null,null,null,null,null,"006",null,null,"009","010",null,null,null,null,null,null,"=+IMPORTARDATOSDINAMICOS(\" BAS006\";TABLAS!$A$281)",null,null,"=+IMPORTARDATOSDINAMICOS(\" BAS009\";TABLAS!$A$281)","=+IMPORTARDATOSDINAMICOS(\" BAS010\";TABLAS!$A$281)"]
[null,"TOTAL",null,{"$f":"SUM(D28+D29+D30)","v":4},null,null,"Aceptadas",{"$f":"+'TBC0011'!H31+'TBC1217'!H31+'TBC1829'!H31+'TBC3059'!H31+'TBC6099'!H31","v":4},{"$f":"+'TBC0011'!I31+'TBC1217'!I31+'TBC1829'!I31+'TBC3059'!I31+'TBC6099'!I31","v":0}]
[null,null,null,null,null,null,"TOTAL",{"$f":"SUM(H30+H31)","v":5},{"$f":"SUM(I30+I31)","v":1}]
[null,"COMORBILIDADES Y CONDICIONES ASOCIADAS",null,"N°"]
[null,"TB-VIH/SIDA",null,{"$f":"+'TBC0011'!D34+'TBC1217'!D34+'TBC1829'!D34+'TBC3059'!D34+'TBC6099'!D34","v":0},null,null,"TAMIZAJE DE COMORBILIDADES",null,"N°",null,null,null,null,null,null,null,{"$f":"+U30+1","v":11},null,null,null,null,null,null,null,null,null,null,null,{"$f":"IF(LEN(Q34)=1,CONCATENATE(\"00\",Q34),IF(LEN(Q34)=2,CONCATENATE(\"0\",Q34),Q34))","v":"011"},null,null,null,null,null,null,null,null,null,null,{"$f":"$AI$23&AC34&$AJ$22","v":"=+IMPORTARDATOSDINAMICOS(\" BAS011\";TABLAS!$A$281)"}]
[null,"TB-DM",null,{"$f":"+'TBC0011'!D35+'TBC1217'!D35+'TBC1829'!D35+'TBC3059'!D35+'TBC6099'!D35","v":0},null,null,"Tamizaje TB-VIH",null,{"$f":"+'TBC0011'!I35+'TBC1217'!I35+'TBC1829'!I35+'TBC3059'!I35+'TBC6099'!I35","v":14},null,null,null,null,null,null,null,{"$f":"+Q34+1","v":12},null,{"$f":"+Q36+1","v":14},null,null,null,null,null,null,null,null,null,"012",null,{"$f":"IF(LEN(S35)=1,CONCATENATE(\"00\",S35),IF(LEN(S35)=2,CONCATENATE(\"0\",S35),S35))","v":"014"},null,null,null,null,null,null,null,null,"=+IMPORTARDATOSDINAMICOS(\" BAS012\";TABLAS!$A$281)",null,{"$f":"$AI$23&AE35&$AJ$22","v":"=+IMPORTARDATOSDINAMICOS(\" BAS014\";TABLAS!$A$281)"}]
[null,"Reacción adversa a medicamentos para TB",null,{"$f":"+'TBC0011'!D36+'TBC1217'!D36+'TBC1829'!D36+'TBC3059'!D36+'TBC6099'!D36","v":0},null,null,"Tamizaje TB-DM",null,{"$f":"+'TBC0011'!I36+'TBC1217'!I36+'TBC1829'!I36+'TBC3059'!I36+'TBC6099'!I36","v":11},null,null,null,null,null,null,null,13,null,{"$f":"+S35+1","v":15},null,null,null,null,null,null,null,null,null,"013",null,"015",null,null,null,null,null,null,null,null,"=+IMPORTARDATOSDINAMICOS(\" BAS013\";TABLAS!$A$281)",null,"=+IMPORTARDATOSDINAMICOS(\" BAS015\";TABLAS!$A$281)"]
[]
[]
[null,"II. ACTIVIDADES PARA LA RECUPERACION DE LA PERSONA AFECTADA POR TUBERCULOSIS"]
[]
[null,"ATENCIÓN MULTIDISCIPLINARIA",null,"MODALIDAD","EN PAT CON TB SENSIBLE","EN PAT CON TB RESISTENTE","TOTAL",null,2,null,"N°"]
[null,"Evaluación médica",null,null,{"$f":"+'TBC0011'!E42+'TBC1217'!E42+'TBC1829'!E42+'TBC3059'!E42+'TBC6099'!E42","v":7},{"$f":"+'TBC0011'!F42+'TBC1217'!F42+'TBC1829'!F42+'TBC3059'!F42+'TBC6099'!F42","v":2},{"$f":"SUM(E42+F42)","v":9},null,"Administración de tratamiento para TB sensible",null,{"$f":"+'TBC0011'!K42+'TBC1217'!K42+'TBC1829'!K42+'TBC3059'!K42+'TBC6099'!K42","v":1819},null,null,null,null,null,{"$f":"+S36+1","v":16},{"$f":"+Q42+1","v":17},null,null,null,{"$f":"+Q48+1","v":28},null,null,null,null,null,null,{"$f":"IF(LEN(Q42)=1,CONCATENATE(\"00\",Q42),IF(LEN(Q42)=2,CONCATENATE(\"0\",Q42),Q42))","v":"016"},"017",null,null,null,{"$f":"IF(LEN(V42)=1,CONCATENATE(\"00\",V42),IF(LEN(V42)=2,CONCATENATE(\"0\",V42),V42))","v":"028"},null,null,null,null,null,{"$f":"$AI$23&AC42&$AJ$22","v":"=+IMPORTARDATOSDINAMICOS(\" BAS016\";TABLAS!$A$281)"},"=+IMPORTARDATOSDINAMICOS(\" BAS017\";TABLAS!$A$281)",null,null,null,{"$f":"$AI$23&AH42&$AJ$22","v":"=+IMPORTARDATOSDINAMICOS(\" BAS028\";TABLAS!$A$281)"}]
[null,"Atención en consultorio de enfermería",null,null,{"$f":"+'TBC0011'!E43+'TBC1217'!E43+'TBC1829'!E43+'TBC3059'!E43+'TBC6099'!E43","v":0},{"$f":"+'TBC0011'!F43+'TBC1217'!F43+'TBC1829'!F43+'TBC3059'!F43+'TBC6099'!F43","v":0},{"$f":"SUM(E43+F43)","v":0},null,"Administración de tratamiento para TB resistente",null,{"$f":"+'TBC0011'!K43+'TBC1217'!K43+'TBC1829'!K43+'TBC3059'!K43+'TBC6099'!K43","v":316},null,null,null,null,null,{"$f":"+R42+1","v":18},{"$f":"+Q43+1","v":19},null,null,null,{"$f":"+V42+1","v":29},null,null,null,null,null,null,"018","019",null,null,null,"029",null,null,null,null,null,"=+IMPORTARDATOSDINAMICOS(\" BAS018\";TABLAS!$A$281)","=+IMPORTARDATOSDINAMICOS(\" BAS019\";TABLAS!$A$281)",null,null,null,"=+IMPORTARDATOSDINAMICOS(\" BAS029\";TABLAS!$A$281)"]
[null,"Atención de servicio social",null,"En el establecimiento de salud",{"$f":"+'TBC0011'!E44+'TBC1217'!E44+'TBC1829'!E44+'TBC3059'!E44+'TBC6099'!E44","v":0},{"$f":"+'TBC0011'!F44+'TBC1217'!F44+'TBC1829'!F44+'TBC3059'!F44+'TBC6099'!F44","v":0},{"$f":"SUM(E44+F44)","v":0},null,"Control de tratamiento",null,{"$f":"+'TBC0011'!K44+'TBC1217'!K44+'TBC1829'!K44+'TBC3059'!K44+'TBC6099'!K44","v":74},null,null,null,null,null,{"$f":"+R43+1","v":20},21,null,null,null,{"$f":"+V43+1","v":30},null,null,null,null,null,null,"020","021",null,null,null,"030",null,null,null,null,null,"=+IMPORTARDATOSDINAMICOS(\" BAS020\";TABLAS!$A$281)","=+IMPORTARDATOSDINAMICOS(\" BAS021\";TABLAS!$A$281)",null,null,null,"=+IMPORTARDATOSDINAMICOS(\" BAS030\";TABLAS!$A$281)"]
[null,null,null,"Mediante teleconsulta en línea",{"$f":"+'TBC0011'!E45+'TBC1217'!E45+'TBC1829'!E45+'TBC3059'!E45+'TBC6099'!E45","v":0},{"$f":"+'TBC0011'!F45+'TBC1217'!F45+'TBC1829'!F45+'TBC3059'!F45+'TBC6099'!F45","v":0},{"$f":"SUM(E45+F45)","v":0},null,null,null,null,null,null,null,null,null,22,23,null,null,null,null,null,null,null,null,null,null,"022","023",null,null,null,null,null,null,null,null,null,"=+IMPORTARDATOSDINAMICOS(\" BAS022\";TABLAS!$A$281)","=+IMPORTARDATOSDINAMICOS(\" BAS023\";TABLAS!$A$281)"]
[null,"Atención en nutrición",null,null,{"$f":"+'TBC0011'!E46+'TBC1217'!E46+'TBC1829'!E46+'TBC3059'!E46+'TBC6099'!E46","v":11},{"$f":"+'TBC0011'!F46+'TBC1217'!F46+'TBC1829'!F46+'TBC3059'!F46+'TBC6099'!F46","v":0},{"$f":"SUM(E46+F46)","v":11},null,"RETO ANTE REACCIONES ADVERSAS",null,null,null,null,null,null,null,24,25,null,null,null,null,null,null,null,null,null,null,"024","025",null,null,null,null,null,null,null,null,null,"=+IMPORTARDATOSDINAMICOS(\" BAS024\";TABLAS!$A$281)","=+IMPORTARDATOSDINAMICOS(\" BAS025\";TABLAS!$A$281)"]
[null,"Atención en salud mental",null,"En el establecimiento de salud",null,null,{"$f":"+'TBC0011'!G47+'TBC1217'!G47+'TBC1829'!G47+'TBC3059'!G47+'TBC6099'!G47","v":0},null,"Condición","N°",null,null,null,null,null,null,26,null,null,null,null,null,null,null,null,null,null,null,"026",null,null,null,null,null,null,null,null,null,null,"=+IMPORTARDATOSDINAMICOS(\" BAS026\";TABLAS!$A$281)"]
[null,null,null,"Mediante teleorientación síncrona",null,null,{"$f":"+'TBC0011'!G48+'TBC1217'!G48+'TBC1829'!G48+'TBC3059'!G48+'TBC6099'!G48","v":0},null,"Inicio",{"$f":"+'TBC0011'!J48+'TBC1217'!J48+'TBC1829'!J48+'TBC3059'!J48+'TBC6099'!J48","v":0},null,"REGISTRO EN EL PADRON DE BENEFICIARIOS PANTBC",null,null,null,null,{"$f":"+Q47+1","v":27},null,null,null,null,{"$f":"+V44+1","v":31},null,null,null,null,null,null,"027",null,null,null,null,{"$f":"IF(LEN(V48)=1,CONCATENATE(\"00\",V48),IF(LEN(V48)=2,CONCATENATE(\"0\",V48),V48))","v":"031"},null,null,null,null,null,"=+IMPORTARDATOSDINAMICOS(\" BAS027\";TABLAS!$A$281)",null,null,null,null,{"$f":"$AI$23&AH48&$AJ$22","v":"=+IMPORTARDATOSDINAMICOS(\" BAS031\";TABLAS!$A$281)"}]
[null,null,null,null,null,null,null,null,"Término",{"$f":"+'TBC0011'!J49+'TBC1217'!J49+'TBC1829'!J49+'TBC3059'!J49+'TBC6099'!J49","v":0},null,{"$f":"+'TBC0011'!L49+'TBC1217'!L49+'TBC1829'!L49+'TBC3059'!L49+'TBC6099'!L49","v":11},null,null,null,null,null,null,null,null,null,{"$f":"+V48+1","v":32},null,{"$f":"+V49+1","v":33},null,null,null,null,null,null,null,null,null,"032",null,{"$f":"IF(LEN(X49)=1,CONCATENATE(\"00\",X49),IF(LEN(X49)=2,CONCATENATE(\"0\",X49),X49))","v":"033"},null,null,null,null,null,null,null,null,"=+IMPORTARDATOSDINAMICOS(\" BAS032\";TABLAS!$A$281)",null,{"$f":"$AI$23&AJ49&$AJ$22","v":"=+IMPORTARDATOSDINAMICOS(\" BAS033\";TABLAS!$A$281)"}]
[]
[]
[null,"III. ACTIVIDADES DE PREVENCIÓN EN TUBERCULOSIS"]
[]
[null,"CENSO DE CONTACTOS","N°",null,"PRUEBA PARA DIAGNOSTICO DE TB LATENTE",null,"N°","POSITIVOS",null,"TERAPIA PREVENTIVA PARA TUBERCULOSIS LATENTE",null,"N°"]
[null,"En el establecimiento de salud",{"$f":"+'TBC0011'!C55+'TBC1217'!C55+'TBC1829'!C55+'TBC3059'!C55+'TBC6099'!C55","v":11},null,"PPD","Aplicación",{"$f":"M84","v":134},{"$f":"+'TBC0011'!H55+'TBC1217'!H55+'TBC1829'!H55+'TBC3059'!H55+'TBC6099'!H55","v":0},null,"Administración de terapia preventiva para contactos de TB sensible",null,{"$f":"+'TBC0011'!L55+'TBC1217'!L55+'TBC1829'!L55+'TBC3059'!L55+'TBC6099'!L55","v":88},null,null,null,null,{"$f":"+X49+1","v":34},null,{"$f":"+Q57+1","v":37},null,{"$f":"+S57+1","v":39},null,null,null,null,null,null,null,{"$f":"IF(LEN(Q55)=1,CONCATENATE(\"00\",Q55),IF(LEN(Q55)=2,CONCATENATE(\"0\",Q55),Q55))","v":"034"},null,{"$f":"IF(LEN(S55)=1,CONCATENATE(\"00\",S55),IF(LEN(S55)=2,CONCATENATE(\"0\",S55),S55))","v":"037"},null,{"$f":"IF(LEN(U55)=1,CONCATENATE(\"00\",U55),IF(LEN(U55)=2,CONCATENATE(\"0\",U55),U55))","v":"039"},null,null,null,null,null,null,{"$f":"$AI$23&AC55&$AJ$22","v":"=+IMPORTARDATOSDINAMICOS(\" BAS034\";TABLAS!$A$281)"},null,{"$f":"$AI$23&AE55&$AJ$22","v":"=+IMPORTARDATOSDINAMICOS(\" BAS037\";TABLAS!$A$281)"},null,{"$f":"$AI$23&AG55&$AJ$22","v":"=+IMPORTARDATOSDINAMICOS(\" BAS039\";TABLAS!$A$281)"}]
[null,"En el domicilio*",{"$f":"+'TBC0011'!C56+'TBC1217'!C56+'TBC1829'!C56+'TBC3059'!C56+'TBC6099'!C56","v":1},null,null,"Lectura",{"$f":"M85","v":69},null,null,"Administración de terapia preventiva para contactos de TB resistente",null,{"$f":"+'TBC0011'!L56+'TBC1217'!L56+'TBC1829'!L56+'TBC3059'!L56+'TBC6099'!L56","v":1},null,null,null,null,{"$f":"+Q55+1","v":35},null,null,null,{"$f":"+U55+1","v":40},null,null,null,null,null,null,null,"035",null,null,null,{"$f":"IF(LEN(U56)=1,CONCATENATE(\"00\",U56),IF(LEN(U56)=2,CONCATENATE(\"0\",U56),U56))","v":"040"},null,null,null,null,null,null,"=+IMPORTARDATOSDINAMICOS(\" BAS035\";TABLAS!$A$281)",null,null,null,"=+IMPORTARDATOSDINAMICOS(\" BAS040\";TABLAS!$A$281)"]
[null,"Mediante teleorientación síncrona",{"$f":"+'TBC0011'!C57+'TBC1217'!C57+'TBC1829'!C57+'TBC3059'!C57+'TBC6099'!C57","v":0},null,"IGRA","Aplicación",{"$f":"M86","v":0},{"$f":"+'TBC0011'!H57+'TBC1217'!H57+'TBC1829'!H57+'TBC3059'!H57+'TBC6099'!H57","v":0},null,"Administración de terapia preventiva para población vulnerable para TB",null,{"$f":"+'TBC0011'!L57+'TBC1217'!L57+'TBC1829'!L57+'TBC3059'!L57+'TBC6099'!L57","v":0},null,null,null,null,{"$f":"+Q56+1","v":36},null,{"$f":"+S55+1","v":38},null,null,null,null,null,null,null,null,null,"036",null,{"$f":"IF(LEN(S57)=1,CONCATENATE(\"00\",S57),IF(LEN(S57)=2,CONCATENATE(\"0\",S57),S57))","v":"038"},null,null,null,null,null,null,null,null,"=+IMPORTARDATOSDINAMICOS(\" BAS036\";TABLAS!$A$281)",null,{"$f":"$AI$23&AE57&$AJ$22","v":"=+IMPORTARDATOSDINAMICOS(\" BAS038\";TABLAS!$A$281)"}]
[null,"Total",{"$f":"SUM(C55+C56+C57)","v":12},null,null,"Lectura",{"$f":"M87","v":0},null,null,"TOTAL",null,{"$f":"SUM(L55+L56+L57)","v":89}]
[null,"*Mediante visita familiar",null,null,"TOTAL",null,null,{"$f":"SUM(H55+H57)","v":0}]
[]
[null,"IV. ACTIVIDADES DE PROMOCIÓN DE LA SALUD EN TUBERCULOSIS"]
[null,"ACTIVIDADES",null,"MODALIDAD","N°","TOTAL"]
[null,"Consejeria para TB","Primera","Mediante visita familiar",{"$f":"+'TBC0011'!E63+'TBC1217'!E63+'TBC1829'!E63+'TBC3059'!E63+'TBC6099'!E63","v":4},{"$f":"SUM(E63+E64+E65+E66)","v":4},null,null,null,null,null,null,null,null,null,null,{"$f":"+U56+1","v":41},null,null,null,null,null,null,null,null,null,null,null,{"$f":"IF(LEN(Q63)=1,CONCATENATE(\"00\",Q63),IF(LEN(Q63)=2,CONCATENATE(\"0\",Q63),Q63))","v":"041"},null,null,null,null,null,null,null,null,null,null,{"$f":"$AI$23&AC63&$AJ$22","v":"=+IMPORTARDATOSDINAMICOS(\" BAS041\";TABLAS!$A$281)"}]
[null,null,null,"Mediante teleorientación síncrona",{"$f":"+'TBC0011'!E64+'TBC1217'!E64+'TBC1829'!E64+'TBC3059'!E64+'TBC6099'!E64","v":0},null,null,null,null,null,null,null,null,null,null,null,{"$f":"+Q63+1","v":42},null,null,null,null,null,null,null,null,null,null,null,"042",null,null,null,null,null,null,null,null,null,null,"=+IMPORTARDATOSDINAMICOS(\" BAS042\";TABLAS!$A$281)"]
[null,null,"Segunda","Mediante visita familiar",{"$f":"+'TBC0011'!E65+'TBC1217'!E65+'TBC1829'!E65+'TBC3059'!E65+'TBC6099'!E65","v":0},null,null,null,null,null,null,null,null,null,null,null,{"$f":"+Q64+1","v":43},null,null,null,null,null,null,null,null,null,null,null,"043",null,null,null,null,null,null,null,null,null,null,"=+IMPORTARDATOSDINAMICOS(\" BAS043\";TABLAS!$A$281)"]
[null,null,null,"Mediante teleorientación síncrona",{"$f":"+'TBC0011'!E66+'TBC1217'!E66+'TBC1829'!E66+'TBC3059'!E66+'TBC6099'!E66","v":0},null,null,null,null,null,null,null,null,null,null,null,44,null,null,null,null,null,null,null,null,null,null,null,"044",null,null,null,null,null,null,null,null,null,null,"=+IMPORTARDATOSDINAMICOS(\" BAS044\";TABLAS!$A$281)"]
[null,"Sesión educativa y demostrativa para TB","Primera",null,{"$f":"+'TBC0011'!E67+'TBC1217'!E67+'TBC1829'!E67+'TBC3059'!E67+'TBC6099'!E67","v":0},{"$f":"SUM(E67+E68)","v":0},null,null,null,null,null,null,null,null,null,null,45,null,null,null,null,null,null,null,null,null,null,null,"045",null,null,null,null,null,null,null,null,null,null,"=+IMPORTARDATOSDINAMICOS(\" BAS045\";TABLAS!$A$281)"]
[null,null,"Segunda",null,{"$f":"+'TBC0011'!E68+'TBC1217'!E68+'TBC1829'!E68+'TBC3059'!E68+'TBC6099'!E68","v":0},null,null,null,null,null,null,null,null,null,null,null,46,null,null,null,null,null,null,null,null,null,null,null,"046",null,null,null,null,null,null,null,null,null,null,"=+IMPORTARDATOSDINAMICOS(\" BAS046\";TABLAS!$A$281)"]
[null,"Visitas familiar",null,null,null,{"$f":"SUM(C56+E63+E65)","v":5}]
[null,"Otras consejerias",null,null,null,{"$f":"+'TBC0011'!F70+'TBC1217'!F70+'TBC1829'!F70+'TBC3059'!F70+'TBC6099'!F70","v":11},null,null,null,null,null,null,null,null,null,null,{"$f":"+Q68+1","v":47},null,null,null,null,null,null,null,null,null,null,null,{"$f":"IF(LEN(Q70)=1,CONCATENATE(\"00\",Q70),IF(LEN(Q70)=2,CONCATENATE(\"0\",Q70),Q70))","v":"047"},null,null,null,null,null,null,null,null,null,null,{"$f":"$AI$23&AC70&$AJ$22","v":"=+IMPORTARDATOSDINAMICOS(\" BAS047\";TABLAS!$A$281)"}]
[]
[]
[null,"V. ACTIVIDADES EN TELESALUD"]
[]
[null,"ACTIVIDADES","N°"]
[null,"Teleconsulta en línea",{"$f":"+'TBC0011'!C76+'TBC1217'!C76+'TBC1829'!C76+'TBC3059'!C76+'TBC6099'!C76","v":0}]
[null,"Teleorientación síncrona",{"$f":"+'TBC0011'!C77+'TBC1217'!C77+'TBC1829'!C77+'TBC3059'!C77+'TBC6099'!C77","v":0}]
[null,"Total",{"$f":"SUM(C76+C77)","v":0}]
[]
[null,"REPORTE DE ACTIVIDADES SEGMENTADO POR POBLACION AFECTADA Y VULNERABLE"]
[]
[null,"ACTIVIDADES","POBLACION AFECTADA Y VULNERABLE",null,null,null,null,null,null,null,null,null,"TOTAL"]
[null,null,"POBLACIÓN EN GENERAL","CONTACTOS","PERSONA VIVIENDO CON VIH/SIDA","TRABAJADOR DE SALUD","PERSONA CON DIABETES MELLITUS","PPL","PERSONA CON TERAPIA PROLONGADA CON CORTICOIDES","PERSONA CON HEMODIALISIS Y/O ENFERMEDAD RENAL CRÓNICA","PERSONAL PENITENCIARIO","OTRAS CONDICIONES DE SALUD SEGÚN NORMATIVIDAD VIGENTE"]
[null,"Aplicación de PPD",null,{"$f":"+'TBC0011'!D84+'TBC1217'!D84+'TBC1829'!D84+'TBC3059'!D84+'TBC6099'!D84","v":103},{"$f":"+'TBC0011'!E84+'TBC1217'!E84+'TBC1829'!E84+'TBC3059'!E84+'TBC6099'!E84","v":3},{"$f":"+'TBC0011'!F84+'TBC1217'!F84+'TBC1829'!F84+'TBC3059'!F84+'TBC6099'!F84","v":28},{"$f":"+'TBC0011'!G84+'TBC1217'!G84+'TBC1829'!G84+'TBC3059'!G84+'TBC6099'!G84","v":0},{"$f":"+'TBC0011'!H84+'TBC1217'!H84+'TBC1829'!H84+'TBC3059'!H84+'TBC6099'!H84","v":0},{"$f":"+'TBC0011'!I84+'TBC1217'!I84+'TBC1829'!I84+'TBC3059'!I84+'TBC6099'!I84","v":0},{"$f":"+'TBC0011'!J84+'TBC1217'!J84+'TBC1829'!J84+'TBC3059'!J84+'TBC6099'!J84","v":0},{"$f":"+'TBC0011'!K84+'TBC1217'!K84+'TBC1829'!K84+'TBC3059'!K84+'TBC6099'!K84","v":0},{"$f":"+'TBC0011'!L84+'TBC1217'!L84+'TBC1829'!L84+'TBC3059'!L84+'TBC6099'!L84","v":0},{"$f":"SUM(C84+D84+E84+F84+G84+H84+I84+J84+K84+L84)","v":134},null,null,null,{"$f":"+Q70+1","v":48},{"$f":"+Q84+1","v":49},{"$f":"+R84+1","v":50},51,52,53,54,55,56,null,null,null,{"$f":"IF(LEN(Q84)=1,CONCATENATE(\"00\",Q84),IF(LEN(Q84)=2,CONCATENATE(\"0\",Q84),Q84))","v":"048"},"049","050","051","052","053","054","055","056",null,null,{"$f":"$AI$23&AC84&$AJ$22","v":"=+IMPORTARDATOSDINAMICOS(\" BAS048\";TABLAS!$A$281)"},{"$f":"$AI$23&AD84&$AJ$22","v":"=+IMPORTARDATOSDINAMICOS(\" BAS049\";TABLAS!$A$281)"},"=+IMPORTARDATOSDINAMICOS(\" BAS050\";TABLAS!$A$281)","=+IMPORTARDATOSDINAMICOS(\" BAS051\";TABLAS!$A$281)","=+IMPORTARDATOSDINAMICOS(\" BAS052\";TABLAS!$A$281)","=+IMPORTARDATOSDINAMICOS(\" BAS053\";TABLAS!$A$281)","=+IMPORTARDATOSDINAMICOS(\" BAS054\";TABLAS!$A$281)","=+IMPORTARDATOSDINAMICOS(\" BAS055\";TABLAS!$A$281)","=+IMPORTARDATOSDINAMICOS(\" BAS056\";TABLAS!$A$281)"]
[null,"Lectura de PPD",null,{"$f":"+'TBC0011'!D85+'TBC1217'!D85+'TBC1829'!D85+'TBC3059'!D85+'TBC6099'!D85","v":41},{"$f":"+'TBC0011'!E85+'TBC1217'!E85+'TBC1829'!E85+'TBC3059'!E85+'TBC6099'!E85","v":0},{"$f":"+'TBC0011'!F85+'TBC1217'!F85+'TBC1829'!F85+'TBC3059'!F85+'TBC6099'!F85","v":28},{"$f":"+'TBC0011'!G85+'TBC1217'!G85+'TBC1829'!G85+'TBC3059'!G85+'TBC6099'!G85","v":0},{"$f":"+'TBC0011'!H85+'TBC1217'!H85+'TBC1829'!H85+'TBC3059'!H85+'TBC6099'!H85","v":0},{"$f":"+'TBC0011'!I85+'TBC1217'!I85+'TBC1829'!I85+'TBC3059'!I85+'TBC6099'!I85","v":0},{"$f":"+'TBC0011'!J85+'TBC1217'!J85+'TBC1829'!J85+'TBC3059'!J85+'TBC6099'!J85","v":0},{"$f":"+'TBC0011'!K85+'TBC1217'!K85+'TBC1829'!K85+'TBC3059'!K85+'TBC6099'!K85","v":0},{"$f":"+'TBC0011'!L85+'TBC1217'!L85+'TBC1829'!L85+'TBC3059'!L85+'TBC6099'!L85","v":0},69,null,null,null,{"$f":"+Y84+1","v":57},{"$f":"+Q85+1","v":58},59,60,61,62,63,64,65,null,null,null,"057","058","059","060","061","062","063","064","065",null,null,{"$f":"$AI$23&AC85&$AJ$22","v":"=+IMPORTARDATOSDINAMICOS(\" BAS057\";TABLAS!$A$281)"},"=+IMPORTARDATOSDINAMICOS(\" BAS058\";TABLAS!$A$281)","=+IMPORTARDATOSDINAMICOS(\" BAS059\";TABLAS!$A$281)","=+IMPORTARDATOSDINAMICOS(\" BAS060\";TABLAS!$A$281)","=+IMPORTARDATOSDINAMICOS(\" BAS061\";TABLAS!$A$281)","=+IMPORTARDATOSDINAMICOS(\" BAS062\";TABLAS!$A$281)","=+IMPORTARDATOSDINAMICOS(\" BAS063\";TABLAS!$A$281)","=+IMPORTARDATOSDINAMICOS(\" BAS064\";TABLAS!$A$281)","=+IMPORTARDATOSDINAMICOS(\" BAS065\";TABLAS!$A$281)"]
[null,"Aplicación de IGRA",null,{"$f":"+'TBC0011'!D86+'TBC1217'!D86+'TBC1829'!D86+'TBC3059'!D86+'TBC6099'!D86","v":0},{"$f":"+'TBC0011'!E86+'TBC1217'!E86+'TBC1829'!E86+'TBC3059'!E86+'TBC6099'!E86","v":0},{"$f":"+'TBC0011'!F86+'TBC1217'!F86+'TBC1829'!F86+'TBC3059'!F86+'TBC6099'!F86","v":0},{"$f":"+'TBC0011'!G86+'TBC1217'!G86+'TBC1829'!G86+'TBC3059'!G86+'TBC6099'!G86","v":0},{"$f":"+'TBC0011'!H86+'TBC1217'!H86+'TBC1829'!H86+'TBC3059'!H86+'TBC6099'!H86","v":0},{"$f":"+'TBC0011'!I86+'TBC1217'!I86+'TBC1829'!I86+'TBC3059'!I86+'TBC6099'!I86","v":0},{"$f":"+'TBC0011'!J86+'TBC1217'!J86+'TBC1829'!J86+'TBC3059'!J86+'TBC6099'!J86","v":0},{"$f":"+'TBC0011'!K86+'TBC1217'!K86+'TBC1829'!K86+'TBC3059'!K86+'TBC6099'!K86","v":0},{"$f":"+'TBC0011'!L86+'TBC1217'!L86+'TBC1829'!L86+'TBC3059'!L86+'TBC6099'!L86","v":0},0,null,null,null,{"$f":"+Y85+1","v":66},67,68,69,70,71,72,73,74,null,null,null,"066","067","068","069","070","071","072","073","074",null,null,"=+IMPORTARDATOSDINAMICOS(\" BAS066\";TABLAS!$A$281)","=+IMPORTARDATOSDINAMICOS(\" BAS067\";TABLAS!$A$281)","=+IMPORTARDATOSDINAMICOS(\" BAS068\";TABLAS!$A$281)","=+IMPORTARDATOSDINAMICOS(\" BAS069\";TABLAS!$A$281)","=+IMPORTARDATOSDINAMICOS(\" BAS070\";TABLAS!$A$281)","=+IMPORTARDATOSDINAMICOS(\" BAS071\";TABLAS!$A$281)","=+IMPORTARDATOSDINAMICOS(\" BAS072\";TABLAS!$A$281)","=+IMPORTARDATOSDINAMICOS(\" BAS073\";TABLAS!$A$281)","=+IMPORTARDATOSDINAMICOS(\" BAS074\";TABLAS!$A$281)"]
[null,"Lectura de IGRA",null,{"$f":"+'TBC0011'!D87+'TBC1217'!D87+'TBC1829'!D87+'TBC3059'!D87+'TBC6099'!D87","v":0},{"$f":"+'TBC0011'!E87+'TBC1217'!E87+'TBC1829'!E87+'TBC3059'!E87+'TBC6099'!E87","v":0},{"$f":"+'TBC0011'!F87+'TBC1217'!F87+'TBC1829'!F87+'TBC3059'!F87+'TBC6099'!F87","v":0},{"$f":"+'TBC0011'!G87+'TBC1217'!G87+'TBC1829'!G87+'TBC3059'!G87+'TBC6099'!G87","v":0},{"$f":"+'TBC0011'!H87+'TBC1217'!H87+'TBC1829'!H87+'TBC3059'!H87+'TBC6099'!H87","v":0},{"$f":"+'TBC0011'!I87+'TBC1217'!I87+'TBC1829'!I87+'TBC3059'!I87+'TBC6099'!I87","v":0},{"$f":"+'TBC0011'!J87+'TBC1217'!J87+'TBC1829'!J87+'TBC3059'!J87+'TBC6099'!J87","v":0},{"$f":"+'TBC0011'!K87+'TBC1217'!K87+'TBC1829'!K87+'TBC3059'!K87+'TBC6099'!K87","v":0},{"$f":"+'TBC0011'!L87+'TBC1217'!L87+'TBC1829'!L87+'TBC3059'!L87+'TBC6099'!L87","v":0},0,null,null,null,75,76,77,78,79,80,81,82,83,null,null,null,"075","076","077","078","079","080","081","082","083",null,null,"=+IMPORTARDATOSDINAMICOS(\" BAS075\";TABLAS!$A$281)","=+IMPORTARDATOSDINAMICOS(\" BAS076\";TABLAS!$A$281)","=+IMPORTARDATOSDINAMICOS(\" BAS077\";TABLAS!$A$281)","=+IMPORTARDATOSDINAMICOS(\" BAS078\";TABLAS!$A$281)","=+IMPORTARDATOSDINAMICOS(\" BAS079\";TABLAS!$A$281)","=+IMPORTARDATOSDINAMICOS(\" BAS080\";TABLAS!$A$281)","=+IMPORTARDATOSDINAMICOS(\" BAS081\";TABLAS!$A$281)","=+IMPORTARDATOSDINAMICOS(\" BAS082\";TABLAS!$A$281)","=+IMPORTARDATOSDINAMICOS(\" BAS083\";TABLAS!$A$281)"]
[null,"Administración de terapia preventiva para contactos de TB sensible",null,{"$f":"+'TBC0011'!D88+'TBC1217'!D88+'TBC1829'!D88+'TBC3059'!D88+'TBC6099'!D88","v":92},null,null,null,null,null,null,null,null,92,null,null,null,84,null,null,null,null,null,null,null,null,null,null,null,"084",null,null,null,null,null,null,null,null,null,null,"=+IMPORTARDATOSDINAMICOS(\" BAS084\";TABLAS!$A$281)"]
[null,"Administración de terapia preventiva para contactos de TB resistente",null,{"$f":"+'TBC0011'!D89+'TBC1217'!D89+'TBC1829'!D89+'TBC3059'!D89+'TBC6099'!D89","v":1},null,null,null,null,null,null,null,null,1,null,null,null,{"$f":"+Q88+1","v":85},null,null,null,null,null,null,null,null,null,null,null,"085",null,null,null,null,null,null,null,null,null,null,"=+IMPORTARDATOSDINAMICOS(\" BAS085\";TABLAS!$A$281)"]
[null,"Administración de terapia preventiva para población vulnerable para TB",null,null,{"$f":"+'TBC0011'!E90+'TBC1217'!E90+'TBC1829'!E90+'TBC3059'!E90+'TBC6099'!E90","v":0},{"$f":"+'TBC0011'!F90+'TBC1217'!F90+'TBC1829'!F90+'TBC3059'!F90+'TBC6099'!F90","v":0},{"$f":"+'TBC0011'!G90+'TBC1217'!G90+'TBC1829'!G90+'TBC3059'!G90+'TBC6099'!G90","v":0},{"$f":"+'TBC0011'!H90+'TBC1217'!H90+'TBC1829'!H90+'TBC3059'!H90+'TBC6099'!H90","v":0},{"$f":"+'TBC0011'!I90+'TBC1217'!I90+'TBC1829'!I90+'TBC3059'!I90+'TBC6099'!I90","v":0},{"$f":"+'TBC0011'!J90+'TBC1217'!J90+'TBC1829'!J90+'TBC3059'!J90+'TBC6099'!J90","v":0},{"$f":"+'TBC0011'!K90+'TBC1217'!K90+'TBC1829'!K90+'TBC3059'!K90+'TBC6099'!K90","v":0},{"$f":"+'TBC0011'!L90+'TBC1217'!L90+'TBC1829'!L90+'TBC3059'!L90+'TBC6099'!L90","v":0},0,null,null,null,null,{"$f":"+Q89+1","v":86},{"$f":"+R90+1","v":87},88,89,90,91,92,93,null,null,null,null,{"$f":"IF(LEN(R90)=1,CONCATENATE(\"00\",R90),IF(LEN(R90)=2,CONCATENATE(\"0\",R90),R90))","v":"086"},"087","088","089","090","091","092","093",null,null,null,{"$f":"$AI$23&AD90&$AJ$22","v":"=+IMPORTARDATOSDINAMICOS(\" BAS086\";TABLAS!$A$281)"},"=+IMPORTARDATOSDINAMICOS(\" BAS087\";TABLAS!$A$281)","=+IMPORTARDATOSDINAMICOS(\" BAS088\";TABLAS!$A$281)","=+IMPORTARDATOSDINAMICOS(\" BAS089\";TABLAS!$A$281)","=+IMPORTARDATOSDINAMICOS(\" BAS090\";TABLAS!$A$281)","=+IMPORTARDATOSDINAMICOS(\" BAS091\";TABLAS!$A$281)","=+IMPORTARDATOSDINAMICOS(\" BAS092\";TABLAS!$A$281)","=+IMPORTARDATOSDINAMICOS(\" BAS093\";TABLAS!$A$281)"]
[null,"Caso probable",{"$f":"+'TBC0011'!C91+'TBC1217'!C91+'TBC1829'!C91+'TBC3059'!C91+'TBC6099'!C91","v":0},{"$f":"+'TBC0011'!D91+'TBC1217'!D91+'TBC1829'!D91+'TBC3059'!D91+'TBC6099'!D91","v":0},{"$f":"+'TBC0011'!E91+'TBC1217'!E91+'TBC1829'!E91+'TBC3059'!E91+'TBC6099'!E91","v":0},{"$f":"+'TBC0011'!F91+'TBC1217'!F91+'TBC1829'!F91+'TBC3059'!F91+'TBC6099'!F91","v":0},{"$f":"+'TBC0011'!G91+'TBC1217'!G91+'TBC1829'!G91+'TBC3059'!G91+'TBC6099'!G91","v":0},{"$f":"+'TBC0011'!H91+'TBC1217'!H91+'TBC1829'!H91+'TBC3059'!H91+'TBC6099'!H91","v":0},{"$f":"+'TBC0011'!I91+'TBC1217'!I91+'TBC1829'!I91+'TBC3059'!I91+'TBC6099'!I91","v":0},{"$f":"+'TBC0011'!J91+'TBC1217'!J91+'TBC1829'!J91+'TBC3059'!J91+'TBC6099'!J91","v":0},{"$f":"+'TBC0011'!K91+'TBC1217'!K91+'TBC1829'!K91+'TBC3059'!K91+'TBC6099'!K91","v":0},{"$f":"+'TBC0011'!L91+'TBC1217'!L91+'TBC1829'!L91+'TBC3059'!L91+'TBC6099'!L91","v":0},0,null,null,null,94,{"$f":"+Q91+1","v":95},96,97,98,99,100,101,102,103,null,null,{"$f":"IF(LEN(Q91)=1,CONCATENATE(\"00\",Q91),IF(LEN(Q91)=2,CONCATENATE(\"0\",Q91),Q91))","v":"094"},"095","096","097","098","099",100,101,102,103,null,{"$f":"$AI$23&AC91&$AJ$22","v":"=+IMPORTARDATOSDINAMICOS(\" BAS094\";TABLAS!$A$281)"},"=+IMPORTARDATOSDINAMICOS(\" BAS095\";TABLAS!$A$281)","=+IMPORTARDATOSDINAMICOS(\" BAS096\";TABLAS!$A$281)","=+IMPORTARDATOSDINAMICOS(\" BAS097\";TABLAS!$A$281)","=+IMPORTARDATOSDINAMICOS(\" BAS098\";TABLAS!$A$281)","=+IMPORTARDATOSDINAMICOS(\" BAS099\";TABLAS!$A$281)","=+IMPORTARDATOSDINAMICOS(\" BAS100\";TABLAS!$A$281)","=+IMPORTARDATOSDINAMICOS(\" BAS101\";TABLAS!$A$281)","=+IMPORTARDATOSDINAMICOS(\" BAS102\";TABLAS!$A$281)","=+IMPORTARDATOSDINAMICOS(\" BAS103\";TABLAS!$A$281)"]
[null,"Sintomático respiratorio identificado",{"$f":"+'TBC0011'!C92+'TBC1217'!C92+'TBC1829'!C92+'TBC3059'!C92+'TBC6099'!C92","v":1082},{"$f":"+'TBC0011'!D92+'TBC1217'!D92+'TBC1829'!D92+'TBC3059'!D92+'TBC6099'!D92","v":14},{"$f":"+'TBC0011'!E92+'TBC1217'!E92+'TBC1829'!E92+'TBC3059'!E92+'TBC6099'!E92","v":2},{"$f":"+'TBC0011'!F92+'TBC1217'!F92+'TBC1829'!F92+'TBC3059'!F92+'TBC6099'!F92","v":3},{"$f":"+'TBC0011'!G92+'TBC1217'!G92+'TBC1829'!G92+'TBC3059'!G92+'TBC6099'!G92","v":0},{"$f":"+'TBC0011'!H92+'TBC1217'!H92+'TBC1829'!H92+'TBC3059'!H92+'TBC6099'!H92","v":53},{"$f":"+'TBC0011'!I92+'TBC1217'!I92+'TBC1829'!I92+'TBC3059'!I92+'TBC6099'!I92","v":0},{"$f":"+'TBC0011'!J92+'TBC1217'!J92+'TBC1829'!J92+'TBC3059'!J92+'TBC6099'!J92","v":0},{"$f":"+'TBC0011'!K92+'TBC1217'!K92+'TBC1829'!K92+'TBC3059'!K92+'TBC6099'!K92","v":0},{"$f":"+'TBC0011'!L92+'TBC1217'!L92+'TBC1829'!L92+'TBC3059'!L92+'TBC6099'!L92","v":1},1155,null,null,null,{"$f":"+Z91+1","v":104},105,106,107,108,109,110,111,112,113,null,null,104,105,106,107,108,109,110,111,112,113,null,"=+IMPORTARDATOSDINAMICOS(\" BAS104\";TABLAS!$A$281)","=+IMPORTARDATOSDINAMICOS(\" BAS105\";TABLAS!$A$281)","=+IMPORTARDATOSDINAMICOS(\" BAS106\";TABLAS!$A$281)","=+IMPORTARDATOSDINAMICOS(\" BAS107\";TABLAS!$A$281)","=+IMPORTARDATOSDINAMICOS(\" BAS108\";TABLAS!$A$281)","=+IMPORTARDATOSDINAMICOS(\" BAS109\";TABLAS!$A$281)","=+IMPORTARDATOSDINAMICOS(\" BAS110\";TABLAS!$A$281)","=+IMPORTARDATOSDINAMICOS(\" BAS111\";TABLAS!$A$281)","=+IMPORTARDATOSDINAMICOS(\" BAS112\";TABLAS!$A$281)","=+IMPORTARDATOSDINAMICOS(\" BAS113\";TABLAS!$A$281)"]
[null,"Sintomático respiratorio examinado",{"$f":"+'TBC0011'!C93+'TBC1217'!C93+'TBC1829'!C93+'TBC3059'!C93+'TBC6099'!C93","v":973},{"$f":"+'TBC0011'!D93+'TBC1217'!D93+'TBC1829'!D93+'TBC3059'!D93+'TBC6099'!D93","v":13},{"$f":"+'TBC0011'!E93+'TBC1217'!E93+'TBC1829'!E93+'TBC3059'!E93+'TBC6099'!E93","v":1},{"$f":"+'TBC0011'!F93+'TBC1217'!F93+'TBC1829'!F93+'TBC3059'!F93+'TBC6099'!F93","v":3},{"$f":"+'TBC0011'!G93+'TBC1217'!G93+'TBC1829'!G93+'TBC3059'!G93+'TBC6099'!G93","v":0},{"$f":"+'TBC0011'!H93+'TBC1217'!H93+'TBC1829'!H93+'TBC3059'!H93+'TBC6099'!H93","v":108},{"$f":"+'TBC0011'!I93+'TBC1217'!I93+'TBC1829'!I93+'TBC3059'!I93+'TBC6099'!I93","v":0},{"$f":"+'TBC0011'!J93+'TBC1217'!J93+'TBC1829'!J93+'TBC3059'!J93+'TBC6099'!J93","v":0},{"$f":"+'TBC0011'!K93+'TBC1217'!K93+'TBC1829'!K93+'TBC3059'!K93+'TBC6099'!K93","v":0},{"$f":"+'TBC0011'!L93+'TBC1217'!L93+'TBC1829'!L93+'TBC3059'!L93+'TBC6099'!L93","v":1},1099,null,null,null,{"$f":"+Z92+1","v":114},115,116,117,118,119,120,121,122,123,null,null,114,115,116,117,118,119,120,121,122,123,null,"=+IMPORTARDATOSDINAMICOS(\" BAS114\";TABLAS!$A$281)","=+IMPORTARDATOSDINAMICOS(\" BAS115\";TABLAS!$A$281)","=+IMPORTARDATOSDINAMICOS(\" BAS116\";TABLAS!$A$281)","=+IMPORTARDATOSDINAMICOS(\" BAS117\";TABLAS!$A$281)","=+IMPORTARDATOSDINAMICOS(\" BAS118\";TABLAS!$A$281)","=+IMPORTARDATOSDINAMICOS(\" BAS119\";TABLAS!$A$281)","=+IMPORTARDATOSDINAMICOS(\" BAS120\";TABLAS!$A$281)","=+IMPORTARDATOSDINAMICOS(\" BAS121\";TABLAS!$A$281)","=+IMPORTARDATOSDINAMICOS(\" BAS122\";TABLAS!$A$281)","=+IMPORTARDATOSDINAMICOS(\" BAS123\";TABLAS!$A$281)"]
[null,"SR examinados con bacteriología confirmada",{"$f":"+'TBC0011'!C94+'TBC1217'!C94+'TBC1829'!C94+'TBC3059'!C94+'TBC6099'!C94","v":4},{"$f":"+'TBC0011'!D94+'TBC1217'!D94+'TBC1829'!D94+'TBC3059'!D94+'TBC6099'!D94","v":0},{"$f":"+'TBC0011'!E94+'TBC1217'!E94+'TBC1829'!E94+'TBC3059'!E94+'TBC6099'!E94","v":0},{"$f":"+'TBC0011'!F94+'TBC1217'!F94+'TBC1829'!F94+'TBC3059'!F94+'TBC6099'!F94","v":0},{"$f":"+'TBC0011'!G94+'TBC1217'!G94+'TBC1829'!G94+'TBC3059'!G94+'TBC6099'!G94","v":0},{"$f":"+'TBC0011'!H94+'TBC1217'!H94+'TBC1829'!H94+'TBC3059'!H94+'TBC6099'!H94","v":0},{"$f":"+'TBC0011'!I94+'TBC1217'!I94+'TBC1829'!I94+'TBC3059'!I94+'TBC6099'!I94","v":0},{"$f":"+'TBC0011'!J94+'TBC1217'!J94+'TBC1829'!J94+'TBC3059'!J94+'TBC6099'!J94","v":0},{"$f":"+'TBC0011'!K94+'TBC1217'!K94+'TBC1829'!K94+'TBC3059'!K94+'TBC6099'!K94","v":0},{"$f":"+'TBC0011'!L94+'TBC1217'!L94+'TBC1829'!L94+'TBC3059'!L94+'TBC6099'!L94","v":0},4,null,null,null,124,125,126,127,128,129,130,131,132,133,null,null,124,125,126,127,128,129,130,131,132,133,null,"=+IMPORTARDATOSDINAMICOS(\" BAS124\";TABLAS!$A$281)","=+IMPORTARDATOSDINAMICOS(\" BAS125\";TABLAS!$A$281)","=+IMPORTARDATOSDINAMICOS(\" BAS126\";TABLAS!$A$281)","=+IMPORTARDATOSDINAMICOS(\" BAS127\";TABLAS!$A$281)","=+IMPORTARDATOSDINAMICOS(\" BAS128\";TABLAS!$A$281)","=+IMPORTARDATOSDINAMICOS(\" BAS129\";TABLAS!$A$281)","=+IMPORTARDATOSDINAMICOS(\" BAS130\";TABLAS!$A$281)","=+IMPORTARDATOSDINAMICOS(\" BAS131\";TABLAS!$A$281)","=+IMPORTARDATOSDINAMICOS(\" BAS132\";TABLAS!$A$281)","=+IMPORTARDATOSDINAMICOS(\" BAS133\";TABLAS!$A$281)"]