{"text_format":"1","workbook":"xlsx","n_sheets":16,"sheets":["MENU","TABLAS","INFORME","CIE_CPT","PAI_MENOR_1A","PAI_1A","PAI_2A","PAI_3A","PAI_4A","PAI_511A","PAI_1049","HVB_VARIOS","INFLU_NEU_AMA","GESTANTE","COVID","Datos"],"not_rendered":{"charts":0,"images":33,"macros":1,"external_links":3,"defined_names":24,"comments":0,"pivot_tables":15},"unopened":[],"bounds":{"document_bytes":16777216,"sheet_cells":100000,"rows_first":2000,"rows_last":500,"rows_between":2000,"halvings":0,"cell_chars":16384,"cell_head_chars":4096},"cells_cut":0,"cells_raw":0,"read":"whole","date_system":"1900"}

{"sheet":"MENU","index":0,"n_rows":30,"n_cols":12,"rows_kept":30,"cut":false,"hidden":false,"merged":[[28,7,29,10],[26,7,27,10]]}
[]
[]
[]
[null,null,null,null,null,null,null,null,null,null,null,{"$f":"+TABLAS!A81","v":"1-2-3-Total--------"}]
[null,null,null,null,null,null,null,null,null,null,null,{"$f":"+TABLAS!A118","v":"1-2-3-Total--------"}]
[null,null,null,null,null,null,null,null,null,null,null,{"$f":"+TABLAS!A135","v":" t_0"}]
[null,null,null,null,null,null,null,null,null,null,null,{"$f":"+GETPIVOTDATA(\" rn\",TABLAS!$A$155)","v":1673}]
[]
[]
[]
[]
[]
[]
[]
[]
[]
[]
[]
[]
[]
[]
[]
[]
[]
[]
[]
[null,null,null,null,null,null,null,"CONTROL DE MESES"]
[]
[null,null,null,null,null,null,null,{"$f":"+TABLAS!A81","v":"1-2-3-Total--------"}]
[null,null,{"$f":"+INFORME!I14","v":"__ENE_MAR_2025"}]

{"sheet":"TABLAS","index":1,"n_rows":157,"n_cols":232,"rows_kept":157,"cut":false,"hidden":true,"merged":[[12,3,12,6],[13,3,13,6],[80,0,80,1],[117,0,117,1],[7,2,7,6],[8,3,8,6],[9,3,9,6],[10,3,10,6],[11,3,11,6],[14,3,14,6]]}
[]
[]
[]
[]
[]
[]
[]
[null,null,"Valores",null,null,null,null,null,"Tabla",{"$f":"IF(I9=\"(Todas)\",\"CUSCO \",\"\")","v":""}]
[null,null,"RED","03 - LA CONVENCION",null,null,null,null,{"$f":"IF(MID(D9,1,2)=\"99\",\"(All)\",MID(D9,1,2))","v":"03"},{"$f":"IF(I9=\"(All)\",\" \",I9)","v":"03"},null,null,{"$f":"LEN(MID(D9,5,90))","v":14},null,{"$f":"IF(MID(D9,6,5)=\"(All)\",\"\",D9)","v":"03 - LA CONVENCION"}]
[null,null,"Micro RED","0399 - (All)",null,null,null,null,{"$f":"IF(MID(D10,3,2)=\"99\",\"(All)\",MID(D10,1,4))","v":"(All)"}," ",null,null,{"$f":"LEN(MID(D10,7,90))","v":6},null,{"$f":"IF(MID(D10,8,5)=\"(All)\",\"\",D10)","v":""}]
[null,null,"Establecimiento","999999999 - (All)",null,null,null,null,{"$f":"IF(OR(MID(D11,1,9)=\"999999999\",MID(D11,1,9)=\"000000000\"),\"(All)\",MID(D11,1,9))","v":"(All)"}," ",null,null,{"$f":"LEN(MID(D11,12,90))","v":6},null,{"$f":"IF(MID(D11,13,5)=\"(All)\",\"\",D11)","v":""}]
[null,null,"Provincia","00 - (All)",null,null,null,null,{"$f":"IF(MID(D12,1,2)=\"00\",\"(All)\",MID(D12,1,2))","v":"(All)"}," ",null,null,{"$f":"LEN(MID(D12,6,90))","v":5},null,{"$f":"IF(MID(D12,6,5)=\"(All)\",\"\",D12)","v":""}]
[null,null,"Distrito","0000 - (All)",null,null,null,null,{"$f":"IF(OR(MID(D13,1,4)=\"0000\",MID(D13,3,2)=\"00\"),\"(All)\",MID(D13,1,4))","v":"(All)"}," ",null,null,{"$f":"LEN(MID(D13,8,90))","v":5},null,{"$f":"IF(MID(D13,8,5)=\"(All)\",\"\",D13)","v":""}]
[null,null,"Ejecutira","99 - (ALL)",null,null,null,null,{"$f":"IF(MID(D14,1,2)=\"99\",\"(All)\",MID(D14,1,2))","v":"(All)"}," ",null,null,{"$f":"LEN(MID(D14,5,90))","v":6},null,{"$f":"IF(MID(D14,6,5)=\"(All)\",\"\",D14)","v":""}]
[null,null,"Sector","99 - (ALL)",null,null,null,null,{"$f":"IF(MID(D15,1,2)=\"99\",\"(All)\",MID(D15,1,1))","v":"(All)"},{"$f":"IF(I15=\"(All)\",\" \",I15)","v":" "},null,null,{"$f":"LEN(MID(D15,5,90))","v":6},null,{"$f":"IF(MID(D15,6,5)=\"(All)\",\"\",D15)","v":""}]
[]
[null,null,"Año","2025",null,null,null,null,{"$f":"+D17","v":"2025"},{"$f":"IF(I17=\"(Todas)\",\" \",I17)","v":"2025"}]
[]
[]
[null,1,1,1,0,0,0,0,0,0,0,0,0,{"$f":"SUM(B20:M20)","v":3}]
[null,{"$f":"IF(B20=1,\"ENERO\",\"\")","v":"ENERO"},{"$f":"IF(C20=1,\"FEBRERO\",\"\")","v":"FEBRERO"},{"$f":"IF(D20=1,\"MARZO\",\"\")","v":"MARZO"},{"$f":"IF(E20=1,\"ABRIL\",\"\")","v":""},{"$f":"IF(F20=1,\"MAYO\",\"\")","v":""},{"$f":"IF(G20=1,\"JUNIO\",\"\")","v":""},{"$f":"IF(H20=1,\"JULIO\",\"\")","v":""},{"$f":"IF(I20=1,\"AGOSTO\",\"\")","v":""},{"$f":"IF(J20=1,\"SETIEMBRE\",\"\")","v":""},{"$f":"IF(K20=1,\"OCTUBRE\",\"\")","v":""},{"$f":"IF(L20=1,\"NOVIEMBRE\",\"\")","v":""},{"$f":"IF(M20=1,\"DICIEMBRE\",\"\")","v":""},{"$f":"IF(B20=1,B21,IF(C20=1,C21,IF(D20=1,D21,IF(E20=1,E21,IF(F20=1,F21,IF(G20=1,G21,IF(H20=1,H21,IF(I20=1,I21,IF(J20=1,J21,IF(K20=1,K21,IF(L20=1,L21,IF(M20=1,M21,\"\"))))))))))))","v":"ENERO"}]
[null,null,null,null,null,null,null,null,null,null,null,null,null,{"$f":"IF(N20=1,N21,\"\")","v":""}]
[null,2,4,6,null,null,null,null,null,null,null,null,null,{"$f":"MIN(B23:M23)","v":2},{"$f":"MAX(B23:M23)","v":6},{"$f":"MAX(C23:N23)","v":6}]
[null,{"$f":"IF(B23=2,\"ENE\",\"\")","v":"ENE"},{"$f":"IF(C23=4,\"FEB\",\"\")","v":"FEB"},{"$f":"IF(D23=6,\"MAR\",\"\")","v":"MAR"},{"$f":"IF(E23=8,\"ABR\",\"\")","v":""},{"$f":"IF(F23=10,\"MAY\",\"\")","v":""},{"$f":"IF(G23=12,\"JUN\",\"\")","v":""},{"$f":"IF(H23=14,\"JUL\",\"\")","v":""},{"$f":"IF(I23=16,\"AGO\",\"\")","v":""},{"$f":"IF(J23=18,\"SET\",\"\")","v":""},{"$f":"IF(K23=20,\"OCT\",\"\")","v":""},{"$f":"IF(L23=22,\"NOV\",\"\")","v":""},{"$f":"IF(M23=24,\"DIC\",\"\")","v":""},{"$f":"IF(N23=B23,B24,IF(N23=C23,C24,IF(N23=D23,D24,IF(N23=E23,E24,IF(N23=F23,F24,IF(N23=G23,G24,IF(N23=H23,#REF!,IF(N23=I23,I24,IF(N23=J23,J24,IF(N23=K23,K24,IF(N23=L23,L24,IF(N23=M23,M24,\"\"))))))))))))","v":"ENE"},{"$f":"IF(O23=C23,C24,IF(O23=D23,D24,IF(O23=E23,E24,IF(O23=F23,F24,IF(O23=G23,G24,IF(O23=H23,H24,IF(O23=I23,I24,IF(O23=J23,J24,IF(O23=K23,K24,IF(O23=L23,L24,IF(O23=M23,M24,\"\")))))))))))","v":"MAR"},{"$f":"IF(P23=D23,D24,IF(P23=E23,E24,IF(P23=F23,F24,IF(P23=G23,G24,IF(P23=H23,H24,IF(P23=I23,I24,IF(P23=J23,J24,IF(P23=K23,K24,IF(P23=L23,L24,IF(P23=M23,M24,IF(P23=N23,N24,\"\")))))))))))","v":"MAR"}]
[null,null,null,null,null,null,null,null,null,null,null,null,null,{"$f":"CONCATENATE(N24,\" - \",O24)","v":"ENE - MAR"}]
[null,null,null,null,null,null,null,null,null,null,null,null,null,{"$f":"IF(N23=O23,N22,N25)","v":"ENE - MAR"}]
[]
[]
[]
[]
[]
[]
[]
[]
[]
[]
[]
[]
[]
[]
[]
[]
[]
[]
[]
[]
[]
[]
["ADULTO_01"]
["ANNO",2025]
["cod_red","03"]
["codmic","(Todas)"]
["cod_prov","(Todas)"]
["coddist","(Todas)"]
["cod_estab","(Todas)"]
["cod_eje","(Todas)"]
["sector","(Todas)"]
[]
[null,"Valores"]
["Etiquetas de fila"," BAS001"," BAS002"," BAS003"," BAS004"," BAS005"," BAS006"," BAS007"," BAS008"," BAS009"," BAS010"," BAS011"," BAS012"," BAS013"," BAS014"," BAS015"," BAS016"," BAS017"," BAS018"," BAS019"," BAS020"," BAS021"," BAS022"," BAS023"," BAS024"," BAS025"," BAS026"," BAS027"," BAS028"," BAS029"," BAS030"," BAS031"," BAS032"," BAS033"," BAS034"," BAS035"," BAS036"," BAS037"," BAS038"," BAS039"," BAS040"," BAS041"," BAS042"," BAS043"," BAS044"," BAS045"," BAS046"," BAS047"," BAS048"," BAS049"," BAS050"," BAS051"," BAS052"," BAS053"," BAS054"," BAS055"," BAS056"," BAS057"," BAS058"," BAS059"," BAS060"," BAS061"," BAS062"," BAS063"," BAS064"," BAS065"," BAS066"," BAS067"," BAS068"," BAS069"," BAS070"," BAS071"," BAS072"," BAS073"," BAS074"," BAS075"," BAS076"," BAS077"," BAS078"," BAS079"," BAS080"," BAS081"," BAS082"," BAS083"," BAS084"," BAS085"," BAS086"," BAS087"," BAS088"," BAS089"," BAS090"," BAS091"," BAS092"," BAS093"," BAS094"," BAS095"," BAS096"," BAS097"," BAS098"," BAS099"," BAS100"," BAS101"," BAS102"," BAS103"," BAS104"," BAS105"," BAS106"," BAS107"," BAS108"," BAS109"," BAS110"," BAS111"," BAS112"," BAS113"," BAS114"," BAS115"," BAS116"," BAS117"," BAS118"," BAS119"," BAS120"," BAS121"," BAS122"," BAS123"," BAS124"," BAS125"," BAS126"," BAS127"," BAS128"," BAS129"," BAS130"," BAS131"," BAS132"," BAS133"," BAS134"," BAS135"," BAS136"," BAS137"," BAS138"," BAS139"," BAS140"," BAS141"," BAS142"," BAS143"," BAS144"," BAS145"," BAS146"," BAS147"," BAS148"," BAS149"," BAS150"," BAS151"," BAS152"," BAS153"," BAS154"," BAS155"," BAS156"," BAS157"," BAS158"," BAS159"," BAS160"," BAS161"," BAS162"," BAS163"," BAS164"," BAS165"," BAS166"," BAS167"," BAS168"," BAS169"," BAS170"," BAS171"," BAS172"," BAS173"," BAS174"," BAS175"," BAS176"," BAS177"," BAS178"," BAS179"," BAS180"," BAS181"," BAS182"," BAS183"," BAS184"," BAS185"," BAS186"," BAS187"," BAS188"," BAS189"," BAS190"," BAS191"," BAS192"," BAS193"," BAS194"," BAS195"," BAS196"," BAS197"," BAS198"," BAS199"," BAS200"," BAS201"," BAS202"," BAS203"," BAS204"," BAS205"," BAS206"," BAS207"," BAS208"," BAS209"," BAS210"," BAS211"," BAS212"," BAS213"," BAS214"," BAS215"," BAS216"," BAS217"," BAS218"," BAS219"," BAS220"," BAS221"," BAS222"," BAS223"," BAS224"," BAS225"," BAS226"," BAS227"," BAS228"," BAS229"," BAS230"]
[1,113,5,0,113,113,121,140,0,0,0,120,139,107,0,0,0,0,4,0,121,140,121,139,9,13,1,4,107,0,0,0,0,0,0,0,0,1,138,137,157,149,152,144,0,4,2,0,0,1,1,0,0,0,0,0,0,138,6,0,2,152,0,0,0,0,0,0,2,0,5,1,0,0,0,1,2,0,0,2,9,1,0,6,2,0,1,0,0,0,0,0,3,2,4,0,0,0,0,0,4,0,0,0,0,0,0,0,2,1,1,2,0,0,0,0,0,0,0,0,3,0,1,0,0,0,0,0,0,0,0,0,0,0,0,2,0,148,128,0,24,148,6,0,0,0,0,0,0,1,0,1,5,8,0,0,1,0,0,7,2,1,25,20,11,23,12,7,0,0,0,0,0,0,3,5,1,2,3,1,3,2,0,10,0,1,81,34,13,78,46,33,7,1,2,1,0,0,3,4,2,0,0,0,0,0,0,0,0,0,0,0,0,0,0,0,0,0,0,0,0,0,0,0,0,0,0,0,0,0,0]
[2,107,3,3,108,108,130,131,0,0,0,132,129,101,0,1,0,0,0,0,128,130,132,130,1,0,0,1,100,0,0,0,0,0,0,0,1,3,110,114,134,135,127,122,0,2,1,0,0,1,2,0,0,0,0,0,0,110,0,0,5,129,0,0,0,0,0,0,2,0,3,1,1,0,0,0,0,0,0,1,2,2,0,3,3,0,0,0,0,0,0,0,2,2,0,1,0,0,0,0,1,0,0,0,0,0,0,2,4,2,1,4,2,0,0,0,0,0,0,0,1,0,2,0,0,0,0,0,0,0,0,0,0,0,0,1,2,128,111,1,16,128,4,0,0,0,0,0,0,0,0,0,288,404,0,0,1,0,0,15,8,5,23,20,10,33,26,16,0,0,0,1,0,0,4,1,4,3,0,0,4,4,0,14,1,2,112,124,51,67,39,31,8,0,2,0,0,0,8,5,4,0,0,0,0,0,0,0,0,0,0,0,0,0,0,0,0,0,0,0,0,0,0,0,0,0,0,0,0,0,0]
[3,108,9,3,109,109,136,119,0,0,0,135,119,137,0,1,0,0,0,0,134,116,134,119,2,1,0,4,141,0,0,0,0,0,0,0,1,2,128,128,139,131,128,123,0,2,6,0,0,1,3,0,0,1,0,0,0,107,1,0,2,131,0,0,0,0,0,0,1,0,3,1,2,0,1,0,2,0,0,3,9,3,2,8,8,0,0,0,0,0,0,0,1,0,2,0,0,0,0,0,0,0,0,0,0,0,0,0,2,2,2,4,2,0,0,0,0,0,0,0,1,1,2,2,0,0,0,0,0,0,0,0,0,0,0,1,2,133,117,1,1,133,6,1,0,0,0,0,0,0,0,0,113,57,0,0,0,0,1,10,2,0,28,15,9,46,24,13,0,0,0,2,0,0,3,0,0,1,1,0,0,0,0,11,3,1,107,36,13,53,47,26,13,10,2,0,1,0,5,3,0,1,0,0,0,0,0,0,0,0,0,0,0,0,0,0,0,0,0,0,0,0,0,0,0,0,0,0,0,0,0]
["Total",328,17,6,330,330,387,390,0,0,0,387,387,345,0,2,0,0,4,0,383,386,387,388,12,14,1,9,348,0,0,0,0,0,0,0,2,6,376,379,430,415,407,389,0,8,9,0,0,3,6,0,0,1,0,0,0,355,7,0,9,412,0,0,0,0,0,0,5,0,11,3,3,0,1,1,4,0,0,6,20,6,2,17,13,0,1,0,0,0,0,0,6,4,6,1,0,0,0,0,5,0,0,0,0,0,0,2,8,5,4,10,4,0,0,0,0,0,0,0,5,1,5,2,0,0,0,0,0,0,0,0,0,0,0,4,4,409,356,2,41,409,16,1,0,0,0,0,0,1,0,1,406,469,0,0,2,0,1,32,12,6,76,55,30,102,62,36,0,0,0,3,0,0,10,6,5,6,4,1,7,6,0,35,4,4,300,194,77,198,132,90,28,11,6,1,1,0,16,12,6,1,0,0,0,0,0,0,0,0,0,0,0,0,0,0,0,0,0,0,0,0,0,0,0,0,0,0,0,0,0]
[]
[]
[]
[]
[]
[]
[]
[]
[]
[]
[]
[]
[]
[]
["TOTAL"]
[{"$f":"COUNT(A61:A77)","v":3},{"$f":"SUM(B61:B77)","v":656},{"$f":"SUM(C61:C77)","v":34},12,660,660,774,780,0,0,0,774,774,690,0,4,0,0,8,0,766,772,774,776,24,28,2,18,696,0,0,0,0,0,0,0,4,12,752,758,860,830,814,778,0,16,18,0,0,6,12,0,0,2,0,0,0,710,14,0,18,824,0,0,0,0,{"$f":"SUM(BO61:BO77)","v":0},0,10,0,22,6,6,0,2,2,8,0,0,12,40,12,4,34,26,0,2,0,0,0,0,0,12,8,12,2,0,0,0,0,10,0,0,0,0,0,0,4,16,10,8,20,8,0,0,0,0,0,0,0,10,2,10,4,0,0,0,0,0,0,{"$f":"SUM(EA61:EA77)","v":0},0,0,0,0,8,8,818,712,4,82,818,32,2,0,0,0,0,0,2,0,2,812,938,0,0,4,0,2,64,24,12,152,110,60,204,124,72,0,0,0,6,0,0,20,12,10,12,8,2,14,12,0,70,8,8,600,388,154,396,264,180,56,22,{"$f":"SUM(GM61:GM77)","v":12},2,2,0,32,24,12,2,0,0,0,0,0,0,0,0,0,0,0,0,0,0,0,0,0,0,0,0,0,0,0,0,0,0,0,0,0,0]
[{"$f":"CONCATENATE(A61,\"-\",A62,\"-\",A63,\"-\",A64,\"-\",A65,\"-\",A66,\"-\",A67,\"-\",A68,\"-\",A69,\"-\",A70,\"-\",A71,\"-\",A72)","v":"1-2-3-Total--------"}]
[null," BAS001"," BAS002"," BAS003"," BAS004"," BAS005"," BAS006"," BAS007"," BAS008"," BAS009"," BAS010"," BAS011"," BAS012"," BAS013"," BAS014"," BAS015"," BAS016"," BAS017"," BAS018"," BAS019"," BAS020"," BAS021"," BAS022"," BAS023"," BAS024"," BAS025"," BAS026"," BAS027"," BAS028"," BAS029"," BAS030"," BAS031"," BAS032"," BAS033"," BAS034"," BAS035"," BAS036"," BAS037"," BAS038"," BAS039"," BAS040"," BAS041"," BAS042"," BAS043"," BAS044"," BAS045"," BAS046"," BAS047"," BAS048"," BAS049"," BAS050"," BAS051"," BAS052"," BAS053"," BAS054"," BAS055"," BAS056"," BAS057"," BAS058"," BAS059"," BAS060"," BAS061"," BAS062"," BAS063"," BAS064"," BAS065"," BAS066"," BAS067"," BAS068"," BAS069"," BAS070"," BAS071"," BAS072"," BAS073"," BAS074"," BAS075"," BAS076"," BAS077"," BAS078"," BAS079"," BAS080"," BAS081"," BAS082"," BAS083"," BAS084"," BAS085"," BAS086"," BAS087"," BAS088"," BAS089"," BAS090"," BAS091"," BAS092"," BAS093"," BAS094"," BAS095"," BAS096"," BAS097"," BAS098"," BAS099"," BAS100"," BAS101"," BAS102"," BAS103"," BAS104"," BAS105"," BAS106"," BAS107"," BAS108"," BAS109"," BAS110"," BAS111"," BAS112"," BAS113"," BAS114"," BAS115"," BAS116"," BAS117"," BAS118"," BAS119"," BAS120"," BAS121"," BAS122"," BAS123"," BAS124"," BAS125"," BAS126"," BAS127"," BAS128"," BAS129"," BAS130"," BAS131"," BAS132"," BAS133"," BAS134"," BAS135"," BAS136"," BAS137"," BAS138"," BAS139"," BAS140"," BAS141"," BAS142"," BAS143"," BAS144"," BAS145"," BAS146"," BAS147"," BAS148"," BAS149"," BAS150"," BAS151"," BAS152"," BAS153"," BAS154"," BAS155"," BAS156"," BAS157"," BAS158"," BAS159"," BAS160"," BAS161"," BAS162"," BAS163"," BAS164"," BAS165"," BAS166"," BAS167"," BAS168"," BAS169"," BAS170"," BAS171"," BAS172"," BAS173"," BAS174"," BAS175"," BAS176"," BAS177"," BAS178"," BAS179"," BAS180"," BAS181"," BAS182"," BAS183"," BAS184"," BAS185"," BAS186"," BAS187"," BAS188"," BAS189"," BAS190"," BAS191"," BAS192"," BAS193"," BAS194"," BAS195"," BAS196"," BAS197"," BAS198"," BAS199"," BAS200"," BAS201"," BAS202"," BAS203"," BAS204"," BAS205"," BAS206"," BAS207"," BAS208"," BAS209"," BAS210"," BAS211"," BAS212"," BAS213"," BAS214"," BAS215"," BAS216"," BAS217"," BAS218"," BAS219"," BAS220"," BAS221"," BAS222"," BAS223"," BAS224"," BAS225"," BAS226"," BAS227"," BAS228"," BAS229"," BAS230"]
[null,{"$f":"IF(B82=B60,\"SI\",\"NO\")","v":"SI"},{"$f":"IF(C82=C60,\"SI\",\"NO\")","v":"SI"},"SI","SI","SI","SI","SI","SI","SI","SI","SI","SI","SI","SI","SI","SI","SI","SI","SI","SI","SI","SI","SI","SI","SI","SI","SI","SI","SI","SI","SI","SI","SI","SI","SI","SI","SI","SI","SI","SI","SI","SI","SI","SI","SI","SI","SI","SI","SI","SI","SI","SI","SI","SI","SI","SI","SI","SI","SI","SI","SI","SI","SI","SI","SI",{"$f":"IF(BO82=BO60,\"SI\",\"NO\")","v":"SI"},"SI","SI","SI","SI","SI","SI","SI","SI","SI","SI","SI","SI","SI","SI","SI","SI","SI","SI","SI","SI","SI","SI","SI","SI","SI","SI","SI","SI","SI","SI","SI","SI","SI","SI","SI","SI","SI","SI","SI","SI","SI","SI","SI","SI","SI","SI","SI","SI","SI","SI","SI","SI","SI","SI","SI","SI","SI","SI","SI","SI","SI","SI","SI",{"$f":"IF(EA82=EA60,\"SI\",\"NO\")","v":"SI"},"SI","SI","SI","SI","SI","SI","SI","SI","SI","SI","SI","SI","SI","SI","SI","SI","SI","SI","SI","SI","SI","SI","SI","SI","SI","SI","SI","SI","SI","SI","SI","SI","SI","SI","SI","SI","SI","SI","SI","SI","SI","SI","SI","SI","SI","SI","SI","SI","SI","SI","SI","SI","SI","SI","SI","SI","SI","SI","SI","SI","SI","SI","SI",{"$f":"IF(GM82=GM60,\"SI\",\"NO\")","v":"SI"},"SI","SI","SI","SI","SI","SI","SI","SI","SI","SI","SI","SI","SI","SI","SI","SI","SI","SI","SI","SI","SI","SI","SI","SI","SI","SI","SI","SI","SI","SI","SI","SI","SI","SI","SI","SI"]
[]
[]
[]
["ADULTO_02"]
["ANNO",2025]
["cod_red","03"]
["codmic","(Todas)"]
["cod_prov","(Todas)"]
["coddist","(Todas)"]
["cod_estab","(Todas)"]
["cod_eje","(Todas)"]
["sector","(Todas)"]
[]
[null,"Valores"]
["Etiquetas de fila"," BAS001"," BAS002"," BAS003"," BAS004"," BAS005"," BAS006"," BAS007"," BAS008"," BAS009"," BAS010"," BAS011"," BAS012"," BAS013"," BAS014"," BAS015"," BAS016"," BAS017"," BAS018"," BAS019"," BAS020"," BAS021"," BAS022"," BAS023"," BAS024"," BAS025"," BAS026"," BAS027"," BAS028"," BAS029"," BAS030"," BAS031"," BAS032"," BAS033"," BAS034"," BAS035"," BAS036"," BAS037"," BAS038"," BAS039"," BAS040"," BAS041"," BAS042"," BAS043"," BAS044"," BAS045"," BAS046"," BAS047"," BAS048"," BAS049"," BAS050"," BAS051"," BAS052"," BAS053"," BAS054"," BAS055"," BAS056"," BAS057"," BAS058"," BAS059"," BAS060"," BAS061"," BAS062"," BAS063"," BAS064"," BAS065"," BAS066"," BAS067"," BAS068"," BAS069"," BAS070"," BAS071"," BAS072"," BAS073"," BAS074"," BAS075"," BAS076"," BAS077"," BAS078"," BAS079"," BAS080"," BAS081"," BAS082"," BAS083"," BAS084"," BAS085"," BAS086"," BAS087"," BAS088"," BAS089"," BAS090"," BAS091"," BAS092"," BAS093"," BAS094"," BAS095"," BAS096"," BAS097"," BAS098"," BAS099"," BAS100"," BAS101"," BAS102"," BAS103"," BAS104"," BAS105"," BAS106"," BAS107"," BAS108"," BAS109"," BAS110"," BAS111"," BAS112"," BAS113"," BAS114"," BAS115"," BAS116"," BAS117"," BAS118"," BAS119"," BAS120"," BAS121"," BAS122"," BAS123"," BAS124"," BAS125"," BAS126"," BAS127"," BAS128"," BAS129"," BAS130"," BAS131"," BAS132"," BAS133"," BAS134"," BAS135"," BAS136"," BAS137"," BAS138"," BAS139"," BAS140"," BAS141"," BAS142"," BAS143"," BAS144"," BAS145"," BAS146"," BAS147"," BAS148"," BAS149"," BAS150"," BAS151"," BAS152"," BAS153"," BAS154"," BAS155"," BAS156"," BAS157"," BAS158"," BAS159"," BAS160"," BAS161"," BAS162"," BAS163"," BAS164"," BAS165"," BAS166"," BAS167"," BAS168"," BAS169"," BAS170"," BAS171"," BAS172"," BAS173"," BAS174"," BAS175"," BAS176"," BAS177"," BAS178"," BAS179"," BAS180"," BAS181"," BAS182"," BAS183"," BAS184"," BAS185"," BAS186"," BAS187"," BAS188"," BAS189"," BAS190"," BAS191"," BAS192"," BAS193"," BAS194"," BAS195"," BAS196"," BAS197"," BAS198"," BAS199"," BAS200"," BAS201"," BAS202"," BAS203"," BAS204"," BAS205"," BAS206"," BAS207"," BAS208"," BAS209"," BAS210"," BAS211"," BAS212"," BAS213"," BAS214"," BAS215"," BAS216"," BAS217"," BAS218"," BAS219"," BAS220"," BAS221"," BAS222"," BAS223"," BAS224"," BAS225"," BAS226"," BAS227"," BAS228"," BAS229"," BAS230"]
[1,2,2,2,0,0,0,0,0,0,0,0,0,0,0,0,0,8,3,0,8,0,1,0,0,0,0,0,6,1,0,141,59,38,88,55,48,0,0,1,0,0,0,0,0,0,0,0,0,0,0,0,5,14,32,0,0,0,0,0,10,3,2,137,87,6,0,0,0,0,0,0,74,54,31,0,8,56,48,0,0,0,0,0,0,0,0,0,0,0,0,0,0,0,0,0,0,0,0,0,0,0,0,0,0,0,0,0,0,0,0,0,0,0,0,0,0,0,0,0,0,0,0,0,0,0,0,0,0,0,0,0,0,0,5,8,0,0,0,0,1,0,0,0,0,0,0,0,0,0,0,0,0,0,0,0,0,0,0,0,0,0,0,0,0,0,0,0,0,0,0,0,0,0,0,0,0,0,0,0,0,0,0,0,0,0,0,0,0,0,0,0,0,0,0,0,0,0,0,0,0,0,0,0,0,0,0,0,0,0,0,0,0,0,0,0,0,0,0,0,0,0,0,0,0,0,0,0,0,0,0]
[2,1,3,2,0,0,0,0,0,0,0,0,0,0,0,0,0,0,0,0,0,0,0,0,0,0,0,0,31,9,4,166,131,95,119,76,55,0,0,0,0,0,0,0,0,0,0,0,0,0,0,0,1,6,55,0,0,0,0,0,5,3,11,134,104,4,0,0,0,0,0,0,125,71,42,0,6,61,34,0,0,0,0,0,0,0,0,0,0,0,0,0,0,0,0,0,0,0,0,0,0,0,0,0,0,0,0,0,0,0,0,0,0,0,0,0,0,0,0,0,0,0,0,0,0,0,0,0,0,0,0,0,0,0,288,404,0,0,0,0,0,0,0,0,0,0,0,0,0,0,0,0,0,0,0,0,0,0,0,0,0,0,0,0,0,0,0,0,0,0,0,0,0,0,0,0,0,0,0,0,0,0,0,0,0,0,0,0,0,0,0,0,0,0,0,0,0,0,0,0,0,0,0,0,0,0,0,0,0,0,0,0,0,0,0,0,0,0,0,0,0,0,0,0,0,0,0,0,0,0,0]
[3,1,0,1,0,0,0,0,0,0,0,0,0,0,0,0,0,0,0,0,0,0,0,0,0,0,0,0,22,6,2,136,123,34,101,74,34,0,0,0,0,0,0,0,0,0,0,0,0,0,0,0,5,8,25,0,0,0,0,0,7,5,39,149,130,16,0,0,0,0,0,0,97,73,30,0,12,59,42,0,0,0,0,0,0,0,0,0,0,0,0,0,0,0,0,0,0,0,0,0,0,0,0,0,0,0,0,0,0,0,0,0,0,0,0,0,0,0,0,0,0,0,0,0,0,0,0,0,0,0,0,0,0,0,113,57,0,0,0,0,0,0,0,0,0,0,0,0,0,0,0,0,0,0,0,0,0,0,0,0,0,0,0,0,0,0,0,0,0,0,0,0,0,0,0,0,0,0,0,0,0,0,0,0,0,0,0,0,0,0,0,0,0,0,0,0,0,0,0,0,0,0,0,0,0,0,0,0,0,0,0,0,0,0,0,0,0,0,0,0,0,0,0,0,0,0,0,0,0,0,0]
["Total",4,5,5,0,0,0,0,0,0,0,0,0,0,0,0,0,8,3,0,8,0,1,0,0,0,0,0,59,16,6,443,313,167,308,205,137,0,0,1,0,0,0,0,0,0,0,0,0,0,0,0,11,28,112,0,0,0,0,0,22,11,52,420,321,26,0,0,0,0,0,0,296,198,103,0,26,176,124,0,0,0,0,0,0,0,0,0,0,0,0,0,0,0,0,0,0,0,0,0,0,0,0,0,0,0,0,0,0,0,0,0,0,0,0,0,0,0,0,0,0,0,0,0,0,0,0,0,0,0,0,0,0,0,406,469,0,0,0,0,1,0,0,0,0,0,0,0,0,0,0,0,0,0,0,0,0,0,0,0,0,0,0,0,0,0,0,0,0,0,0,0,0,0,0,0,0,0,0,0,0,0,0,0,0,0,0,0,0,0,0,0,0,0,0,0,0,0,0,0,0,0,0,0,0,0,0,0,0,0,0,0,0,0,0,0,0,0,0,0,0,0,0,0,0,0,0,0,0,0,0]
[]
[]
[]
[]
[]
[]
[]
[]
[]
[]
[]
[]
[]
["TOTAL"]
[{"$f":"COUNT(A96:A114)","v":3},{"$f":"SUM(B96:B114)","v":8},{"$f":"SUM(C96:C114)","v":10},10,0,0,0,0,0,0,0,0,0,0,0,0,0,16,6,0,16,0,2,0,0,0,0,0,118,32,12,886,626,334,616,410,274,0,0,2,0,0,0,0,0,0,0,0,0,0,0,0,22,56,224,0,0,0,0,0,44,22,104,840,642,52,{"$f":"SUM(BO96:BO114)","v":0},0,0,0,0,0,592,396,206,0,52,352,248,0,0,0,0,0,0,0,0,0,0,0,0,0,0,0,0,0,0,0,0,0,0,0,0,0,0,0,0,0,0,0,0,0,0,0,0,0,0,0,0,0,0,0,0,0,0,0,0,0,0,0,{"$f":"SUM(EA96:EA114)","v":0},0,0,0,812,938,0,0,0,0,2,0,0,0,0,0,0,0,0,0,0,0,0,0,0,0,0,0,0,0,0,0,0,0,0,0,0,0,0,0,0,0,0,0,0,0,0,0,0,0,0,0,0,0,0,0,0,0,0,0,0,0,0,0,{"$f":"SUM(GM96:GM114)","v":0},0,0,0,0,0,0,0,0,0,0,0,0,0,0,0,0,0,0,0,0,0,0,0,0,0,0,0,0,0,0,0,0,0,0,0,0,0]
[{"$f":"CONCATENATE(A99,\"-\",A100,\"-\",A101,\"-\",A102,\"-\",A103,\"-\",A104,\"-\",A105,\"-\",A106,\"-\",A107,\"-\",A108,\"-\",A109,\"-\",A110)","v":"1-2-3-Total--------"}]
[null," BAS001"," BAS002"," BAS003"," BAS004"," BAS005"," BAS006"," BAS007"," BAS008"," BAS009"," BAS010"," BAS011"," BAS012"," BAS013"," BAS014"," BAS015"," BAS016"," BAS017"," BAS018"," BAS019"," BAS020"," BAS021"," BAS022"," BAS023"," BAS024"," BAS025"," BAS026"," BAS027"," BAS028"," BAS029"," BAS030"," BAS031"," BAS032"," BAS033"," BAS034"," BAS035"," BAS036"," BAS037"," BAS038"," BAS039"," BAS040"," BAS041"," BAS042"," BAS043"," BAS044"," BAS045"," BAS046"," BAS047"," BAS048"," BAS049"," BAS050"," BAS051"," BAS052"," BAS053"," BAS054"," BAS055"," BAS056"," BAS057"," BAS058"," BAS059"," BAS060"," BAS061"," BAS062"," BAS063"," BAS064"," BAS065"," BAS066"," BAS067"," BAS068"," BAS069"," BAS070"," BAS071"," BAS072"," BAS073"," BAS074"," BAS075"," BAS076"," BAS077"," BAS078"," BAS079"," BAS080"," BAS081"," BAS082"," BAS083"," BAS084"," BAS085"," BAS086"," BAS087"," BAS088"," BAS089"," BAS090"," BAS091"," BAS092"," BAS093"," BAS094"," BAS095"," BAS096"," BAS097"," BAS098"," BAS099"," BAS100"," BAS101"," BAS102"," BAS103"," BAS104"," BAS105"," BAS106"," BAS107"," BAS108"," BAS109"," BAS110"," BAS111"," BAS112"," BAS113"," BAS114"," BAS115"," BAS116"," BAS117"," BAS118"," BAS119"," BAS120"," BAS121"," BAS122"," BAS123"," BAS124"," BAS125"," BAS126"," BAS127"," BAS128"," BAS129"," BAS130"," BAS131"," BAS132"," BAS133"," BAS134"," BAS135"," BAS136"," BAS137"," BAS138"," BAS139"," BAS140"," BAS141"," BAS142"," BAS143"," BAS144"," BAS145"," BAS146"," BAS147"," BAS148"," BAS149"," BAS150"," BAS151"," BAS152"," BAS153"," BAS154"," BAS155"," BAS156"," BAS157"," BAS158"," BAS159"," BAS160"," BAS161"," BAS162"," BAS163"," BAS164"," BAS165"," BAS166"," BAS167"," BAS168"," BAS169"," BAS170"," BAS171"," BAS172"," BAS173"," BAS174"," BAS175"," BAS176"," BAS177"," BAS178"," BAS179"," BAS180"," BAS181"," BAS182"," BAS183"," BAS184"," BAS185"," BAS186"," BAS187"," BAS188"," BAS189"," BAS190"," BAS191"," BAS192"," BAS193"," BAS194"," BAS195"," BAS196"," BAS197"," BAS198"," BAS199"," BAS200"," BAS201"," BAS202"," BAS203"," BAS204"," BAS205"," BAS206"," BAS207"," BAS208"," BAS209"," BAS210"," BAS211"," BAS212"," BAS213"," BAS214"," BAS215"," BAS216"," BAS217"," BAS218"," BAS219"," BAS220"," BAS221"," BAS222"," BAS223"," BAS224"," BAS225"," BAS226"," BAS227"," BAS228"," BAS229"," BAS230"]
[null,{"$f":"IF(B119=B98,\"SI\",\"NO\")","v":"SI"},{"$f":"IF(C119=C98,\"SI\",\"NO\")","v":"SI"},"SI","SI","SI","SI","SI","SI","SI","SI","SI","SI","SI","SI","SI","SI","SI","SI","SI","SI","SI","SI","SI","SI","SI","SI","SI","SI","SI","SI","SI","SI","SI","SI","SI","SI","SI","SI","SI","SI","SI","SI","SI","SI","SI","SI","SI","SI","SI","SI","SI","SI","SI","SI","SI","SI","SI","SI","SI","SI","SI","SI","SI","SI","SI",{"$f":"IF(BO119=BO98,\"SI\",\"NO\")","v":"SI"},"SI","SI","SI","SI","SI","SI","SI","SI","SI","SI","SI","SI","SI","SI","SI","SI","SI","SI","SI","SI","SI","SI","SI","SI","SI","SI","SI","SI","SI","SI","SI","SI","SI","SI","SI","SI","SI","SI","SI","SI","SI","SI","SI","SI","SI","SI","SI","SI","SI","SI","SI","SI","SI","SI","SI","SI","SI","SI","SI","SI","SI","SI","SI",{"$f":"IF(EA119=EA98,\"SI\",\"NO\")","v":"SI"},"SI","SI","SI","SI","SI","SI","SI","SI","SI","SI","SI","SI","SI","SI","SI","SI","SI","SI","SI","SI","SI","SI","SI","SI","SI","SI","SI","SI","SI","SI","SI","SI","SI","SI","SI","SI","SI","SI","SI","SI","SI","SI","SI","SI","SI","SI","SI","SI","SI","SI","SI","SI","SI","SI","SI","SI","SI","SI","SI","SI","SI","SI","SI",{"$f":"IF(GM119=GM98,\"SI\",\"NO\")","v":"SI"},"SI","SI","SI","SI","SI","SI","SI","SI","SI","SI","SI","SI","SI","SI","SI","SI","SI","SI","SI","SI","SI","SI","SI","SI","SI","SI","SI","SI","SI","SI","SI","SI","SI","SI","SI","SI"]
[]
[]
[]
["Poblacion"]
["anno","2025"]
["cod_red","03"]
["codmic","(Todas)"]
["cod_prov","(Todas)"]
["coddist","(Todas)"]
["cod_estab","(Todas)"]
["cod_eje","(Todas)"]
["sector","(Todas)"]
[]
["Valores"]
[" t_0"," t_1"," t_2"," t_3"," t_4"," t_5_11"," f_10_49"," t_2_4"," adoles"," joven"," m_10_11"," m_12_17"," m_18_29"," m_30_59"," m_60_99"," t_30_49"," adulto"," t_50_59"," adulmy"," f_10_11"," f_12_17"," f_18_29"," f_30_49"]
[0,0,0,0,0,0,0,0,0,0,0,0,0,0,0,0,0,0,0,0,0,0,0]
[]
[]
[]
[]
[]
[]
[]
[]
["Metas"]
["anno",2025]
["cod_red","03"]
["codmic","(Todas)"]
["cod_prov","(Todas)"]
["coddist","(Todas)"]
["cod_estab","(Todas)"]
["cod_eje","(Todas)"]
["sector","(Todas)"]
[]
["Valores"]
[" rn"," m1a"," a1"," a2"," a3"," a4"," a511"]
[1673,1833,1842,2093,233,1940,0]

{"sheet":"INFORME","index":2,"n_rows":250,"n_cols":16,"rows_kept":250,"cut":false,"hidden":false,"merged":[[88,1,88,9],[17,6,17,7],[63,1,63,9],[64,1,64,9],[67,1,69,1],[67,2,69,2],[67,3,67,8],[68,3,68,8],[211,3,211,8],[212,3,212,4],[91,3,91,8],[92,3,92,8],[113,3,113,8],[114,3,114,8],[137,3,137,8],[198,7,198,9],[199,7,200,7],[199,8,199,9],[9,7,9,9],[12,8,12,9],[44,1,46,1],[44,2,46,2],[44,3,44,10],[45,3,45,6],[45,7,46,7],[45,8,46,8],[45,9,45,10],[11,8,11,9],[43,1,43,9],[16,1,18,1],[16,2,16,8],[17,2,18,2],[17,3,17,5],[12,3,12,5],[0,1,0,9],[1,1,1,9],[3,1,3,9],[6,3,6,5],[6,7,6,9],[91,1,93,1],[91,2,93,2],[198,5,200,6],[202,5,202,6],[201,5,201,6],[150,1,153,1],[94,2,106,2],[116,2,130,2],[110,1,110,9],[113,1,115,1],[113,2,115,2],[165,1,166,8],[236,5,236,6],[236,7,236,8],[221,1,222,1],[221,2,222,2],[137,1,139,1],[137,2,139,2],[150,2,153,2],[150,3,150,8],[151,3,151,8],[152,3,152,4],[227,1,228,1],[138,3,138,8],[168,1,170,1],[168,2,168,5],[189,7,190,7],[212,5,212,6],[236,9,236,10],[236,11,236,12],[134,1,134,7],[236,1,237,1],[236,2,237,2],[200,1,200,2],[227,2,228,2],[227,4,228,4],[236,3,236,4],[203,5,203,6],[204,5,204,6],[205,5,205,6],[206,5,206,6],[210,3,210,8],[140,2,147,2],[195,5,195,6],[9,3,9,5],[19,2,35,2],[47,2,61,2],[70,2,82,2],[210,1,213,1],[210,2,213,2],[37,1,37,9],[38,1,38,9],[39,1,39,9],[41,1,41,9],[133,1,133,7],[152,5,152,6],[169,2,169,5],[189,1,190,1],[189,2,190,2],[189,5,190,6]]}
[null,"GERENCIA REGIONAL DE SALUD CUSCO"]
[null,"DIRECCION DE ESTADISTICA E INFORMATICA Y TELECOMUNICACION"]
[]
[null,"INFORME  MENSUAL  ESTRATEGIA SANITARIA DE INMUNIZACIONES"]
[]
[null,"GERESA",null,"ESTABLECIMIENTO",null,null,null,"PROVINCIA"]
[null,"CUSCO",null,{"$f":"+TABLAS!O11","v":""},null,null,null,{"$f":"+TABLAS!O12","v":""}]
[]
[null,"RED DE SALUD ",null,"SECTOR",null,null,null,"DISTRITO"]
[null,{"$f":"+TABLAS!O12","v":""},null,{"$f":"+TABLAS!O15","v":""},null,null,null,{"$f":"+TABLAS!O13","v":""}]
[]
[null,"MICRO  RED",null,"EJECUTORA",null,null,null,"MES",{"$f":"+TABLAS!N26","v":"ENE - MAR"},null,{"$f":"+TABLAS!N20","v":3}]
[null,{"$f":"+TABLAS!O10","v":""},null,{"$f":"+TABLAS!O14","v":""},null,null,null,"AÑO",{"$f":"+TABLAS!I17","v":"2025"}]
[null,null,null,null,null,null,null,null,{"$f":"IF(K12=1,MID(D7,1,9)&\"_\"&MID(D7,13,20)&\"_\"&MID(I12,1,3)&\"_\"&I13,MID(D7,1,9)&\"_\"&MID(D7,13,20)&\"_\"&MID(I12,1,3)&\"_\"&MID(I12,7,3)&\"_\"&I13)","v":"__ENE_MAR_2025"}]
[]
[null,"1.-Menores de 1 Año",{"$f":"+GETPIVOTDATA(\" rn\",TABLAS!$A$155)","v":1673}]
[null,"Tipo de  Vacuna "," POBLACION  "]
[null,null,"Población \n< 1 año Program.","Dosis Administradas ",null,null,"Protegidos ",null,"Oportunidad "]
[null,null,null,"1ra","2da","3ra.","Total","Cobert.","Nº"]
[1,"BCG 100%  A (24 Hr) ",{"$f":"+GETPIVOTDATA(\" m1a\",TABLAS!$A$155)","v":1833},{"$f":"+GETPIVOTDATA(\" BAS001\",TABLAS!$A$59)","v":328},null,null,{"$f":"SUM(D20:D20)","v":328},{"$f":"SUM(G20/$C$20)*100","v":17.894162575013638}]
[{"$f":"+A20+1","v":2},"BCG 100%  B (28 Dias) ",null,{"$f":"+GETPIVOTDATA(\" BAS002\",TABLAS!$A$59)","v":17},null,null,17,{"$f":"SUM(G21/$C$20)*100","v":0.9274413529732678}]
[{"$f":"+A21+1","v":3},"BCG 100%  C (1M A 11M meses) ",null,{"$f":"+GETPIVOTDATA(\" BAS003\",TABLAS!$A$59)","v":6},null,null,6,0.32733224222585927]
[4,"BCG 100%  1-5A",null,{"$f":"+GETPIVOTDATA(\" BAS026\",TABLAS!$A$59)","v":1},null,null,1,5.4555373704309872E-2]
[5,"Hepatitis Viral B (HVB)(*) 100% A (12Hr)",null,{"$f":"+GETPIVOTDATA(\" BAS004\",TABLAS!$A$59)","v":330},null,null,330,18.00327332242226]
[6,"Hepatitis Viral B (HVB)(*) 100% A (24Hr)",null,{"$f":"+GETPIVOTDATA(\" BAS005\",TABLAS!$A$59)","v":330},null,null,330,18.00327332242226]
[7,"Hepatitis Viral B (HVB)(*) 100%  a menores de 7  dias",null,{"$f":"+GETPIVOTDATA(\" BAS027\",TABLAS!$A$59)","v":9},null,null,{"$f":"+D26","v":9},0.49099836333878888]
[8,"IPV 2 Y  4   y 6 Meses",null,{"$f":"+GETPIVOTDATA(\" BAS006\",TABLAS!$A$59)","v":387},{"$f":"+GETPIVOTDATA(\" BAS007\",TABLAS!$A$59)","v":390},{"$f":"+GETPIVOTDATA(\" BAS028\",TABLAS!$A$59)","v":348},{"$f":"+F27","v":348},18.985270049099835]
[9,"Antipolio 6meses",null,null,null,{"$f":"+GETPIVOTDATA(\" BAS010\",TABLAS!$A$59)","v":0},{"$f":"SUM(F28)","v":0},0]
[10,"Antipolio esquema anterior 4 y 6 meses",null,null,{"$f":"+GETPIVOTDATA(\" BAS009\",TABLAS!$A$59)","v":0},null,null,0]
[11,"Pentavalente (HIB+Titranrix) (**) 100%",null,{"$f":"+GETPIVOTDATA(\" BAS011\",TABLAS!$A$59)","v":387},{"$f":"+GETPIVOTDATA(\" BAS012\",TABLAS!$A$59)","v":387},{"$f":"+GETPIVOTDATA(\" BAS013\",TABLAS!$A$59)","v":345},{"$f":"SUM(F30)","v":345},18.821603927986907]
[12,"dt (Pediátrico)  1% (Reacción adversa  a Penta)",null,null,{"$f":"+GETPIVOTDATA(\" BAS014\",TABLAS!$A$59)","v":0},{"$f":"+GETPIVOTDATA(\" BAS015\",TABLAS!$A$59)","v":2},2,0.10911074740861974]
[13,"HVB  1% (Reacción adversa  a Penta)",null,null,{"$f":"+GETPIVOTDATA(\" BAS016\",TABLAS!$A$59)","v":0},{"$f":"+GETPIVOTDATA(\" BAS017\",TABLAS!$A$59)","v":0},0,0]
[14,"HiB  1% (Reacción adversa  a Penta)",null,null,{"$f":"+GETPIVOTDATA(\" BAS018\",TABLAS!$A$59)","v":4},{"$f":"+GETPIVOTDATA(\" BAS019\",TABLAS!$A$59)","v":0},0,0]
[15,"Rotavirus  100% ",null,{"$f":"+GETPIVOTDATA(\" BAS020\",TABLAS!$A$59)","v":383},{"$f":"+GETPIVOTDATA(\" BAS021\",TABLAS!$A$59)","v":386},null,{"$f":"SUM(E34)","v":386},{"$f":"SUM(G34/$C$20)*100","v":21.058374249863611}]
[16,"Neumococo (heptavalente) (**) 100%",null,{"$f":"+GETPIVOTDATA(\" BAS022\",TABLAS!$A$59)","v":387},{"$f":"+GETPIVOTDATA(\" BAS023\",TABLAS!$A$59)","v":388},null,{"$f":"SUM(E35)","v":388},21.167484997272233]
[17,"Influenza solo Pediatrica  100% (***)",null,{"$f":"+GETPIVOTDATA(\" BAS024\",TABLAS!$A$59)","v":12},{"$f":"+GETPIVOTDATA(\" BAS025\",TABLAS!$A$59)","v":14},null,{"$f":"SUM(E36)","v":14},0.76377523186033824]
[null,"poblacion en  riesgo IPV  2,4 Y  6 MESES"]
[null,"(*) La HVB de RN (Se administrará dentro de las  12horas de vida) "]
[null,"(**) El PpR considera \" Recien nacido con vacuna completa\" aquel niño que recibio  1 dosis de vacuna BCG + 1 dosis de vacuna HVB de RN; para fines de monitoreo  se realizara con el avance de la vacuna BCG."]
[null,"dt (Pediátrico) se administrara en casos que haya reacciones adversas a la vacuna penta."]
[null,"IPV (Vacuna Antipolio Inyectable),  se administrarà al menor de un año nacido de madre portadora de VIH. en tres dosis, 2,4 y 6 meses,  "]
[null,"(**) El PpR considera al  \"niño <1a  con vacuna completa\" aquel niño que recibio: 3 dosis de penta + 3 dosis de APO + 2 dosis de rotavirus+ 2 dosis de neumococo+2 dosis de influenza; para fines de monitoreo  se realizara con el avance de la tercera dosis de vacuna pentavalente."]
[]
[null,"2.- Niños de 1  año:"]
[null,"Tipo de Vacuna ","Población\n1 año Program."," POBLACION "]
[null,null,null,"   DOSIS ADMINISTRADAS",null,null,null,"PROT","Cob. \n(%)","Oportunidad"]
[null,null,null,"1ra.","2da ","3 era. "," DOSIS UNICA",null,null,"Nº","Acum. "]
[1,"Neumococo  3° Dosis 100%",{"$f":"+GETPIVOTDATA(\" a1\",TABLAS!$A$155)","v":1842},null,null,{"$f":"+GETPIVOTDATA(\" BAS038\",TABLAS!$A$59)","v":376},null,{"$f":"SUM(F48)","v":376},{"$f":"SUM(H48/$C$48)*100","v":20.412595005428884}]
[{"$f":"+A48+1","v":2},"VARICELA",null,null,null,null,{"$f":"+GETPIVOTDATA(\" BAS057\",TABLAS!$A$59)","v":355},{"$f":"+G49","v":355},{"$f":"SUM(H49/$C$48)*100","v":19.272529858849076}]
[{"$f":"+A49+1","v":3},"Sarampión, Paperas  Rubéola (SPR) * 100%",null,{"$f":"+GETPIVOTDATA(\" BAS039\",TABLAS!$A$59)","v":379},{"$f":"+GETPIVOTDATA(\" BAS041\",TABLAS!$A$59)","v":415},null,null,{"$f":"SUM(E50)","v":415},22.52985884907709]
[4,"Antiamarilica (AA) 15 meses)100%",null,null,null,null,{"$f":"+GETPIVOTDATA(\" BAS040\",TABLAS!$A$59)","v":430},{"$f":"SUM(G51)","v":430},23.344191096634091]
[5,"Hepatitis Viral A (HVA)  (15 meses) 100%",null,null,null,null,{"$f":"+GETPIVOTDATA(\" BAS061\",TABLAS!$A$59)","v":412},{"$f":"+G52","v":412},22.366992399565689,null,null,null,null,null,"falta codigo"]
[6,"DPT 1er Refuerzo (18 meses) 100%",null,{"$f":"+GETPIVOTDATA(\" BAS042\",TABLAS!$A$59)","v":407},null,null,null,{"$f":"SUM(D53)","v":407},22.095548317046688]
[7,"IPV (APO) Refuerzo (18 meses)  revisar  DA - DDA",null,{"$f":"+GETPIVOTDATA(\" BAS043\",TABLAS!$A$59)","v":389},null,null,null,{"$f":"SUM(D54)","v":389},21.118349619978286]
[8,"Influenza 100%",null,{"$f":"+GETPIVOTDATA(\" BAS058\",TABLAS!$A$59)","v":7},{"$error":"#REF!"},null,{"$f":"+GETPIVOTDATA(\" BAS059\",TABLAS!$A$59)","v":0},{"$f":"+G55","v":0},0]
[9,"Pentavalente  5%",null,{"$f":"+GETPIVOTDATA(\" BAS048\",TABLAS!$A$59)","v":0},{"$f":"+GETPIVOTDATA(\" BAS049\",TABLAS!$A$59)","v":3},{"$f":"+GETPIVOTDATA(\" BAS050\",TABLAS!$A$59)","v":6},null,{"$f":"SUM(F56)","v":6},0.32573289902280134]
[10,"IPV ",null,{"$f":"+GETPIVOTDATA(\" BAS045\",TABLAS!$A$59)","v":8},{"$f":"+GETPIVOTDATA(\" BAS046\",TABLAS!$A$59)","v":9},{"$f":"+GETPIVOTDATA(\" BAS060\",TABLAS!$A$59)","v":9},null,{"$f":"+F57","v":9},0.48859934853420189]
[11,"Neumococo  1° y 2° dosis  5%  no  Vacunados Anteriormente",null,{"$f":"+GETPIVOTDATA(\" BAS036\",TABLAS!$A$59)","v":2},{"$f":"+GETPIVOTDATA(\" BAS037\",TABLAS!$A$59)","v":6},null,null,{"$f":"SUM(E58)","v":6},0.32573289902280134]
[12,"Antipolio ",null,null,null,{"$f":"+GETPIVOTDATA(\" BAS047\",TABLAS!$A$59)","v":0},null,null,0]
[13,"dt (Pediátrico)  1% (Reacción adversa  a Penta)",null,null,{"$f":"+GETPIVOTDATA(\" BAS051\",TABLAS!$A$59)","v":0},{"$f":"+GETPIVOTDATA(\" BAS052\",TABLAS!$A$59)","v":0},null,{"$f":"+F60","v":0},0]
[14,"HVB  1% (Reacción adversa  a Penta)",null,null,{"$f":"+GETPIVOTDATA(\" BAS053\",TABLAS!$A$59)","v":1},{"$f":"+GETPIVOTDATA(\" BAS054\",TABLAS!$A$59)","v":0},null,{"$f":"+F61","v":0},0]
[15,"HiB  1% (Reacción adversa  a Penta)",null,null,{"$f":"+GETPIVOTDATA(\" BAS055\",TABLAS!$A$59)","v":0},{"$f":"+GETPIVOTDATA(\" BAS056\",TABLAS!$A$59)","v":0},null,{"$f":"+F62","v":0},0]
[]
[null,"(*) El PpR considera \"niño  de un año con vacuna completa\" aquel niño que recibio: 1 dosis de SPR + 1 dosis de  Neumococo+ 1 dosis de  vacuna refuerzo DPT+ 1 dosis de influenza; para fines de monitoreo  se realizara con el avance de  vacuna neumococo."]
[null,"(**)  A los 12 meses  el niño recibe la tercera dosis de vacuna contra el neumococo; sin embargo si el niño  no es captado antes del año de edad, recibirà  la primera dosis al año y deberà recibir  solamente dos dosis con un intervalo de 2 meses entre dosis."]
[]
[null,"3.- Niños de 2 años :"]
[null,"Tipo de Vacuna ","Población\n2 años Program.","POBLACION "]
[null,null,null,"   DOSIS APLICADAS"]
[null,null,null,"1ra.","2da.","3 era.","DU","PROT","Cob. (%)"]
[1,"Influenza  100%   ",{"$f":"+GETPIVOTDATA(\" a2\",TABLAS!$A$155)","v":2093},null,null,null,{"$f":"+GETPIVOTDATA(\" BAS068\",TABLAS!$A$59)","v":5},{"$f":"SUM(G71)","v":5},{"$f":"SUM(H71/$C$71)*100","v":0.23889154323936934}]
[{"$f":"+A71+1","v":2},"Neumococo 5% (Comorbilidad)",null,{"$f":"+GETPIVOTDATA(\" BAS069\",TABLAS!$A$59)","v":0},null,null,null,{"$f":"SUM(D72)","v":0},{"$f":"SUM(H72/$C$71)*100","v":0}]
[{"$f":"+A72+1","v":3},"SPR",null,{"$f":"+GETPIVOTDATA(\" BAS079\",TABLAS!$A$59)","v":6},{"$f":"+GETPIVOTDATA(\" BAS080\",TABLAS!$A$59)","v":20},null,null,{"$f":"+E73","v":20},0.95556617295747737]
[4,"VARICELA",null,null,null,null,{"$f":"+GETPIVOTDATA(\" BAS081\",TABLAS!$A$59)","v":6},{"$f":"+G74","v":6},0.2866698518872432]
[5,"Antiamarilica (AA) 100%",null,null,null,null,{"$f":"+GETPIVOTDATA(\" BAS070\",TABLAS!$A$59)","v":11},{"$f":"+G75","v":11},0.52556139512661249]
[6,"DPT 1er Refuerzo (18 meses) 100%",null,{"$f":"+GETPIVOTDATA(\" BAS083\",TABLAS!$A$59)","v":17},null,null,null,0,0]
[7,"IPV (APO) Refuerzo (18 meses)",null,{"$f":"+GETPIVOTDATA(\" BAS084\",TABLAS!$A$59)","v":13},null,null,null,{"$f":"SUM(D77)","v":13},0.6211180124223602]
[8,"Pentavalente 5%",null,{"$f":"+GETPIVOTDATA(\" BAS074\",TABLAS!$A$59)","v":1},{"$f":"+GETPIVOTDATA(\" BAS075\",TABLAS!$A$59)","v":1},{"$f":"+GETPIVOTDATA(\" BAS076\",TABLAS!$A$59)","v":4},null,{"$f":"SUM(F78)","v":4},0.19111323459149546]
[9,"IPV ",null,{"$f":"+GETPIVOTDATA(\" BAS071\",TABLAS!$A$59)","v":3},{"$f":"+GETPIVOTDATA(\" BAS072\",TABLAS!$A$59)","v":3},{"$f":"+GETPIVOTDATA(\" BAS082\",TABLAS!$A$59)","v":2},null,{"$f":"SUM(D79)","v":3},0.1433349259436216]
[10,"Neumococo  1° y 2° dosis  5%  no  Vacunados Anteriormente",null,{"$f":"+GETPIVOTDATA(\" BAS085\",TABLAS!$A$59)","v":0},{"$f":"+GETPIVOTDATA(\" BAS086\",TABLAS!$A$59)","v":1},null,null,{"$f":"+E80","v":1},4.7778308647873864E-2]
[11,"dt (Pediátrico)  1% (Reacción adversa  a Penta)",null,null,{"$f":"+GETPIVOTDATA(\" BAS077\",TABLAS!$A$59)","v":0},{"$f":"+GETPIVOTDATA(\" BAS078\",TABLAS!$A$59)","v":0},null,{"$f":"SUM(F81)","v":0},0]
[12,"HVB  1% (Reacción adversa  a Penta)",null,null,{"$f":"+GETPIVOTDATA(\" BAS087\",TABLAS!$A$59)","v":0},{"$f":"+GETPIVOTDATA(\" BAS088\",TABLAS!$A$59)","v":0},null,{"$f":"+F82","v":0},0]
[13,"HiB  1% (Reacción adversa  a Penta)",null,null,{"$f":"+GETPIVOTDATA(\" BAS089\",TABLAS!$A$59)","v":0},{"$f":"+GETPIVOTDATA(\" BAS090\",TABLAS!$A$59)","v":0},null,{"$f":"+F83","v":0},0]
[]
[null,"Antipolio ",{"$f":"SUM(C75)","v":0},null,null,{"$f":"+GETPIVOTDATA(\" BAS073\",TABLAS!$A$59)","v":0},{"$f":"+F85","v":0},{"$f":"SUM(G85/C85)*100","v":{"$error":"#DIV/0!"}}]
[null,"Influenza  100% dosis  unica",{"$error":"#REF!"},null,null,null,{"$f":"SUM(D86)","v":0},{"$f":"SUM(G86/C86)*100","v":{"$error":"#REF!"}}]
[]
[]
[null,"(*) El PpR considera \"niño  de dos años con vacuna completa\" aquel niño que no fue vacunado oportunamente y se le protege con 3 dosis de penta+ 3 dosis de APO+1 dosis de SPR + 2 dosis de neumococo + 1 dosis de vacuna  contra la influenza. Para fines de monitoreo  se realizara con el avance de  vacuna contra la influenza"]
[]
[null,"4.- Niños de 3  AÑOS años: "]
[null,"Tipo de Vacuna ","Población\n3 años Program."," POBLACION "]
[null,null,null,"   DOSIS APLICADAS",null,null,null,null,null,null,null,null,null,null,"2 años"]
[null,null,null,"1ra","2da","3 era.","DU","PROT","Cob. (%)",null,null,null,null,null,"Influenza  100%   "]
[1,"Influenza  5% (Comorbilidad)",{"$f":"+GETPIVOTDATA(\" a3\",TABLAS!$A$155)","v":233},null,null,null,{"$f":"+GETPIVOTDATA(\" BAS092\",TABLAS!$A$59)","v":6},{"$f":"SUM(G95)","v":6},{"$f":"SUM(H95/$C$95)*100","v":2.5751072961373391},null,null,null,null,null,"Neumococo 5% (Comorbilidad)"]
[{"$f":"+A95+1","v":2},"Neumococo 5% (Comorbilidad)",null,{"$f":"+GETPIVOTDATA(\" BAS093\",TABLAS!$A$59)","v":4},null,null,null,{"$f":"SUM(D96)","v":4},{"$f":"SUM(H96/$C$95)*100","v":1.7167381974248928},null,null,null,null,null,"SPR"]
[{"$f":"+A96+1","v":3},"SPR",null,{"$f":"+GETPIVOTDATA(\" BAS107\",TABLAS!$A$59)","v":2},{"$f":"+GETPIVOTDATA(\" BAS108\",TABLAS!$A$59)","v":8},null,null,{"$f":"+E97","v":8},3.4334763948497855,null,null,null,null,null,"VARICELA"]
[4,"VARICELA",null,null,null,null,{"$f":"+GETPIVOTDATA(\" BAS109\",TABLAS!$A$59)","v":5},{"$f":"+G98","v":5},2.1459227467811157,null,null,null,null,null,"Antiamarilica (AA) 100%"]
[5,"Antiamarilica (AA) 100%",null,null,null,null,{"$f":"+GETPIVOTDATA(\" BAS094\",TABLAS!$A$59)","v":6},{"$f":"+G99","v":6},2.5751072961373391,null,null,null,null,null,"DPT 1er Refuerzo (18 meses) 100%"]
[6,"DPT 1er Refuerzo (18 meses) 100%",null,{"$f":"+GETPIVOTDATA(\" BAS111\",TABLAS!$A$59)","v":10},null,null,null,{"$f":"SUM(D100)","v":10},4.2918454935622314,null,null,null,null,null,"APO Refuerzo (18 meses)"]
[7,"IPV (APO) Refuerzo (18 meses)",null,{"$f":"+GETPIVOTDATA(\" BAS112\",TABLAS!$A$59)","v":4},null,null,null,{"$f":"SUM(D101)","v":4},1.7167381974248928,null,null,null,null,null,"Pentavalente 5%"]
[8,"Pentavalente 5%",null,{"$f":"+GETPIVOTDATA(\" BAS098\",TABLAS!$A$59)","v":0},{"$f":"+GETPIVOTDATA(\" BAS099\",TABLAS!$A$59)","v":0},{"$f":"+GETPIVOTDATA(\" BAS100\",TABLAS!$A$59)","v":5},null,{"$f":"SUM(F102)","v":5},2.1459227467811157,null,null,null,null,null,"IPV "]
[9,"IPV ",null,{"$f":"+GETPIVOTDATA(\" BAS095\",TABLAS!$A$59)","v":1},{"$f":"+GETPIVOTDATA(\" BAS096\",TABLAS!$A$59)","v":0},{"$f":"+GETPIVOTDATA(\" BAS103\",TABLAS!$A$59)","v":0},null,{"$f":"+F103","v":0},0,null,null,null,null,null,"Neumococo  1° y 2° dosis  5%  no  Vacunados Anteriormente"]
[10,"Neumococo  1° y 2° dosis  5%  no  Vacunados Anteriormente",null,{"$f":"+GETPIVOTDATA(\" BAS113\",TABLAS!$A$59)","v":0},{"$f":"+GETPIVOTDATA(\" BAS114\",TABLAS!$A$59)","v":0},null,null,{"$f":"+E104","v":0},0,null,null,null,null,null,"dt (Pediátrico)  1% (Reacción adversa  a Penta)"]
[11,"dt (Pediátrico)  1% (Reacción adversa  a Penta)",null,null,{"$f":"+GETPIVOTDATA(\" BAS101\",TABLAS!$A$59)","v":0},{"$f":"+GETPIVOTDATA(\" BAS102\",TABLAS!$A$59)","v":0},null,{"$f":"+F105","v":0},0,null,null,null,null,null,"HVB  1% (Reacción adversa  a Penta)"]
[12,"HVB  1% (Reacción adversa  a Penta)",null,null,{"$f":"+GETPIVOTDATA(\" BAS103\",TABLAS!$A$59)","v":0},{"$f":"+GETPIVOTDATA(\" BAS104\",TABLAS!$A$59)","v":0},null,{"$f":"+F106","v":0},0,null,null,null,null,null,"HiB  1% (Reacción adversa  a Penta)"]
[13,"HiB  1% (Reacción adversa  a Penta)",null,null,{"$f":"+GETPIVOTDATA(\" BAS105\",TABLAS!$A$59)","v":0},{"$f":"+GETPIVOTDATA(\" BAS106\",TABLAS!$A$59)","v":0},null,{"$f":"+F107","v":0},0]
[14,"Antipolio ",{"$f":"+C96","v":0},null,null,{"$f":"+GETPIVOTDATA(\" BAS097\",TABLAS!$A$59)","v":0},null,null,0]
[15,"Influenza  100% dosis  unica",null,null,null,null,null,{"$f":"SUM(D109)","v":0},0]
[]
[null,"(*) El PpR considera \"niño  de tres años con vacuna completa\" aquel niño que no fue vacunado oportunamente y se le protege con 3 dosis de penta+ 3 dosis de APO+1 dosis de SPR + 2 dosis de neumococo + 1 dosis de vacuna  contra la influenza. Para fines de monitoreo  se realizara con el avance de  vacuna contra el neumococo."]
[]
[null,"5. Niños de  4  AÑOS "]
[null,"            Tipo de Vacuna ","Poblaciòn\n4 años Program.","POBLACION "]
[null,null,null,"   DOSIS APLICADAS"]
[null,null,null,"1ra","2da","3 era.","DU","Mensual","Cob. (%)"]
[1,"DPT 2do Refuerzo 100%",{"$f":"+GETPIVOTDATA(\" a4\",TABLAS!$A$155)","v":1940},null,{"$f":"+GETPIVOTDATA(\" BAS137\",TABLAS!$A$59)","v":409},null,null,{"$f":"SUM(E117)","v":409},{"$f":"SUM(H117/$C$117)*100","v":21.082474226804123},null,null,null,null,null,"2 años"]
[{"$f":"+A117+1","v":2},"Antipolio 2do Refuerzo 100%",null,null,{"$f":"+GETPIVOTDATA(\" BAS138\",TABLAS!$A$59)","v":356},null,null,{"$f":"SUM(E118)","v":356},{"$f":"SUM(H118/$C$117)*100","v":18.350515463917525},null,null,null,null,null,"Influenza  100%   "]
[{"$f":"+A118+1","v":3},"Influenza  5%",null,null,null,null,{"$f":"+GETPIVOTDATA(\" BAS120\",TABLAS!$A$59)","v":5},{"$f":"SUM(G119)","v":5},0.25773195876288657,null,null,null,null,null,"Neumococo 5% (Comorbilidad)"]
[4,"Neumococo 5%",null,{"$f":"+GETPIVOTDATA(\" BAS121\",TABLAS!$A$59)","v":1},null,null,null,{"$f":"SUM(D120)","v":1},5.1546391752577324E-2,null,null,null,null,null,"SPR"]
[5,"SPR",null,{"$f":"+GETPIVOTDATA(\" BAS135\",TABLAS!$A$59)","v":4},{"$f":"+GETPIVOTDATA(\" BAS136\",TABLAS!$A$59)","v":4},null,null,{"$f":"SUM(E121)","v":4},0.2061855670103093,null,null,null,null,null,"VARICELA"]
[6,"VARICELA  niiños que no  recibieron oportunamente la vacuna",null,null,null,null,{"$f":"+GETPIVOTDATA(\" BAS140\",TABLAS!$A$59)","v":41},{"$f":"+G122","v":41},2.1134020618556701,null,null,null,null,null,"Antiamarilica (AA) 100%"]
[7,"Antiamarilica (AA) 100%",null,null,null,null,{"$f":"+GETPIVOTDATA(\" BAS122\",TABLAS!$A$59)","v":5},{"$f":"SUM(G123)","v":5},0.25773195876288657,null,null,null,null,null,"DPT 1er Refuerzo (18 meses) 100%"]
[8,"DPT 1er Refuerzo (18 meses) 100%",null,{"$f":"+GETPIVOTDATA(\" BAS141\",TABLAS!$A$59)","v":409},null,null,null,{"$f":"SUM(D124)","v":409},21.082474226804123,null,null,null,null,null,"APO Refuerzo (18 meses)"]
[9,"IPV (APO)  Refuerzo (18 meses)",null,{"$f":"+GETPIVOTDATA(\" BAS142\",TABLAS!$A$59)","v":16},null,null,null,{"$f":"SUM(D125)","v":16},0.82474226804123718,null,null,null,null,null,"Pentavalente 5%"]
[10,"Pentavalente 5%",null,{"$f":"+GETPIVOTDATA(\" BAS126\",TABLAS!$A$59)","v":0},{"$f":"+GETPIVOTDATA(\" BAS127\",TABLAS!$A$59)","v":0},{"$f":"+GETPIVOTDATA(\" BAS128\",TABLAS!$A$59)","v":0},null,{"$f":"SUM(F126)","v":0},0,null,null,null,null,null,"IPV "]
[11,"IPV ",null,{"$f":"+GETPIVOTDATA(\" BAS123\",TABLAS!$A$59)","v":2},{"$f":"+GETPIVOTDATA(\" BAS124\",TABLAS!$A$59)","v":0},{"$f":"+GETPIVOTDATA(\" BAS139\",TABLAS!$A$59)","v":2},null,{"$f":"+F127","v":2},0.10309278350515465,null,null,null,null,null,"Neumococo  1° y 2° dosis  5%  no  Vacunados Anteriormente"]
[12,"Neumococo  1° y 2° dosis  5%  no  Vacunados Anteriormente",null,{"$f":"+GETPIVOTDATA(\" BAS143\",TABLAS!$A$59)","v":1},{"$f":"+GETPIVOTDATA(\" BAS144\",TABLAS!$A$59)","v":0},null,null,{"$f":"SUM(E128)","v":0},0,null,null,null,null,null,"dt (Pediátrico)  1% (Reacción adversa  a Penta)"]
[13,"dt (Pediátrico)  1% (Reacción adversa  a Penta)",null,null,{"$f":"+GETPIVOTDATA(\" BAS129\",TABLAS!$A$59)","v":0},{"$f":"+GETPIVOTDATA(\" BAS130\",TABLAS!$A$59)","v":0},null,{"$f":"SUM(F129)","v":0},0,null,null,null,null,null,"HVB  1% (Reacción adversa  a Penta)"]
[14,"HVB  1% (Reacción adversa  a Penta)",null,null,{"$f":"+GETPIVOTDATA(\" BAS131\",TABLAS!$A$59)","v":0},{"$f":"+GETPIVOTDATA(\" BAS132\",TABLAS!$A$59)","v":0},null,{"$f":"SUM(F130)","v":0},0,null,null,null,null,null,"HiB  1% (Reacción adversa  a Penta)"]
[15,"HiB  1% (Reacción adversa  a Penta)",null,null,{"$f":"+GETPIVOTDATA(\" BAS133\",TABLAS!$A$59)","v":0},{"$f":"+GETPIVOTDATA(\" BAS134\",TABLAS!$A$59)","v":0},null,{"$f":"SUM(F131)","v":0},0]
[16,"Antipolio ",{"$f":"+C120","v":0},null,null,{"$f":"+GETPIVOTDATA(\" BAS125\",TABLAS!$A$59)","v":0},null,{"$f":"SUM(F132)","v":0},{"$f":"SUM(H132/C132)*100","v":{"$error":"#DIV/0!"}}]
[]
[null,"* Una dosis por única vez"]
[null,"El PpR considera \"niño  de cuatro años con vacuna completa\" aquel niño que fue vacunado con 1 dosis de influenza + 1 dosis de vacuna Antiamarilica + 1 dosis de refuerzo APO y 1 dosis de vacuna. Para fines de monitoreo  se realizará con el avance del segundo refuerzo DPT"]
[]
[null,"7. Niños de  05 a 11 AÑOS"]
[null,"            Tipo de Vacuna ","Poblaciòn\n5-11 años Program.","POBLACION "]
[null,null,null,"   DOSIS APLICADAS"]
[null,null,null,"1ra","2da","3 era.","DU","PROT","Cob. (%)",null,null,null,null,null,"Neumococo (heptavalente) 5%"]
[1,"Neumococo 1% (con comorbilidades) ",{"$f":"+GETPIVOTDATA(\" a511\",TABLAS!$A$155)","v":0},{"$f":"+GETPIVOTDATA(\" BAS149\",TABLAS!$A$59)","v":1},null,null,null,{"$f":"SUM(D141)","v":1},{"$f":"IFERROR(SUM(H141/$C$141)*100,0)","v":0},null,null,null,null,null,"Influenza  5% (***)"]
[{"$f":"+A141+1","v":2},"Influenza",null,null,null,null,{"$f":"+GETPIVOTDATA(\" BAS150\",TABLAS!$A$59)","v":0},{"$f":"SUM(G142)","v":0},{"$f":"IFERROR(SUM(H142/$C$141)*100,0)","v":0},null,null,null,null,null,"Pentavalente (hasta los 7 años)"]
[{"$f":"+A142+1","v":3},"Pentavalente (5-7 años)",null,{"$f":"+GETPIVOTDATA(\" BAS195\",TABLAS!$A$59)","v":1},{"$f":"+GETPIVOTDATA(\" BAS196\",TABLAS!$A$59)","v":1},{"$f":"+GETPIVOTDATA(\" BAS197\",TABLAS!$A$59)","v":0},null,{"$f":"+F143","v":0},0,null,null,null,null,null,"DPT (hasta los 7 años)"]
[4,"DPT (5-7 años) 1%",null,null,{"$f":"+GETPIVOTDATA(\" BAS198\",TABLAS!$A$59)","v":16},null,null,{"$f":"+E144","v":16},0,null,null,null,null,null,"SPR "]
[5,"SPR (población en riesgo) 2%",null,null,null,null,{"$f":"+GETPIVOTDATA(\" BAS151\",TABLAS!$A$59)","v":1},{"$f":"+G145","v":1},0,null,null,null,null,null,90707]
[6,"VPH (virus del  Papilo,ma humano) 9-13A",null,null,null,null,{"$f":"+GETPIVOTDATA(\" BAS152\",TABLAS!$A$59)","v":406},{"$f":"+G146","v":406},{"$f":"IFERROR(SUM(H146/$C$141)*100,0)","v":0},null,null,null,null,null,"90649  001 - DU","solo debe ser 9 a 13 años"]
[7,"VPH (virus del  Papilo,ma humano) 14-18A",null,null,null,null,{"$f":"+GETPIVOTDATA(\" BAS153\",TABLAS!$A$59)","v":469},{"$f":"+G147","v":469},{"$f":"IFERROR(SUM(H147/$C$141)*100,0)","v":0}]
[8,"dT adulto (7 a 11 años) (Si no recibio la vacuna previamente) 0.005%",null,{"$f":"+GETPIVOTDATA(\" BAS199\",TABLAS!$A$59)","v":12},{"$f":"+GETPIVOTDATA(\" BAS200\",TABLAS!$A$59)","v":6},{"$f":"+GETPIVOTDATA(\" BAS201\",TABLAS!$A$59)","v":1},null,{"$f":"+F148","v":1},0]
[]
[null,"9.- MUJERES EN EDAD FERTIL DE 10 A 49 AÑOS:  DT ADULTO"]
[null,"Grupo","Población Program.\nSegún  Grupo","POBLACION"]
[null,null,null,"DOSIS APLICADAS"]
[null,null,null,"DT(A) 1",null," DT(A)2",null," DT(A)3"]
[null,null,null,"Mensual","Cob.(%)","Mensual","Cob.(%)","Mensual","Cob.(%)"]
[1,"No Gestantes 10  a 11 años 15%",{"$f":"+GETPIVOTDATA(\" f_10_11\",TABLAS!$A$134)","v":0},{"$f":"+GETPIVOTDATA(\" BAS156\",TABLAS!$A$59)","v":2},{"$f":"+D155/C155*100","v":{"$error":"#DIV/0!"}},{"$f":"+GETPIVOTDATA(\" BAS157\",TABLAS!$A$59)","v":0},{"$f":"+F155/C155*100","v":{"$error":"#DIV/0!"}},{"$f":"+GETPIVOTDATA(\" BAS158\",TABLAS!$A$59)","v":1},{"$f":"+H155/C155*100","v":{"$error":"#DIV/0!"}}]
[{"$f":"+A155+1","v":2},"No Gestantes 12 a 17 años 15%",{"$f":"+GETPIVOTDATA(\" f_12_17\",TABLAS!$A$134)","v":0},{"$f":"+GETPIVOTDATA(\" BAS159\",TABLAS!$A$59)","v":32},{"$f":"+D156/C156*100","v":{"$error":"#DIV/0!"}},{"$f":"+GETPIVOTDATA(\" BAS160\",TABLAS!$A$59)","v":12},{"$f":"+F156/C156*100","v":{"$error":"#DIV/0!"}},{"$f":"+GETPIVOTDATA(\" BAS161\",TABLAS!$A$59)","v":6},{"$f":"+H156/C156*100","v":{"$error":"#DIV/0!"}}]
[{"$f":"+A156+1","v":3},"No Gestantes  18 a 29 años 15%",{"$f":"+GETPIVOTDATA(\" f_18_29\",TABLAS!$A$134)","v":0},{"$f":"+GETPIVOTDATA(\" BAS162\",TABLAS!$A$59)","v":76},{"$error":"#DIV/0!"},{"$f":"+GETPIVOTDATA(\" BAS163\",TABLAS!$A$59)","v":55},{"$error":"#DIV/0!"},{"$f":"+GETPIVOTDATA(\" BAS164\",TABLAS!$A$59)","v":30},{"$error":"#DIV/0!"}]
[4,"No Gestantes  30 a 49 años 15%",{"$f":"+GETPIVOTDATA(\" f_30_49\",TABLAS!$A$134)","v":0},{"$f":"+GETPIVOTDATA(\" BAS165\",TABLAS!$A$59)","v":102},{"$error":"#DIV/0!"},{"$f":"+GETPIVOTDATA(\" BAS166\",TABLAS!$A$59)","v":62},{"$error":"#DIV/0!"},{"$f":"+GETPIVOTDATA(\" BAS167\",TABLAS!$A$59)","v":36},{"$error":"#DIV/0!"}]
[null,"Total Mujeres"]
[{"$f":"+A158+1","v":5},"Niños 10 a 11 años ",{"$f":"+GETPIVOTDATA(\" m_10_11\",TABLAS!$A$134)","v":0},{"$f":"+GETPIVOTDATA(\" BAS180\",TABLAS!$A$59)","v":7},{"$f":"SUM(D160/C160*100)","v":{"$error":"#DIV/0!"}},{"$f":"+GETPIVOTDATA(\" BAS181\",TABLAS!$A$59)","v":6},{"$f":"SUM(F160/C160)*100","v":{"$error":"#DIV/0!"}},{"$f":"+GETPIVOTDATA(\" BAS182\",TABLAS!$A$59)","v":0},{"$f":"+H160/C160*100","v":{"$error":"#DIV/0!"}}]
[6,"Adolescente 12 a 17 años ",{"$f":"+GETPIVOTDATA(\" m_12_17\",TABLAS!$A$134)","v":0},{"$f":"+GETPIVOTDATA(\" BAS183\",TABLAS!$A$59)","v":35},{"$error":"#DIV/0!"},{"$f":"+GETPIVOTDATA(\" BAS184\",TABLAS!$A$59)","v":4},{"$error":"#DIV/0!"},{"$f":"+GETPIVOTDATA(\" BAS185\",TABLAS!$A$59)","v":4},{"$error":"#DIV/0!"}]
[7,"Joven  18 a 29 años ",{"$f":"+GETPIVOTDATA(\" m_18_29\",TABLAS!$A$134)","v":0},{"$f":"+GETPIVOTDATA(\" BAS186\",TABLAS!$A$59)","v":300},{"$error":"#DIV/0!"},{"$f":"+GETPIVOTDATA(\" BAS187\",TABLAS!$A$59)","v":194},{"$error":"#DIV/0!"},{"$f":"+GETPIVOTDATA(\" BAS188\",TABLAS!$A$59)","v":77},{"$error":"#DIV/0!"}]
[8,"Adulto 30 a 59 años   ",{"$f":"+GETPIVOTDATA(\" m_30_59\",TABLAS!$A$134)","v":0},{"$f":"+GETPIVOTDATA(\" BAS189\",TABLAS!$A$59)","v":198},{"$error":"#DIV/0!"},{"$f":"+GETPIVOTDATA(\" BAS190\",TABLAS!$A$59)","v":132},{"$error":"#DIV/0!"},{"$f":"+GETPIVOTDATA(\" BAS191\",TABLAS!$A$59)","v":90},{"$error":"#DIV/0!"}]
[9,"Adulto mayor de 60 a más",{"$f":"+GETPIVOTDATA(\" m_60_99\",TABLAS!$A$134)","v":0},{"$f":"+GETPIVOTDATA(\" BAS192\",TABLAS!$A$59)","v":28},{"$error":"#DIV/0!"},{"$f":"+GETPIVOTDATA(\" BAS193\",TABLAS!$A$59)","v":11},{"$error":"#DIV/0!"},{"$f":"+GETPIVOTDATA(\" BAS194\",TABLAS!$A$59)","v":6},{"$error":"#DIV/0!"}]
[null,"Total Varoness",{"$f":"SUM(C160:C164)","v":0},{"$f":"SUM(D161:D164)","v":561},{"$error":"#DIV/0!"},{"$f":"SUM(F161:F164)","v":341},{"$error":"#DIV/0!"},{"$f":"SUM(H160:H164)","v":177},{"$error":"#DIV/0!"}]
[null,"(*) El PpR considera \"Atencion de Gestante reenfocada\" aquella gestante que ademas de sus controles recibe  su vacuna antitetanica. Se vacunara  con vacuna dt adulto lo mas precozmente posible no existiendo contraindicacion con la edad gestacional, administrando la 1ª dosis  en la primera consulta "]
[]
[null,"9.- VACUNA HEPATITIS VIRAL B: (HvB)"]
[null,"GRUPO POBLACIONAL"," POBLACION"]
[null,null,"DOSIS APLICADAS"]
[null,null,"1ra","2da","3ra","Total"]
[1,"Trabajadores de  Salud  ",{"$f":"+GETPIVOTDATA(\" BAS001\",TABLAS!$A$97)","v":4},{"$f":"+GETPIVOTDATA(\" BAS002\",TABLAS!$A$97)","v":5},{"$f":"+GETPIVOTDATA(\" BAS003\",TABLAS!$A$97)","v":5},{"$f":"SUM(C172:E172)","v":14}]
[{"$f":"+A172+1","v":2},"Trabajadores  Sexuales ",{"$f":"+GETPIVOTDATA(\" BAS004\",TABLAS!$A$97)","v":0},{"$f":"+GETPIVOTDATA(\" BAS005\",TABLAS!$A$97)","v":0},{"$f":"+GETPIVOTDATA(\" BAS006\",TABLAS!$A$97)","v":0},{"$f":"SUM(C173:E173)","v":0}]
[{"$f":"+A173+1","v":3},"HSH",{"$f":"+GETPIVOTDATA(\" BAS007\",TABLAS!$A$97)","v":0},{"$f":"+GETPIVOTDATA(\" BAS008\",TABLAS!$A$97)","v":0},{"$f":"+GETPIVOTDATA(\" BAS009\",TABLAS!$A$97)","v":0},0]
[4,"Politransfundidos",null,null,null,0]
[5,"Privados de Libertad",{"$f":"+GETPIVOTDATA(\" BAS013\",TABLAS!$A$97)","v":0},{"$f":"+GETPIVOTDATA(\" BAS014\",TABLAS!$A$97)","v":0},{"$f":"+GETPIVOTDATA(\" BAS015\",TABLAS!$A$97)","v":0},0]
[6,"Fuerzas Policiales  y Militares",{"$f":"+GETPIVOTDATA(\" BAS016\",TABLAS!$A$97)","v":0},{"$f":"+GETPIVOTDATA(\" BAS017\",TABLAS!$A$97)","v":8},{"$f":"+GETPIVOTDATA(\" BAS018\",TABLAS!$A$97)","v":3},11]
[7,"Cruz Roja, Defensa Civil, Bomberos",{"$f":"+GETPIVOTDATA(\" BAS019\",TABLAS!$A$97)","v":0},{"$f":"+GETPIVOTDATA(\" BAS020\",TABLAS!$A$97)","v":8},{"$f":"+GETPIVOTDATA(\" BAS021\",TABLAS!$A$97)","v":0},8]
[8,"Estudiantes de Areas de Salud ",{"$f":"+GETPIVOTDATA(\" BAS022\",TABLAS!$A$97)","v":1},{"$f":"+GETPIVOTDATA(\" BAS023\",TABLAS!$A$97)","v":0},{"$f":"+GETPIVOTDATA(\" BAS024\",TABLAS!$A$97)","v":0},1]
[null,"TOTAL GRUPOS DE RIESGO ",{"$f":"SUM(C172:C179)","v":5},{"$f":"SUM(D172:D179)","v":21},{"$f":"SUM(E172:E179)","v":8},{"$f":"SUM(F172:F179)","v":34}]
[{"$f":"+A179+1","v":9},"Niños de 5-11 años",{"$f":"+GETPIVOTDATA(\" BAS025\",TABLAS!$A$97)","v":0},{"$f":"+GETPIVOTDATA(\" BAS026\",TABLAS!$A$97)","v":0},{"$f":"+GETPIVOTDATA(\" BAS027\",TABLAS!$A$97)","v":0},0]
[10,"Adolescentes de 12 a 17 años",{"$f":"+GETPIVOTDATA(\" BAS028\",TABLAS!$A$97)","v":59},{"$f":"+GETPIVOTDATA(\" BAS029\",TABLAS!$A$97)","v":16},{"$f":"+GETPIVOTDATA(\" BAS030\",TABLAS!$A$97)","v":6},81]
[11,"Joven  18 a 29 años",{"$f":"+GETPIVOTDATA(\" BAS031\",TABLAS!$A$97)","v":443},{"$f":"+GETPIVOTDATA(\" BAS032\",TABLAS!$A$97)","v":313},{"$f":"+GETPIVOTDATA(\" BAS033\",TABLAS!$A$97)","v":167},923]
[12,"Adulto 30 a 59 años",{"$f":"+GETPIVOTDATA(\" BAS034\",TABLAS!$A$97)","v":308},{"$f":"+GETPIVOTDATA(\" BAS035\",TABLAS!$A$97)","v":205},{"$f":"+GETPIVOTDATA(\" BAS036\",TABLAS!$A$97)","v":137},650]
[null,"TOTAL",{"$f":"SUM(C181:C184)","v":810},{"$f":"SUM(D181:D184)","v":534},310,1654]
[null,"Hepatitis \"B\"",{"$f":"+GETPIVOTDATA(\" BAS072\",TABLAS!$A$97)","v":296},{"$f":"+GETPIVOTDATA(\" BAS073\",TABLAS!$A$97)","v":198},{"$f":"+GETPIVOTDATA(\" BAS074\",TABLAS!$A$97)","v":103},597]
[]
[]
[null,"10.- VACUNA  CONTRA LA INFLUENZA ESTACIONAL",null,null,null,"10.- VACUNA  NEUMOCOCO"]
[null,"GRUPO POBLACIONAL","Poblaciòn \nProgramada","PROTEGIDOS",null,"GRUPO POBLACIONAL",null,"Poblaciòn \nProgramada","PROTEGIDOS"]
[null,null,null,"1ra",null,null,null,null,"1ra"]
[1,"Niños de 5-11 años",{"$f":"+GETPIVOTDATA(\" t_5_11\",TABLAS!$A$134)","v":0},{"$f":"+GETPIVOTDATA(\" BAS037\",TABLAS!$A$97)","v":0},{"$f":"+A200+1","v":9},"Adolescentes de 12-17años",null,{"$f":"+C193","v":0},{"$f":"+GETPIVOTDATA(\" BAS051\",TABLAS!$A$97)","v":0}]
[{"$f":"+A192+1","v":2},"Adolescentes de 12-17años",{"$f":"+GETPIVOTDATA(\" adoles\",TABLAS!$A$134)","v":0},{"$f":"+GETPIVOTDATA(\" BAS038\",TABLAS!$A$97)","v":0},{"$f":"+E192+1","v":10},"Joven de 18-29 años",null,{"$f":"+C194","v":0},{"$f":"+GETPIVOTDATA(\" BAS052\",TABLAS!$A$97)","v":11}]
[{"$f":"+A193+1","v":3},"Joven de 18-29 años",{"$f":"+GETPIVOTDATA(\" joven\",TABLAS!$A$134)","v":0},{"$f":"+GETPIVOTDATA(\" BAS039\",TABLAS!$A$97)","v":1},{"$f":"+E193+1","v":11},"Adulto 30 a 59 años",null,{"$f":"+C195","v":0},{"$f":"+GETPIVOTDATA(\" BAS053\",TABLAS!$A$97)","v":28}]
[4,"Adulto 30 a 49 años",{"$f":"+GETPIVOTDATA(\" t_30_49\",TABLAS!$A$134)","v":0},{"$f":"+GETPIVOTDATA(\" BAS040\",TABLAS!$A$97)","v":0},12,"Adulto Mayor 60 años a mas ",null,{"$f":"+C197","v":0},{"$f":"+GETPIVOTDATA(\" BAS054\",TABLAS!$A$97)","v":112}]
[5,"Adulto 50 a 59 años",{"$f":"+GETPIVOTDATA(\" t_50_59\",TABLAS!$A$134)","v":0},{"$f":"+GETPIVOTDATA(\" BAS041\",TABLAS!$A$97)","v":0},null,"TOTAL",null,{"$f":"SUM(H192:H195)","v":0},{"$f":"SUM(I192:I195)","v":151}]
[6,"Adulto Mayor 60 años a mas ",{"$f":"+GETPIVOTDATA(\" adulmy\",TABLAS!$A$134)","v":0},{"$f":"+GETPIVOTDATA(\" BAS042\",TABLAS!$A$97)","v":0}]
[null,"TOTAL",{"$f":"SUM(C192:C197)","v":0},{"$f":"SUM(D192:D197)","v":1},null,"10- VACUNA ANTIAMARILICA:(AA)"]
[{"$f":"+A225+1","v":7},"Trabajadores de  Salud  ",null,{"$f":"+GETPIVOTDATA(\" BAS045\",TABLAS!$A$97)","v":0},null,"Grupo  de Edad",null,"POBLACION AUTOCTONO"]
[8,"Persona  Privadas de su  Libertad",null,{"$f":"+GETPIVOTDATA(\" BAS046\",TABLAS!$A$97)","v":0},null,null,null," Pob.  Prog.","DOSIS APLICADAS"]
[null,"TOTAl ",null,{"$f":"SUM(D198:D200)","v":1},null,null,null,null,"Mensual","Cob.(%)"]
[null,null,null,null,{"$f":"+E195+1","v":13},"De 2 a 4 Años",null,{"$f":"+GETPIVOTDATA(\" t_2_4\",TABLAS!$A$134)","v":0},{"$f":"+GETPIVOTDATA(\" BAS060\",TABLAS!$A$97)","v":22},{"$f":"SUM(I202/H202*100)","v":{"$error":"#DIV/0!"}}]
[null,null,null,null,{"$f":"+E202+1","v":14},"De 5 a 11 Años",null,{"$f":"+GETPIVOTDATA(\" t_5_11\",TABLAS!$A$134)","v":0},{"$f":"+GETPIVOTDATA(\" BAS061\",TABLAS!$A$97)","v":11},{"$error":"#DIV/0!"}]
[null,null,null,null,{"$f":"+E203+1","v":15},"De 12 a 17 Años",null,{"$f":"+GETPIVOTDATA(\" adoles\",TABLAS!$A$134)","v":0},{"$f":"+GETPIVOTDATA(\" BAS062\",TABLAS!$A$97)","v":52},{"$error":"#DIV/0!"}]
[null,null,null,null,16,"De 18 a 29 Años",null,{"$f":"+GETPIVOTDATA(\" joven\",TABLAS!$A$134)","v":0},{"$f":"+GETPIVOTDATA(\" BAS063\",TABLAS!$A$97)","v":420},{"$error":"#DIV/0!"}]
[null,null,null,null,17,"De 30 a 59 Años",null,{"$f":"+GETPIVOTDATA(\" adulto\",TABLAS!$A$134)","v":0},{"$f":"+GETPIVOTDATA(\" BAS064\",TABLAS!$A$97)","v":321},{"$error":"#DIV/0!"}]
[null,null,null,null,null,"TOTAL",null,{"$f":"SUM(H202:H206)","v":0},{"$f":"SUM(I202:I206)","v":826},{"$error":"#DIV/0!"}]
[]
[null,"G E S T A N T E"]
[null,"9.- MUJERES EN EDAD FERTIL DE 10 A 49 AÑOS:  DT ADULTO - GESTANTE"]
[null,"Grupo","Población Program.\nSegún  Grupo","POBLACION"]
[null,null,null,"DOSIS APLICADAS"]
[null,null,null,"DT(A) 1",null," DT(A)2",null," DT(A)3"]
[null,null,null,"Mensual","Cob.(%)","Mensual","Cob.(%)","Mensual","Cob.(%)"]
[1,"Gestantes 10  a 11 años 100%",{"$f":"+GETPIVOTDATA(\" f_10_11\",TABLAS!$A$134)","v":0},{"$f":"+GETPIVOTDATA(\" BAS168\",TABLAS!$A$59)","v":0},{"$f":"+D215/C215*100","v":{"$error":"#DIV/0!"}},{"$f":"+GETPIVOTDATA(\" BAS169\",TABLAS!$A$59)","v":0},{"$f":"+F215/C215*100","v":{"$error":"#DIV/0!"}},{"$f":"+GETPIVOTDATA(\" BAS170\",TABLAS!$A$59)","v":0},{"$f":"+H215/C215*100","v":{"$error":"#DIV/0!"}}]
[{"$f":"+A215+1","v":2},"Gestantes 12 a 17 años 100%",{"$f":"+GETPIVOTDATA(\" f_12_17\",TABLAS!$A$134)","v":0},{"$f":"+GETPIVOTDATA(\" BAS171\",TABLAS!$A$59)","v":3},{"$f":"+D216/C216*100","v":{"$error":"#DIV/0!"}},{"$f":"+GETPIVOTDATA(\" BAS172\",TABLAS!$A$59)","v":0},{"$f":"+F216/C216*100","v":{"$error":"#DIV/0!"}},{"$f":"+GETPIVOTDATA(\" BAS173\",TABLAS!$A$59)","v":0},{"$f":"+H216/C216*100","v":{"$error":"#DIV/0!"}}]
[{"$f":"+A216+1","v":3},"Gestantes  18 a 29 años 100%",{"$f":"+GETPIVOTDATA(\" f_18_29\",TABLAS!$A$134)","v":0},{"$f":"+GETPIVOTDATA(\" BAS174\",TABLAS!$A$59)","v":10},{"$f":"+D217/C217*100","v":{"$error":"#DIV/0!"}},{"$f":"+GETPIVOTDATA(\" BAS175\",TABLAS!$A$59)","v":6},{"$f":"+F217/C217*100","v":{"$error":"#DIV/0!"}},{"$f":"+GETPIVOTDATA(\" BAS176\",TABLAS!$A$59)","v":5},{"$f":"+H217/C217*100","v":{"$error":"#DIV/0!"}}]
[{"$f":"+A217+1","v":4},"Gestantes  30 a 49 años 100%",{"$f":"+GETPIVOTDATA(\" f_30_49\",TABLAS!$A$134)","v":0},{"$f":"+GETPIVOTDATA(\" BAS177\",TABLAS!$A$59)","v":6},{"$f":"+D218/C218*100","v":{"$error":"#DIV/0!"}},{"$f":"+GETPIVOTDATA(\" BAS178\",TABLAS!$A$59)","v":4},{"$f":"+F218/C218*100","v":{"$error":"#DIV/0!"}},{"$f":"+GETPIVOTDATA(\" BAS179\",TABLAS!$A$59)","v":1},{"$f":"+H218/C218*100","v":{"$error":"#DIV/0!"}}]
[null,"TOT GEST",{"$f":"SUM(C215:C218)","v":0},{"$f":"SUM(D215:D218)","v":19},{"$f":"+D219/C219*100","v":{"$error":"#DIV/0!"}},{"$f":"SUM(F215:F218)","v":10},{"$f":"+F219/C219*100","v":{"$error":"#DIV/0!"}},{"$f":"SUM(H215:H218)","v":6},{"$f":"+H219/C219*100","v":{"$error":"#DIV/0!"}}]
[]
[null,"10.- VACUNA  CONTRA LA INFLUENZA ESTACIONAL  -  GESTANTE"]
[null,"GRUPO POBLACIONAL","Poblaciòn \nProgramada","PROTEGIDOS"]
[null,null,null,"1ra"]
[{"$f":"+A218+1","v":5},"Gestantes",null,{"$f":"+GETPIVOTDATA(\" BAS043\",TABLAS!$A$97)","v":0}]
[{"$f":"+A224+1","v":6},"Puerperas",null,{"$f":"+GETPIVOTDATA(\" BAS044\",TABLAS!$A$97)","v":0}]
[]
[null,"10.- VACUNA  DTPA GESTANTE"]
[null,"GRUPO POBLACIONAL","Poblaciòn \nProgramada","PROTEGIDOS","COB."]
[null,null,null,"1ra"]
[{"$f":"+A225+1","v":7}," 10-11años",null,{"$f":"+GETPIVOTDATA(\" BAS075\",TABLAS!$A$97)","v":0}]
[{"$f":"+A230+1","v":8}," 12-17años",null,{"$f":"+GETPIVOTDATA(\" BAS076\",TABLAS!$A$97)","v":26}]
[9," 18-29años",null,{"$f":"+GETPIVOTDATA(\" BAS077\",TABLAS!$A$97)","v":176}]
[10," 30-59años",null,{"$f":"+GETPIVOTDATA(\" BAS078\",TABLAS!$A$97)","v":124}]
[null,"TOTAL",null,{"$f":"SUM(D230:D233)","v":326}]
[]
[null,"11- VACUNA CONTRA EL COVID-19"]
[null,"GRUPO ETARIO","Población \nProgramada","1ra",null,"2da",null,"3ra",null,"4to",null,"DOSIS BIVALENTE"]
[null,null,null,"N","%","N","%","N","%","N",null,"N"]
[1,"06 a 11 meses",null,{"$f":"+GETPIVOTDATA(\" BAS079\",TABLAS!$A$97)","v":0},null,{"$f":"+GETPIVOTDATA(\" BAS090\",TABLAS!$A$97)","v":0},null,{"$f":"+GETPIVOTDATA(\" BAS101\",TABLAS!$A$97)","v":0},null,{"$f":"+GETPIVOTDATA(\" BAS112\",TABLAS!$A$97)","v":0},null,{"$f":"+GETPIVOTDATA(\" BAS123\",TABLAS!$A$97)","v":0}]
[{"$f":"+A239+1","v":2},"01 a 04 años",null,{"$f":"+GETPIVOTDATA(\" BAS080\",TABLAS!$A$97)","v":0},null,{"$f":"+GETPIVOTDATA(\" BAS091\",TABLAS!$A$97)","v":0},null,{"$f":"+GETPIVOTDATA(\" BAS102\",TABLAS!$A$97)","v":0},null,{"$f":"+GETPIVOTDATA(\" BAS113\",TABLAS!$A$97)","v":0},null,{"$f":"+GETPIVOTDATA(\" BAS124\",TABLAS!$A$97)","v":0}]
[3,"05 a 11 años",null,{"$f":"+GETPIVOTDATA(\" BAS081\",TABLAS!$A$97)","v":0},null,{"$f":"+GETPIVOTDATA(\" BAS092\",TABLAS!$A$97)","v":0},null,{"$f":"+GETPIVOTDATA(\" BAS103\",TABLAS!$A$97)","v":0},null,{"$f":"+GETPIVOTDATA(\" BAS114\",TABLAS!$A$97)","v":0},null,{"$f":"+GETPIVOTDATA(\" BAS125\",TABLAS!$A$97)","v":0}]
[4,"12 a 17 años",null,{"$f":"+GETPIVOTDATA(\" BAS082\",TABLAS!$A$97)","v":0},null,{"$f":"+GETPIVOTDATA(\" BAS093\",TABLAS!$A$97)","v":0},null,{"$f":"+GETPIVOTDATA(\" BAS104\",TABLAS!$A$97)","v":0},null,{"$f":"+GETPIVOTDATA(\" BAS115\",TABLAS!$A$97)","v":0},null,{"$f":"+GETPIVOTDATA(\" BAS126\",TABLAS!$A$97)","v":0}]
[5,"18 a 29 años",null,{"$f":"+GETPIVOTDATA(\" BAS083\",TABLAS!$A$97)","v":0},null,{"$f":"+GETPIVOTDATA(\" BAS094\",TABLAS!$A$97)","v":0},null,{"$f":"+GETPIVOTDATA(\" BAS105\",TABLAS!$A$97)","v":0},null,{"$f":"+GETPIVOTDATA(\" BAS116\",TABLAS!$A$97)","v":0},null,{"$f":"+GETPIVOTDATA(\" BAS127\",TABLAS!$A$97)","v":0}]
[6,"30 a 39 años",null,{"$f":"+GETPIVOTDATA(\" BAS084\",TABLAS!$A$97)","v":0},null,{"$f":"+GETPIVOTDATA(\" BAS095\",TABLAS!$A$97)","v":0},null,{"$f":"+GETPIVOTDATA(\" BAS106\",TABLAS!$A$97)","v":0},null,{"$f":"+GETPIVOTDATA(\" BAS117\",TABLAS!$A$97)","v":0},null,{"$f":"+GETPIVOTDATA(\" BAS128\",TABLAS!$A$97)","v":0}]
[7,"40 a 49 años",null,{"$f":"+GETPIVOTDATA(\" BAS085\",TABLAS!$A$97)","v":0},null,{"$f":"+GETPIVOTDATA(\" BAS096\",TABLAS!$A$97)","v":0},null,{"$f":"+GETPIVOTDATA(\" BAS107\",TABLAS!$A$97)","v":0},null,{"$f":"+GETPIVOTDATA(\" BAS118\",TABLAS!$A$97)","v":0},null,{"$f":"+GETPIVOTDATA(\" BAS129\",TABLAS!$A$97)","v":0}]
[8,"50 a 59 años",null,{"$f":"+GETPIVOTDATA(\" BAS086\",TABLAS!$A$97)","v":0},null,{"$f":"+GETPIVOTDATA(\" BAS097\",TABLAS!$A$97)","v":0},null,{"$f":"+GETPIVOTDATA(\" BAS108\",TABLAS!$A$97)","v":0},null,{"$f":"+GETPIVOTDATA(\" BAS119\",TABLAS!$A$97)","v":0},null,{"$f":"+GETPIVOTDATA(\" BAS130\",TABLAS!$A$97)","v":0}]
[9,"60 a 69 años",null,{"$f":"+GETPIVOTDATA(\" BAS087\",TABLAS!$A$97)","v":0},null,{"$f":"+GETPIVOTDATA(\" BAS098\",TABLAS!$A$97)","v":0},null,{"$f":"+GETPIVOTDATA(\" BAS109\",TABLAS!$A$97)","v":0},null,{"$f":"+GETPIVOTDATA(\" BAS120\",TABLAS!$A$97)","v":0},null,{"$f":"+GETPIVOTDATA(\" BAS131\",TABLAS!$A$97)","v":0}]
[10,"70 a 79 años",null,{"$f":"+GETPIVOTDATA(\" BAS088\",TABLAS!$A$97)","v":0},null,{"$f":"+GETPIVOTDATA(\" BAS099\",TABLAS!$A$97)","v":0},null,{"$f":"+GETPIVOTDATA(\" BAS110\",TABLAS!$A$97)","v":0},null,{"$f":"+GETPIVOTDATA(\" BAS121\",TABLAS!$A$97)","v":0},null,{"$f":"+GETPIVOTDATA(\" BAS132\",TABLAS!$A$97)","v":0}]
[11,"80 a más",null,{"$f":"+GETPIVOTDATA(\" BAS089\",TABLAS!$A$97)","v":0},null,{"$f":"+GETPIVOTDATA(\" BAS100\",TABLAS!$A$97)","v":0},null,{"$f":"+GETPIVOTDATA(\" BAS111\",TABLAS!$A$97)","v":0},null,{"$f":"+GETPIVOTDATA(\" BAS122\",TABLAS!$A$97)","v":0},null,{"$f":"+GETPIVOTDATA(\" BAS133\",TABLAS!$A$97)","v":0}]
[null,"TOTAL",null,{"$f":"SUM(D239:D249)","v":0},null,{"$f":"SUM(F239:F249)","v":0},null,{"$f":"SUM(H239:H249)","v":0},null,{"$f":"SUM(J239:J249)","v":0},null,{"$f":"SUM(L239:L249)","v":0}]

{"sheet":"CIE_CPT","index":3,"n_rows":238,"n_cols":18,"rows_kept":238,"cut":false,"hidden":true,"merged":[[0,1,0,11],[1,1,1,11],[3,1,3,11],[7,5,7,7],[7,9,7,11],[10,5,10,7],[10,10,10,11],[18,2,21,2],[18,4,26,4],[22,2,24,2],[34,1,34,11],[35,1,35,11],[36,1,36,11],[12,10,12,11],[14,1,14,11],[15,1,17,1],[15,2,17,2],[15,3,17,3],[15,4,15,10],[16,4,17,4],[16,5,16,7],[16,8,16,9],[38,1,38,11],[40,1,40,11],[41,1,43,1],[41,2,43,2],[41,3,43,3],[41,4,43,4],[41,5,41,12],[42,5,42,8],[42,9,43,9],[42,10,43,10],[42,11,42,12],[58,1,58,11],[59,1,59,11],[62,1,64,1],[62,2,64,2],[62,3,64,3],[62,4,64,4],[62,5,62,10],[63,5,63,10],[101,1,103,1],[101,4,103,4],[101,5,101,10],[102,5,102,10],[121,1,121,9],[122,1,122,9],[78,1,78,11],[81,1,83,1],[81,4,83,4],[81,5,81,10],[82,5,82,10],[98,1,98,11],[224,1,225,1],[224,4,225,4],[224,5,224,6],[198,1,201,1],[198,4,201,4],[198,5,198,10],[199,5,199,10],[200,5,200,6],[200,7,200,8],[81,2,83,2],[81,3,83,3],[101,2,103,2],[101,3,103,3],[125,2,127,2],[125,3,127,3],[209,1,210,1],[209,4,210,4],[215,1,216,1],[215,4,216,4],[188,1,188,4],[153,1,154,10],[156,1,158,1],[156,4,156,7],[157,4,157,7],[177,1,178,1],[177,4,178,4],[177,7,178,8],[159,2,166,2],[183,7,183,8],[186,7,188,8],[156,2,158,2],[156,3,158,3],[177,2,178,2],[177,3,178,3],[179,2,184,2],[186,2,187,2],[125,1,127,1],[125,4,127,4],[125,5,125,10],[126,5,126,10],[138,1,141,1],[142,7,145,7],[142,9,145,9],[147,5,151,5],[147,7,151,7],[147,9,151,9],[138,2,141,2],[138,3,141,3],[142,2,145,2],[147,2,151,2],[142,5,145,5],[138,4,141,4],[138,5,138,10],[139,5,139,10],[140,5,140,6],[140,7,140,8],[224,7,224,8],[224,9,224,10],[224,11,224,12],[224,13,224,14],[215,6,216,6],[189,7,189,8],[190,7,190,8],[191,7,191,8],[192,7,192,8],[193,7,193,8],[194,7,194,8],[189,9,193,9],[186,11,186,13],[187,11,188,11],[187,12,187,13],[177,11,178,11],[159,4,166,4],[159,5,166,5],[159,6,166,6],[168,4,171,4],[168,5,171,5],[168,6,171,6],[177,9,178,9],[177,10,178,10],[186,9,188,9],[186,10,188,10],[179,9,182,9]]}
[null,"GERENCIA REGIONAL DE SALUD CUSCO"]
[null,"DIRECCION DE ESTADISTICA E INFORMATICA Y TELECOMUNICACION"]
[]
[null,"INFORME  MENSUAL  ESTRATEGIA SANITARIA DE INMUNIZACIONES"]
[]
[]
[null,"RED DE SALUD ",null,null,null,"MICRO  RED",null,null,null,"PROVINCIA"]
[null,"",null,null,null,"",null,null,null,""]
[]
[null,"ESTABLECIMIENTO",null,null,null,"DISTRITO"]
[null,"",null,null,null,"",null,null,null,"AÑO","2024"]
[]
[null,null,null,null,null,null,null,null,null,"MES","ENERO"]
[]
[null,"1.-Menores de 1 Año"]
[null,"Tipo de  Vacuna ","CIE / CPT","LAB"," POBLACION  "]
[null,null,null,null,"Población \n< 1 año Program.","Dosis Administradas ",null,null,"Protegidos ",null,"Oportunidad "]
[null,null,null,null,null,"1ra","2da","3ra.","Total","Cobert.","Nº"]
[1,"BCG 100%  A (24 Hr) ",90585,null,null,1]
[2,"BCG 100%  B (28 Dias) ",null,1,null,1]
[3,"BCG 100%  C (1M A 11M meses) ",null,null,null,1]
[4,"BCG 100%  1-5A",null,null,null,1]
[5,"Hepatitis Viral B (HVB)(*) 100% A (12Hr)",90744,null,null,1]
[6,"Hepatitis Viral B (HVB)(*) 100% A (24Hr)",null,1,null,1]
[7,"Hepatitis Viral B (HVB)(*) 100%  a menores de 7  dias",null,null,null,1]
[8,"IPV 2 Y  4   y 6 Meses",90713,null,null,1,2,3]
[11,"Pentavalente (HIB+Titranrix) (**) 100%",90722,null,null,1,2,3]
[12,"dt (Pediátrico)  1% (Reacción adversa  a Penta)",90702,null,null,null,2,3]
[13,"HVB  1% (Reacción adversa  a Penta)",90744,null,null,null,2,3]
[14,"HiB  1% (Reacción adversa  a Penta)",90648,null,null,null,2,3]
[15,"Rotavirus  100% ",90681,null,null,1,2]
[16,"Neumococo (heptavalente) (**) 100%",90670,null,null,1,2]
[17,"Influenza solo Pediatrica  100% (***)",90657,null,null,1,2]
[null,"poblacion en  riesgo IPV  2,4 Y  6 MESES"]
[]
[]
[]
[]
[]
[]
[null,"2.- Niños de 1  año:"]
[null,"Tipo de Vacuna ","CIE / CPT","LAB","Población\n1 año Program."," POBLACION "]
[null,null,null,null,null,"   DOSIS ADMINISTRADAS",null,null,null,"PROT","Cob. \n(%)","Oportunidad"]
[null,null,null,null,null,"1ra.","2da ","3 era. "," DOSIS UNICA",null,null,"Nº","Acum. "]
[1,"Neumococo  3° Dosis 100%",90670,null,null,null,null,3]
[2,"VARICELA",90716,null,null,null,null,null,"DU"]
[3,"Sarampión, Paperas  Rubéola (SPR) * 100%",90707,null,null,1,2]
[4,"Antiamarilica (AA) 15 meses)100%",90717,null,null,null,null,null,"DU"]
[5,"Hepatitis Viral A (HVA)  (15 meses) 100%","90633.01",null,null,null,null,null,"DU",null,null,null,null,null,null,null,"falta codigo"]
[6,"DPT 1er Refuerzo (18 meses) 100%",90701,null,null,1]
[7,"IPV (APO) Refuerzo (18 meses)  revisar  DA - DDA",90713,null,null,1]
[8,"Influenza 100%",90657,null,null,1,null,null,"DU"]
[9,"Pentavalente  5%",90722,null,null,1,2,3]
[10,"IPV ",90713,null,null,1,2,3]
[11,"Neumococo  1° y 2° dosis  5%  no  Vac Anteriormente",90670,null,null,1,2]
[13,"dt (Pediátrico)  1% (Reacción adversa  a Penta)",90702,null,null,null,2,3]
[14,"HVB  1% (Reacción adversa  a Penta)",90744,null,null,null,2,3]
[15,"HiB  1% (Reacción adversa  a Penta)",90648,null,null,null,2,3]
[]
[]
[]
[null,"3.- Niños de 2 años :"]
[null,"Tipo de Vacuna ","CIE / CPT","LAB","Población\n2 años Program.","POBLACION "]
[null,null,null,null,null,"   DOSIS APLICADAS"]
[null,null,null,null,null,"1ra.","2da.","3 era.","DU","PROT","Cob. (%)"]
[1,"Influenza  100%   ",{"$f":"+C52","v":90657},null,null,null,null,null,"DU"]
[2,"Neumococo 5% (Comorbilidad)",{"$f":"+C55","v":90670},null,null,1]
[3,"SPR",{"$f":"+C47","v":90707},null,null,1,2]
[4,"VARICELA",{"$f":"+C46","v":90716},null,null,null,null,null,"DU"]
[5,"Antiamarilica (AA) 100%",{"$f":"+C48","v":90717},null,null,null,null,null,"DU"]
[6,"DPT 1er Refuerzo (18 meses) 100%",{"$f":"+C50","v":90701},null,null,1]
[7,"IPV (APO) Refuerzo (18 meses)",{"$f":"+C51","v":90713},null,null,1]
[8,"Pentavalente 5%",{"$f":"+C53","v":90722},null,null,1,2,3]
[9,"IPV ",{"$f":"+C54","v":90713},null,null,1,2,3]
[10,"Neumococo  1° y 2° dosis  5%  no  Vacunados Anteriormente",{"$f":"+C55","v":90670},null,null,1,2]
[11,"dt (Pediátrico)  1% (Reacción adversa  a Penta)",{"$f":"+C56","v":90702},null,null,null,2,3]
[12,"HVB  1% (Reacción adversa  a Penta)",{"$f":"+C57","v":90744},null,null,null,2,3]
[13,"HiB  1% (Reacción adversa  a Penta)",90648,null,null,null,2,3]
[]
[]
[null,"4.- Niños de 3  AÑOS años: "]
[null,"Tipo de Vacuna ","CIE / CPT","LAB","Población\n3 años Program."," POBLACION "]
[null,null,null,null,null,"   DOSIS APLICADAS",null,null,null,null,null,null,null,null,null,null,"2 años"]
[null,null,null,null,null,"1ra","2da","3 era.","DU","PROT","Cob. (%)",null,null,null,null,null,"Influenza  100%   "]
[1,"Influenza  5% (Comorbilidad)",{"$f":"+C66","v":90657},null,null,null,null,null,"DU",null,null,null,null,null,null,null,"Neumococo 5% (Comorbilidad)"]
[2,"Neumococo 5% (Comorbilidad)",{"$f":"+C67","v":90670},null,null,1,null,null,null,null,null,null,null,null,null,null,"SPR"]
[3,"SPR",90707,null,null,1,2,null,null,null,null,null,null,null,null,null,"VARICELA"]
[4,"VARICELA",90716,null,null,null,null,null,"DU",null,null,null,null,null,null,null,"Antiamarilica (AA) 100%"]
[5,"Antiamarilica (AA) 100%",90717,null,null,null,null,null,"DU",null,null,null,null,null,null,null,"DPT 1er Refuerzo (18 meses) 100%"]
[6,"DPT 1er Refuerzo (18 meses) 100%",90701,null,null,1,null,null,null,null,null,null,null,null,null,null,"APO Refuerzo (18 meses)"]
[7,"IPV (APO) Refuerzo (18 meses)",90713,null,null,1,null,null,null,null,null,null,null,null,null,null,"Pentavalente 5%"]
[8,"Pentavalente 5%",90722,null,null,1,2,3,null,null,null,null,null,null,null,null,"IPV "]
[9,"IPV ",90713,null,null,1,2,3,null,null,null,null,null,null,null,null,"Neumococo  1° y 2° dosis  5%  no  Vacunados Anteriormente"]
[10,"Neumococo  1° y 2° dosis  5%  No Vac Anteriormente",90670,null,null,1,2,null,null,null,null,null,null,null,null,null,"dt (Pediátrico)  1% (Reacción adversa  a Penta)"]
[11,"dt (Pediátrico)  1% (Reacción adversa  a Penta)",90702,null,null,null,2,3,null,null,null,null,null,null,null,null,"HVB  1% (Reacción adversa  a Penta)"]
[12,"HVB  1% (Reacción adversa  a Penta)",90744,null,null,null,2,3,null,null,null,null,null,null,null,null,"HiB  1% (Reacción adversa  a Penta)"]
[13,"HiB  1% (Reacción adversa  a Penta)",90648,null,null,null,2,3]
[]
[null,"(*) El PpR considera \"niño  de tres años con vacuna completa\" aquel niño que no fue vacunado oportunamente y se le protege con 3 dosis de penta+ 3 dosis de APO+1 dosis de SPR + 2 dosis de neumococo + 1 dosis de vacuna  contra la influenza. Para fines de monitoreo  se realizara con el avance de  vacuna contra el neumococo."]
[]
[null,"5. Niños de  4  AÑOS "]
[null,"            Tipo de Vacuna ","CIE / CPT","LAB","Poblaciòn\n4 años Program.","POBLACION "]
[null,null,null,null,null,"   DOSIS APLICADAS"]
[null,null,null,null,null,"1ra","2da","3 era.","DU","Mensual","Cob. (%)"]
[1,"DPT 2do Refuerzo 100%",90701,null,null,null,2,null,null,null,null,null,null,null,null,null,"2 años"]
[2,"Antipolio 2do Refuerzo 100%",90712,null,null,null,2,null,null,null,null,null,null,null,null,null,"Influenza  100%   "]
[3,"Influenza  5%",90658,null,null,null,null,null,"DU",null,null,null,null,null,null,null,"Neumococo 5% (Comorbilidad)"]
[4,"Neumococo 5%",90670,null,null,1,null,null,null,null,null,null,null,null,null,null,"SPR"]
[5,"SPR",90707,null,null,1,2,null,null,null,null,null,null,null,null,null,"VARICELA"]
[6,"VARICELA  niiños no recibieron oportunamente vacuna",90716,null,null,null,null,null,"DU",null,null,null,null,null,null,null,"Antiamarilica (AA) 100%"]
[7,"Antiamarilica (AA) 100%",90717,null,null,null,null,null,"DU",null,null,null,null,null,null,null,"DPT 1er Refuerzo (18 meses) 100%"]
[8,"DPT 1er Refuerzo (18 meses) 100%",90701,null,null,1,null,null,null,null,null,null,null,null,null,null,"APO Refuerzo (18 meses)"]
[9,"IPV (APO)  Refuerzo (18 meses)",{"$f":"+C91","v":90713},null,null,1,null,null,null,null,null,null,null,null,null,null,"Pentavalente 5%"]
[10,"Pentavalente 5%",90723,null,null,1,2,3,null,null,null,null,null,null,null,null,"IPV "]
[11,"IPV ",{"$f":"+C93","v":90713},null,null,1,2,3,null,null,null,null,null,null,null,null,"Neumococo  1° y 2° dosis  5%  no  Vacunados Anteriormente"]
[12,"Neumococo  1° y 2° dosis  5%  No Vac Anteriormente",{"$f":"+C94","v":90670},null,null,1,2,null,null,null,null,null,null,null,null,null,"dt (Pediátrico)  1% (Reacción adversa  a Penta)"]
[13,"dt (Pediátrico)  1% (Reacción adversa  a Penta)",{"$f":"+C95","v":90702},null,null,null,2,3,null,null,null,null,null,null,null,null,"HVB  1% (Reacción adversa  a Penta)"]
[14,"HVB  1% (Reacción adversa  a Penta)",{"$f":"+C96","v":90744},null,null,null,2,3,null,null,null,null,null,null,null,null,"HiB  1% (Reacción adversa  a Penta)"]
[15,"HiB  1% (Reacción adversa  a Penta)",90648,null,null,null,2,3]
[16,"Antipolio ",null,null,0,null,null,0,null,0,{"$error":"#DIV/0!"}]
[]
[null,"* Una dosis por única vez"]
[null,"El PpR considera \"niño  de cuatro años con vacuna completa\" aquel niño que fue vacunado con 1 dosis de influenza + 1 dosis de vacuna Antiamarilica + 1 dosis de refuerzo APO y 1 dosis de vacuna. Para fines de monitoreo  se realizará con el avance del segundo refuerzo DPT"]
[]
[null,"7. Niños de  05 a 11 AÑOS"]
[null,"            Tipo de Vacuna ","CIE / CPT","LAB","Poblaciòn\n5-11 años Program.","POBLACION "]
[null,null,null,null,null,"   DOSIS APLICADAS"]
[null,null,null,null,null,"1ra","2da","3 era.","DU","PROT","Cob. (%)",null,null,null,null,null,"Neumococo (heptavalente) 5%"]
[1,"Neumococo 1% (con comorbilidades) ",90670,null,null,1,null,null,null,null,null,null,null,null,null,null,"Influenza  5% (***)"]
[2,"Influenza",90658,null,null,null,null,null,"DU",null,null,null,null,null,null,null,"Pentavalente (hasta los 7 años)"]
[3,"Pentavalente (5-7 años)",90722,null,null,1,2,3,null,null,null,null,null,null,null,null,"DPT (hasta los 7 años)"]
[4,"DPT (5-7 años) 1%",90701,null,null,null,2,null,null,null,null,null,null,null,null,null,"SPR "]
[5,"SPR (población en riesgo) 2%",90707,null,null,null,null,null,"DU",null,null,null,null,null,null,null,90707]
[6,"VPH (virus del  Papilo,ma humano) 9-13A",90649,null,null,null,null,null,"DU",null,null,null,null,null,null,null,"90649  001 - DU","solo debe ser 9 a 13 años"]
[7,"VPH (virus del  Papilo,ma humano) 14-18A",90649]
[8,"dT adulto (7 a 11 años) (Si no recibio la vacuna previamente) 0.005%",90714,null,null,1,2,3]
[]
[null,"9.- MUJERES EN EDAD FERTIL DE 10 A 49 AÑOS:  DT ADULTO"]
[null,"Grupo","CIE / CPT","LAB","Población Program.\nSegún  Grupo","POBLACION"]
[null,null,null,null,null,"DOSIS APLICADAS"]
[null,null,null,null,null,"DT(A) 1",null," DT(A)2",null," DT(A)3"]
[null,null,null,null,null,"Mensual","Cob.(%)","Mensual","Cob.(%)","Mensual","Cob.(%)"]
[1,"No Gestantes 10  a 11 años 15%",90714,null,null,1,null,2,null,3]
[2,"No Gestantes 12 a 17 años 15%"]
[3,"No Gestantes  18 a 29 años 15%"]
[4,"No Gestantes  30 a 49 años 15%"]
[null,"Total Mujeres"]
[5,"Niños 10 a 11 años ",90714,null,null,1,null,2,null,3]
[6,"Adolescente 12 a 17 años "]
[7,"Joven  18 a 29 años "]
[8,"Adulto 30 a 59 años   "]
[9,"Adulto mayor de 60 a más"]
[null,"Total Varoness"]
[null,"(*) El PpR considera \"Atencion de Gestante reenfocada\" aquella gestante que ademas de sus controles recibe  su vacuna antitetanica. Se vacunara  con vacuna dt adulto lo mas precozmente posible no existiendo contraindicacion con la edad gestacional, administrando la 1ª dosis  en la primera consulta "]
[]
[null,"9.- VACUNA HEPATITIS VIRAL B: (HvB)"]
[null,"GRUPO POBLACIONAL","CIE / CPT","LAB"," POBLACION"]
[null,null,null,null,"DOSIS APLICADAS"]
[null,null,null,null,"1ra","2da","3ra","Total"]
[1,"Trabajadores de  Salud  ",90746,"ST",1,2,3]
[2,"Trabajadores  Sexuales ",null,"TS"]
[3,"HSH",null,"HSH"]
[4,"Politransfundidos"]
[5,"Privados de Libertad",null,"PPL"]
[6,"Fuerzas Policiales  y Militares",null,"M,PNP"]
[7,"Cruz Roja, Defensa Civil, Bomberos",null,"BOM,DCI"]
[8,"Estudiantes de Areas de Salud ",null,"EST"]
[null,"TOTAL GRUPOS DE RIESGO "]
[9,"Niños de 5-11 años",90744,null,1,2,3]
[10,"Adolescentes de 12 a 17 años","9074_"]
[11,"Joven  18 a 29 años",90746]
[12,"Adulto 30 a 59 años",90746]
[null,"TOTAL"]
[null,"Hepatitis \"B\"",null,null,1115,667,430,2212]
[]
[]
[null,"10.- VACUNA  CONTRA LA INFLUENZA ESTACIONAL",null,null,null,null,null,"10.- VACUNA  NEUMOCOCO"]
[null,"GRUPO POBLACIONAL","CIE / CPT","LAB","Poblaciòn \nProgramada","PROTEGIDOS",null,"GRUPO POBLACIONAL",null,"CIE / CPT","LAB","Poblaciòn \nProgramada","PROTEGIDOS"]
[null,null,null,null,null,"1ra",null,null,null,null,null,null,"1ra"]
[1,"Niños de 5-11 años",null,null,null,null,9,"Adolescentes de 12-17años"]
[2,"Adolescentes de 12-17años",null,null,null,null,10,"Joven de 18-29 años"]
[3,"Joven de 18-29 años",null,null,null,null,11,"Adulto 30 a 59 años"]
[4,"Adulto 30 a 49 años",null,null,null,null,12,"Adulto Mayor 60 años a mas "]
[5,"Adulto 50 a 59 años",null,null,null,null,null,"TOTAL"]
[6,"Adulto Mayor 60 años a mas "]
[null,"TOTAL",null,null,null,null,null,"10- VACUNA ANTIAMARILICA:(AA)"]
[7,"Trabajadores de  Salud  ",null,null,null,null,null,"Grupo  de Edad",null,"CIE / CPT","LAB","POBLACION AUTOCTONO"]
[8,"Persona  Privadas de su  Libertad",null,null,null,null,null,null,null,null,null," Pob.  Prog.","DOSIS APLICADAS"]
[null,"TOTAL",null,null,null,null,null,null,null,null,null,null,"Mensual","Cob.(%)"]
[null,null,null,null,null,null,13,"De 2 a 4 Años"]
[null,null,null,null,null,null,14,"De 5 a 11 Años"]
[null,null,null,null,null,null,15,"De 12 a 17 Años"]
[null,null,null,null,null,null,16,"De 18 a 29 Años"]
[null,null,null,null,null,null,17,"De 30 a 59 Años"]
[null,null,null,null,null,null,null,"TOTAL"]
[]
[null,"G E S T A N T E"]
[null,"9.- MUJERES EN EDAD FERTIL DE 10 A 49 AÑOS:  DT ADULTO - GESTANTE"]
[null,"Grupo",null,null,"Población Program.\nSegún  Grupo","POBLACION"]
[null,null,null,null,null,"DOSIS APLICADAS"]
[null,null,null,null,null,"DT(A) 1",null," DT(A)2",null," DT(A)3"]
[null,null,null,null,null,"Mensual","Cob.(%)","Mensual","Cob.(%)","Mensual","Cob.(%)"]
[1,"Gestantes 10  a 11 años 100%"]
[2,"Gestantes 12 a 17 años 100%"]
[3,"Gestantes  18 a 29 años 100%"]
[4,"Gestantes  30 a 49 años 100%"]
[null,"TOT GEST"]
[]
[null,"10.- VACUNA  CONTRA LA INFLUENZA ESTACIONAL  -  GESTANTE"]
[null,"GRUPO POBLACIONAL",null,null,"Poblaciòn \nProgramada","PROTEGIDOS"]
[null,null,null,null,null,"1ra"]
[5,"Gestantes",null,null,null,0]
[6,"Puerperas",null,null,null,0]
[]
[null,"10.- VACUNA  DTPA GESTANTE"]
[null,"GRUPO POBLACIONAL",null,null,"Poblaciòn \nProgramada","PROTEGIDOS","COB."]
[null,null,null,null,null,"1ra"]
[7," 10-11años",null,null,null,0]
[8," 12-17años",null,null,null,47]
[9," 18-29años",null,null,null,340]
[10," 30-59años",null,null,null,225]
[null,"TOTAL",null,null,null,612]
[]
[null,"11- VACUNA CONTRA EL COVID-19"]
[null,"GRUPO ETARIO",null,null,"Población \nProgramada","1ra",null,"2da",null,"3ra",null,"4to",null,"DOSIS BIVALENTE"]
[null,null,null,null,null,"N","%","N","%","N","%","N",null,"N"]
[1,"06 a 11 meses",null,null,null,126,null,47,null,0,null,0,null,0]
[2,"01 a 04 años",null,null,null,264,null,152,null,0,null,0,null,46]
[3,"05 a 11 años",null,null,null,87,null,6,null,0,null,0,null,170]
[4,"12 a 17 años",null,null,null,14,null,3,null,3,null,0,null,229]
[5,"18 a 29 años",null,null,null,26,null,9,null,0,null,0,null,1181]
[6,"30 a 39 años",null,null,null,15,null,2,null,0,null,0,null,808]
[7,"40 a 49 años",null,null,null,10,null,0,null,0,null,0,null,670]
[8,"50 a 59 años",null,null,null,6,null,1,null,0,null,0,null,521]
[9,"60 a 69 años",null,null,null,0,null,0,null,0,null,0,null,572]
[10,"70 a 79 años",null,null,null,3,null,1,null,0,null,0,null,416]
[11,"80 a más",null,null,null,3,null,0,null,0,null,0,null,145]
[null,"TOTAL",null,null,null,554,null,221,null,3,null,0,null,4758]

{"sheet":"PAI_MENOR_1A","index":4,"n_rows":10,"n_cols":28,"rows_kept":10,"cut":false,"hidden":false,"merged":[]}
[]
["ANNO","(Todas)"]
[]
[null,"Valores"]
["MES"," MetaRn"," MetaM1"," 1.BCG_24_H"," 2.BCG_28_D"," 3.BCG_1M_11M"," 4BCG_1_5A"," 5.HVB_12Hr"," 6.HVB_24Hr"," 7.HVB_M7_D"," 8.1_IPV_2_6M"," 8.2_IPV_2_6M"," 8.3_IPV_2_6M"," 11.1_Penta"," 11.2_Penta"," 11.3_Penta"," 12.2_DT"," 12.3_DT"," 13.2_HVB"," 13.3_HVB"," 14.2_HiB"," 14.3_HiB"," 15.1_Rotavirus"," 15.2_Rotavirus"," 16.1_Neumococo"," 16.2_Neumococo"," 17.1_Influenza"," 17.2_Influenza"]
[1,0,0,113,5,0,1,113,113,4,121,140,107,120,139,107,0,0,0,0,4,0,121,140,121,139,9,13]
[0,21803,21123,0,0,0,0,0,0,0,0,0,0,0,0,0,0,0,0,0,0,0,0,0,0,0,0,0]
[2,0,0,107,3,3,0,108,108,1,130,131,100,132,129,101,0,1,0,0,0,0,128,130,132,130,1,0]
[3,0,0,108,9,3,0,109,109,4,136,119,141,135,119,137,0,1,0,0,0,0,134,116,134,119,2,1]
["Total general",21803,21123,328,17,6,1,330,330,9,387,390,348,387,387,345,0,2,0,0,4,0,383,386,387,388,12,14]

{"sheet":"PAI_1A","index":5,"n_rows":10,"n_cols":26,"rows_kept":10,"cut":false,"hidden":false,"merged":[]}
[]
["ANNO","(Todas)"]
[]
[null,"Valores"]
["MES"," Meta"," 1.3_NEU"," 2.DU_VARIC"," 3.1_SPR"," 3.2_SPR"," 4.DU_AMA"," 5.DU_HVA"," 6.1_DPT"," 7.1_IPV_APO"," 8.1_INFLU"," 8.DU_INFLU"," 9.1_PENTA"," 9.2_PENTA"," 9.3_PENTA"," 10.1_IPV"," 10.2_IPV"," 10.3_IPV"," 11.1_NEUM"," 11.2_NEUM"," 13.2_DTP"," 13.3_DTP"," 14.2_HVB"," 14.3_HVB"," 15.2_HIB"," 15.3_HIB"]
[1,0,138,138,137,149,157,152,152,144,6,0,0,1,1,4,2,2,0,1,0,0,0,0,0,0]
[0,20581,0,0,0,0,0,0,0,0,0,0,0,0,0,0,0,0,0,0,0,0,0,0,0,0]
[2,0,110,110,114,135,134,129,127,122,0,0,0,1,2,2,1,5,1,3,0,0,0,0,0,0]
[3,0,128,107,128,131,139,131,128,123,1,0,0,1,3,2,6,2,1,2,0,0,1,0,0,0]
["Total general",20581,376,355,379,415,430,412,407,389,7,0,0,3,6,8,9,9,2,6,0,0,1,0,0,0]

{"sheet":"PAI_2A","index":6,"n_rows":13,"n_cols":24,"rows_kept":13,"cut":false,"hidden":false,"merged":[]}
["ANNO","(Todas)"]
["MES","(Todas)"]
[]
[null,"Valores"]
["DESC_RED"," Meta"," 1.DU_INFLU"," 2.1_NEUM"," 3.1_SPR"," 3.2_SPR"," 4.DU_VARIC"," 5.DU_AMA"," 6.1_DPT"," 7.1_IPV_APO"," 8.1_PENTA"," 8.2_PENTA"," 8.3_PENTA"," 9.1_IPV"," 9.2_IPV"," 9.3_IPV"," 10.1_NEUM_NVA"," 10.2_NEUM_NVA"," 11.1_DTP"," 11.2_DTP"," 12.1_HVB"," 12.2_HVB"," 13.1_HIB"," 13.2_HIB"]
["CANAS-CANCHIS-ESPINAR",3131,0,0,0,0,0,0,0,0,0,0,0,0,0,0,0,0,0,0,0,0,0,0]
["CHUMBIVILCAS",1159,0,0,0,0,0,0,0,0,0,0,0,0,0,0,0,0,0,0,0,0,0,0]
["CUSCO NORTE",8210,0,0,0,0,0,0,0,0,0,0,0,0,0,0,0,0,0,0,0,0,0,0]
["CUSCO SUR",6219,0,0,0,0,0,0,0,0,0,0,0,0,0,0,0,0,0,0,0,0,0,0]
["KIMBIRI PICHARI",1604,0,0,0,0,0,0,0,0,0,0,0,0,0,0,0,0,0,0,0,0,0,0]
["LA CONVENCION",2093,5,0,6,20,6,11,17,13,1,1,4,3,3,2,0,1,0,0,0,0,0,0]
["NO PERTENECE A NINGUNA RED",0,0,0,0,0,0,0,0,0,0,0,0,0,0,0,0,0,0,0,0,0,0,0]
["Total general",22416,5,0,6,20,6,11,17,13,1,1,4,3,3,2,0,1,0,0,0,0,0,0]

{"sheet":"PAI_3A","index":7,"n_rows":13,"n_cols":24,"rows_kept":13,"cut":false,"hidden":false,"merged":[]}
["ANNO","(Todas)"]
["MES","(Todas)"]
[]
[null,"Valores"]
["DESC_RED"," Meta"," 1.DU_INFLU"," 2.1_NEUM"," 3.1_SPR"," 3.2_SPR"," 4.DU_VARIC"," 5.DU_AMA"," 6.1_DPT"," 7.1_APO(IPV)"," 8.1_PENTA"," 8.2_PENTA"," 8.3_PENTA"," 9.1_IPV"," 9.2_IPV"," 9.3_IPV"," 10.1_NEUM_NVA"," 10.2_NEUM_NVA"," 11.1_DTp"," 11.2_DTp"," 12.1_HVB"," 12.2_HVB"," 13.1_HIB"," 13.2_HIB"]
["CANAS-CANCHIS-ESPINAR",391,0,0,0,0,0,0,0,0,0,0,0,0,0,0,0,0,0,0,0,0,0,0]
["CHUMBIVILCAS",236,0,0,0,0,0,0,0,0,0,0,0,0,0,0,0,0,0,0,0,0,0,0]
["CUSCO NORTE",1069,0,0,0,0,0,0,0,0,0,0,0,0,0,0,0,0,0,0,0,0,0,0]
["CUSCO SUR",739,0,0,0,0,0,0,0,0,0,0,0,0,0,0,0,0,0,0,0,0,0,0]
["KIMBIRI PICHARI",161,0,0,0,0,0,0,0,0,0,0,0,0,0,0,0,0,0,0,0,0,0,0]
["LA CONVENCION",233,6,4,2,8,5,6,10,4,0,0,5,1,0,0,0,0,0,0,0,0,0,0]
["NO PERTENECE A NINGUNA RED",0,0,0,0,0,0,0,0,0,0,0,0,0,0,0,0,0,0,0,0,0,0,0]
["Total general",2829,6,4,2,8,5,6,10,4,0,0,5,1,0,0,0,0,0,0,0,0,0,0]

{"sheet":"PAI_4A","index":8,"n_rows":10,"n_cols":26,"rows_kept":10,"cut":false,"hidden":false,"merged":[]}
[]
["ANNO","(Todas)"]
[]
[null,"Valores"]
["MES"," Meta"," 1.2R_DPT"," 2.2R_ANTIPOLIO"," 3.DU_INFLU"," 4.1_NEUMO"," 5.1_SPR"," 5.2_SPR"," 6.DU_VARICELA"," 7.DU_AMA"," 8.1R_DPT"," 9.1R_APO"," 10.1_PENTA"," 10.2_PENTA"," 10.3_PENTA"," 11.1_IPV"," 11.2_IPV"," 11.3_IPV"," 12.1_NEUMO_NVA"," 12.2_NEUMO_NVA"," 13.2_DTp"," 13.3_DTP"," 14.2_HVB"," 14.3_HVB"," 15.2_HiB"," 15.3_HiB"]
[1,0,148,128,3,0,2,0,24,1,148,6,0,0,0,0,0,0,0,0,0,0,0,0,0,0]
[0,23233,0,0,0,0,0,0,0,0,0,0,0,0,0,0,0,0,0,0,0,0,0,0,0,0]
[2,0,128,111,1,0,1,2,16,2,128,4,0,0,0,0,0,1,0,0,0,0,0,0,0,0]
[3,0,133,117,1,1,1,2,1,2,133,6,0,0,0,2,0,1,1,0,0,0,0,0,0,0]
["Total general",23233,409,356,5,1,4,4,41,5,409,16,0,0,0,2,0,2,1,0,0,0,0,0,0,0]

{"sheet":"PAI_511A","index":9,"n_rows":10,"n_cols":12,"rows_kept":10,"cut":false,"hidden":false,"merged":[]}
[]
["ANNO","(Todas)"]
[]
[null,"Valores"]
["MES"," Meta"," 1.1_NEUMOCOCO"," 2.1_INFLUENZA"," 3.1_PENTA"," 3.2_PENTA"," 3.3_PENTA"," 4.2_DPT"," 5.1_SPR"," 6.DU_VPH_913"," 7.DU_VPH_1418"," 8.3_DTA"]
[1,0,1,0,1,0,0,3,1,5,8,0]
[0,0,0,0,0,0,0,0,0,0,0,0]
[2,0,0,0,0,0,0,8,0,288,404,0]
[3,0,0,0,0,1,0,5,0,113,57,1]
["Total general",0,1,0,1,1,0,16,1,406,469,1]

{"sheet":"PAI_1049","index":10,"n_rows":12,"n_cols":30,"rows_kept":12,"cut":false,"hidden":false,"merged":[]}
["ANNO","(Todas)"]
["MES","(Todas)"]
[]
["Etiquetas de fila"," MetaG"," MetaV"," 1.1_DT_NGe_1011"," 1.2_DT_NGe_1011"," 1.3_DT_NGe_1011"," 2.1_DT_NGe_1217"," 2.2_DT_NGe_1217"," 2.3_DT_NGe_1217"," 3.1_DT_NGe_1829"," 3.2_DT_NGe_1829"," 3.3_DT_NGe_1829"," 4.1_DT_NGe_3049"," 4.2_DT_NGe_3049"," 4.3_DT_NGe_3049"," 5.1_DT_Varon_1011"," 5.2_DT_Varon_1011"," 5.3_DT_Varon_1011"," 6.1_DT_Varon_1217"," 6.2_DT_Varon_1217"," 6.3_DT_Varon_1217"," 7.1_DT_Varon_1829"," 7.2_DT_Varon_1829"," 7.3_DT_Varon_1829"," 8.1_DT_Varon_3059"," 8.2_DT_Varon_3059"," 8.3_DT_Varon_3059"," 9.1_DT_Varon_m60A"," 9.2_DT_Varon_m60A"," 9.3_DT_Varon_M60A"]
["CANAS-CANCHIS-ESPINAR",0,0,0,0,0,0,0,0,0,0,0,0,0,0,0,0,0,0,0,0,0,0,0,0,0,0,0,0,0]
["CHUMBIVILCAS",0,0,0,0,0,0,0,0,0,0,0,0,0,0,0,0,0,0,0,0,0,0,0,0,0,0,0,0,0]
["CUSCO NORTE",0,0,0,0,0,0,0,0,0,0,0,0,0,0,0,0,0,0,0,0,0,0,0,0,0,0,0,0,0]
["CUSCO SUR",0,0,0,0,0,0,0,0,0,0,0,0,0,0,0,0,0,0,0,0,0,0,0,0,0,0,0,0,0]
["KIMBIRI PICHARI",0,0,0,0,0,0,0,0,0,0,0,0,0,0,0,0,0,0,0,0,0,0,0,0,0,0,0,0,0]
["LA CONVENCION",0,0,2,0,1,32,12,6,76,55,30,102,62,36,7,6,0,35,4,4,300,194,77,198,132,90,28,11,6]
["NO PERTENECE A NINGUNA RED",0,0,0,0,0,0,0,0,0,0,0,0,0,0,0,0,0,0,0,0,0,0,0,0,0,0,0,0,0]
["Total general",0,0,2,0,1,32,12,6,76,55,30,102,62,36,7,6,0,35,4,4,300,194,77,198,132,90,28,11,6]

{"sheet":"HVB_VARIOS","index":11,"n_rows":13,"n_cols":35,"rows_kept":13,"cut":false,"hidden":false,"merged":[]}
["ANNO","(Todas)"]
["MES","(Todas)"]
[]
[null,"Valores"]
["DESC_RED"," Meta"," 1.1_HvB_ST"," 1.2_HvB_ST"," 1.3_HvB_ST"," 2.1_HvB_TS"," 2.2_HvB_TS"," 2.3_HvB_TS"," 3.1_HvB_HSH"," 3.2_HvB_HSH"," 3.3_HvB_HSH"," 5.1_HvB_PPL"," 5.2_HvB_PPL"," 5.3_HvB_PPL"," 6.1_HvB_FPM"," 6.2_HvB_FPM"," 6.3_HvB_FPM"," 7.1_HvB_CRB"," 7.2_HvB_CRB"," 7.3_HvB_CRB"," 8.1_HvB_ES"," 8.2_HvB_ES"," 8.3_HvB_ES"," 9.1_HvB_0511A"," 9.2_HvB_0511A"," 9.3_HvB_0511A"," 10.1_HvB_1217A"," 10.2_HvB_1217A"," 10.3_HvB_1217A"," 11.1_HvB_1829A"," 11.2_HvB_1829A"," 11.3_HvB_1829A"," 12.1_HvB_3059A"," 12.2_HvB_3059A"," 12.3_HvB_3059A"]
["CANAS-CANCHIS-ESPINAR",0,0,0,0,0,0,0,0,0,0,0,0,0,0,0,0,0,0,0,0,0,0,0,0,0,0,0,0,0,0,0,0,0,0]
["CHUMBIVILCAS",0,0,0,0,0,0,0,0,0,0,0,0,0,0,0,0,0,0,0,0,0,0,0,0,0,0,0,0,0,0,0,0,0,0]
["CUSCO NORTE",0,0,0,0,0,0,0,0,0,0,0,0,0,0,0,0,0,0,0,0,0,0,0,0,0,0,0,0,0,0,0,0,0,0]
["CUSCO SUR",0,0,0,0,0,0,0,0,0,0,0,0,0,0,0,0,0,0,0,0,0,0,0,0,0,0,0,0,0,0,0,0,0,0]
["KIMBIRI PICHARI",0,0,0,0,0,0,0,0,0,0,0,0,0,0,0,0,0,0,0,0,0,0,0,0,0,0,0,0,0,0,0,0,0,0]
["LA CONVENCION",0,4,5,5,0,0,0,0,0,0,0,0,0,0,8,3,0,8,0,1,0,0,0,0,0,59,16,6,443,313,167,308,205,137]
["NO PERTENECE A NINGUNA RED",0,0,0,0,0,0,0,0,0,0,0,0,0,0,0,0,0,0,0,0,0,0,0,0,0,0,0,0,0,0,0,0,0,0]
["Total general",0,4,5,5,0,0,0,0,0,0,0,0,0,0,8,3,0,8,0,1,0,0,0,0,0,59,16,6,443,313,167,308,205,137]

{"sheet":"INFLU_NEU_AMA","index":12,"n_rows":10,"n_cols":21,"rows_kept":10,"cut":false,"hidden":false,"merged":[]}
[]
["ANNO","(Todas)"]
[]
[null,"Valores"]
["MES"," MetaI"," MetaN"," MetaA"," 1.1_Influ_0511A"," 2.1_Influ_1217A"," 3.1_Influ_1829A"," 4.1_Influ_3049A"," 5.1_Influ_5059A"," 6.1_Influ_6099A"," 7.1_Influ_TS"," 8.1_Influ_PPL"," 9.1_Neumo_1217A"," 10.1_Neumo_1829A"," 11.1_Neumo_3059A"," 12.1_Neumo_6099A"," 13.1_AMA_0204A"," 14.1_AMA_0511A"," 15.1_AMA_1217A"," 16.1_AMA_1829A"," 17.1_AMA_3059A"]
[1,0,0,0,0,0,1,0,0,0,0,0,0,5,14,32,10,3,2,137,87]
[0,0,0,0,0,0,0,0,0,0,0,0,0,0,0,0,0,0,0,0,0]
[2,0,0,0,0,0,0,0,0,0,0,0,0,1,6,55,5,3,11,134,104]
[3,0,0,0,0,0,0,0,0,0,0,0,0,5,8,25,7,5,39,149,130]
["Total general",0,0,0,0,0,1,0,0,0,0,0,0,11,28,112,22,11,52,420,321]

{"sheet":"GESTANTE","index":13,"n_rows":11,"n_cols":21,"rows_kept":11,"cut":false,"hidden":false,"merged":[]}
[]
["ANNO","(Todas)"]
[]
[null,"Valores"]
["MES"," Meta"," 1.1_DT_Ges_1011"," 1.2_DT_Ges_1011"," 1.3_DT_Ges_1011"," 2.1_DT_Ges_1217"," 2.2_DT_Ges_1217"," 2.3_DT_Ges_1217"," 3.1_DT_Ges_1829"," 3.2_DT_Ges_1829"," 3.3_DT_Ges_1829"," 4.1_DT_Ges_3049"," 4.2_DT_Ges_3049"," 4.3_DT_Ges_3049"," 5.1_Influ_Ges"," 6.1_Influ_Puerp"," 7.1_DTPAGES_1011A"," 8.1_DTPAGES_1217A"," 9.1_DTPAGES_1829A"," 10.1_DTPAGES_3059A"]
[1,0,0,0,0,0,0,0,3,5,1,2,3,1,0,0,0,8,56,48,{"$f":"SUM(Q6:T6)","v":112}]
[0,0,0,0,0,0,0,0,0,0,0,0,0,0,0,0,0,0,0,0,{"$f":"SUM(Q7:T7)","v":0}]
[2,0,0,0,0,1,0,0,4,1,4,3,0,0,0,0,0,6,61,34,101]
[3,0,0,0,0,2,0,0,3,0,0,1,1,0,0,0,0,12,59,42,113]
["Total general",0,0,0,0,3,0,0,10,6,5,6,4,1,0,0,0,26,176,124,326]
[null,null,null,null,null,null,null,null,null,null,null,null,null,null,null,null,null,null,null,null,0]

{"sheet":"COVID","index":14,"n_rows":13,"n_cols":61,"rows_kept":13,"cut":false,"hidden":false,"merged":[]}
["ANNO","(Todas)"]
["MES","(Todas)"]
[]
[null,"Valores"]
["DESC_RED"," Meta0011"," Meta1217"," Meta1829"," Meta3059"," Meta6099"," 1.1_COVID_0611"," 1.2_COVID_0611"," 1.3_COVID_0611"," 1.4_COVID_0611"," 1.B_COVID_0611"," 2.1_COVID_0104A"," 2.2_COVID_0104A"," 2.3_COVID_0104A"," 2.4_COVID_0104A"," 2.B_COVID_0104A"," 3.1_COVID_0511A"," 3.2_COVID_0511A"," 3.3_COVID_0511A"," 3.4_COVID_0511A"," 3.B_COVID_0511A"," 4.1_COVID_1217A"," 4.2_COVID_1217A"," 4.3_COVID_1217A"," 4.4_COVID_1217A"," 4.B_COVID_1217A"," 5.1_COVID_1829A"," 5.2_COVID_1829A"," 5.3_COVID_1829A"," 5.4_COVID_1829A"," 5.B_COVID_1829A"," 6.1_COVID_3039A"," 6.2_COVID_3039A"," 6.3_COVID_3039A"," 6.4_COVID_3039A"," 6.B_COVID_3039A"," 7.1_COVID_4049A"," 7.2_COVID_4049A"," 7.3_COVID_4049A"," 7.4_COVID_4049A"," 7.B_COVID_4049A"," 8.1_COVID_5059A"," 8.2_COVID_5059A"," 8.3_COVID_5059A"," 8.4_COVID_5059A"," 8.B_COVID_5059A"," 9.1_COVID_6069A"," 9.2_COVID_6069A"," 9.3_COVID_6069A"," 9.4_COVID_6069A"," 9.B_COVID_6069A"," 10.1_COVID_7079A"," 10.2_COVID_7079A"," 10.3_COVID_7079A"," 10.4_COVID_7079A"," 10.B_COVID_7079A"," 11.1_COVID_8099A"," 11.2_COVID_8099A"," 11.3_COVID_8099A"," 11.4_COVID_8099A"," 11.B_COVID_8099A"]
["CANAS-CANCHIS-ESPINAR",0,0,0,0,0,0,0,0,0,0,0,0,0,0,0,0,0,0,0,0,0,0,0,0,0,0,0,0,0,0,0,0,0,0,0,0,0,0,0,0,0,0,0,0,0,0,0,0,0,0,0,0,0,0,0,0,0,0,0,0]
["CHUMBIVILCAS",0,0,0,0,0,0,0,0,0,0,0,0,0,0,0,0,0,0,0,0,0,0,0,0,0,0,0,0,0,0,0,0,0,0,0,0,0,0,0,0,0,0,0,0,0,0,0,0,0,0,0,0,0,0,0,0,0,0,0,0]
["CUSCO NORTE",0,0,0,0,0,0,0,0,0,0,0,0,0,0,0,0,0,0,0,0,0,0,0,0,0,0,0,0,0,0,0,0,0,0,0,0,0,0,0,0,0,0,0,0,0,0,0,0,0,0,0,0,0,0,0,0,0,0,0,0]
["CUSCO SUR",0,0,0,0,0,0,0,0,0,0,0,0,0,0,0,0,0,0,0,0,0,0,0,0,0,0,0,0,0,0,0,0,0,0,0,0,0,0,0,0,0,0,0,0,0,0,0,0,0,0,0,0,0,0,0,0,0,0,0,0]
["KIMBIRI PICHARI",0,0,0,0,0,0,0,0,0,0,0,0,0,0,0,0,0,0,0,0,0,0,0,0,0,0,0,0,0,0,0,0,0,0,0,0,0,0,0,0,0,0,0,0,0,0,0,0,0,0,0,0,0,0,0,0,0,0,0,0]
["LA CONVENCION",0,0,0,0,0,0,0,0,0,0,0,0,0,0,0,0,0,0,0,0,0,0,0,0,0,0,0,0,0,0,0,0,0,0,0,0,0,0,0,0,0,0,0,0,0,0,0,0,0,0,0,0,0,0,0,0,0,0,0,0]
["NO PERTENECE A NINGUNA RED",0,0,0,0,0,0,0,0,0,0,0,0,0,0,0,0,0,0,0,0,0,0,0,0,0,0,0,0,0,0,0,0,0,0,0,0,0,0,0,0,0,0,0,0,0,0,0,0,0,0,0,0,0,0,0,0,0,0,0,0]
["Total general",0,0,0,0,0,0,0,0,0,0,0,0,0,0,0,0,0,0,0,0,0,0,0,0,0,0,0,0,0,0,0,0,0,0,0,0,0,0,0,0,0,0,0,0,0,0,0,0,0,0,0,0,0,0,0,0,0,0,0,0]

{"sheet":"Datos","index":15,"n_rows":454,"n_cols":32,"rows_kept":454,"cut":false,"hidden":true,"merged":[]}
[]
[]
[]
[]
[]
[]
[]
[]
[null,"ANO",null,"MESES",null,"COD_RED","DESC_RED","CONCATENAR",null,"COD_RED","COD_MIC","DESC_MICRO","CONCATENAR",null,"COD_ESTAB","DESC_ESTAB","COD_RED","COD_MIC","COD_PROV","COD_DIST","REDMIC","CONCATENAR",null,"COD_PROV","DESC_PROV","CONCATENAR",null,"COD_PROV","COD_DIST","DESC_DIST","PROVDIST","CONCATENAR"]
[null,2025,null,"01-Enero",null,"00","NO TIENE ASIGNADO NINGUNA RED",{"$f":"CONCATENATE(F10,\" - \",G10)","v":"00 - NO TIENE ASIGNADO NINGUNA RED"},null,"00","00","NO PERTENECE A NINGUNA MICRORED                                                                     ",{"$f":"CONCATENATE(J10,K10,\" - \",L10)","v":"0000 - NO PERTENECE A NINGUNA MICRORED                                                                     "},null,"000000000","(All)","00","00",null,null,{"$f":"CONCATENATE(Q10,R10)","v":"0000"},{"$f":"CONCATENATE(O10,\" - \",P10)","v":"000000000 - (All)"},null,"00","(All)",{"$f":"CONCATENATE(X10,\" - \",Y10)","v":"00 - (All)"},null,"01","00","(All)",{"$f":"CONCATENATE(AB10,AC10)","v":"0100"},{"$f":"CONCATENATE(AB10,AC10,\" - \",AD10)","v":"0100 - (All)"}]
[null,null,null,"02-Febrero",null,"01","CUSCO SUR",{"$f":"CONCATENATE(F11,\" - \",G11)","v":"01 - CUSCO SUR"},null,"00","99","(All)","0099 - (All)",1,"000002289","HOSPITAL DE APOYO DEPARTAMENTAL CUSCO","00","00","01","01",{"$f":"CONCATENATE(Q11,R11)","v":"0000"},{"$f":"CONCATENATE(O11,\" - \",P11)","v":"000002289 - HOSPITAL DE APOYO DEPARTAMENTAL CUSCO"},null,"01","CUSCO",{"$f":"CONCATENATE(X11,\" - \",Y11)","v":"01 - CUSCO"},null,"01","01","CUSCO",{"$f":"CONCATENATE(AB11,AC11)","v":"0101"},{"$f":"CONCATENATE(AB11,AC11,\" - \",AD11)","v":"0101 - CUSCO"}]
[null,null,null,"03-Marzo",null,"02","CUSCO NORTE","02 - CUSCO NORTE",null,"01","00","NO PERTENECE A NINGUNA MICRORED                                                                     ","0100 - NO PERTENECE A NINGUNA MICRORED                                                                     ",{"$f":"+N11+1","v":2},"000002305","ANTONIO LORENA DEL CUSCO","00","00","01","06","0000","000002305 - ANTONIO LORENA DEL CUSCO",null,"02","ACOMAYO",{"$f":"CONCATENATE(X12,\" - \",Y12)","v":"02 - ACOMAYO"},null,"01","02","CCORCA","0102","0102 - CCORCA"]
[null,null,null,"04-Abril",null,"03","LA CONVENCION","03 - LA CONVENCION",null,"01","16","CUSCO                                                                                               ","0116 - CUSCO                                                                                               ",{"$f":"+N12+1","v":3},"999999999","(All)","00","99",null,null,"0099","999999999 - (All)",null,"03","ANTA","03 - ANTA",null,"01","03","POROY","0103","0103 - POROY"]
[null,null,null,"05-Mayo",null,"04","CANAS-CANCHIS-ESPINAR","04 - CANAS-CANCHIS-ESPINAR",null,"01","03","PARURO                                                                                              ","0103 - PARURO                                                                                              ",null,"000025210","TUPAC AMARU","01","00","01","05","0100","000025210 - TUPAC AMARU",null,"04","CALCA","04 - CALCA",null,"01","04","SAN JERONIMO","0104","0104 - SAN JERONIMO"]
[null,null,null,"06-Junio",null,"05","KIMBIRI PICHARI","05 - KIMBIRI PICHARI",null,"01","06","PAUCARTAMBO                                                                                         ","0106 - PAUCARTAMBO                                                                                         ",{"$f":"+N13+1","v":4},"000000000","(All)","01","03",null,null,"0103","000000000 - (All)",null,"05","CANAS","05 - CANAS",null,"01","05","SAN SEBASTIAN","0105","0105 - SAN SEBASTIAN"]
[null,null,null,"07-Julio",null,"06","CHUMBIVILCAS","06 - CHUMBIVILCAS",null,"01","12","URCOS                                                                                               ","0112 - URCOS                                                                                               ",null,"000002499","PARURO","01","03","10","01","0103","000002499 - PARURO",null,"06","CANCHIS","06 - CANCHIS",null,"01","06","SANTIAGO","0106","0106 - SANTIAGO"]
[null,null,null,"08-Agosto",null,"99","(All)","99 - (All)",null,"01","13","ACOMAYO                                                                                             ","0113 - ACOMAYO                                                                                             ",{"$f":"+N15+1","v":5},"000002500","ACCHA","01","03","10","02","0103","000002500 - ACCHA",null,"07","CHUMBIVILCAS","07 - CHUMBIVILCAS",null,"01","07","SAYLLA","0107","0107 - SAYLLA"]
[null,null,null,"09-Setiembre",null,null,null,null,null,"01","15","OCONGATE                                                                                            ","0115 - OCONGATE                                                                                            ",6,"000002501","CCAPI","01","03","10","03","0103","000002501 - CCAPI",null,"08","ESPINAR","08 - ESPINAR",null,"01","08","WANCHAQ","0108","0108 - WANCHAQ"]
[null,null,null,"10-Octubre",null,null,null,null,null,"01","99","(All)","0199 - (All)",7,"000002502","CCOYABAMBA","01","03","10","03","0103","000002502 - CCOYABAMBA",null,"09","LA CONVENCION","09 - LA CONVENCION",null,"02","00","(All)","0200","0200 - (All)"]
[null,null,null,"11-Noviembre",null,"EJECUTORAS",null,null,null,"02","01","BELEMPAMPA                                                                                          ","0201 - BELEMPAMPA                                                                                          ",8,"000002503","COLCHA","01","03","10","04","0103","000002503 - COLCHA",null,"10","PARURO","10 - PARURO",null,"02","01","ACOMAYO","0201","0201 - ACOMAYO"]
[null,null,null,"12-Diciembre",null,"COD_RED","DESC_RED","CONCATENAR",null,"02","02","WANCHAQ                                                                                             ","0202 - WANCHAQ                                                                                             ",9,"000006978","CCOCHIRIHUAY","01","03","10","04","0103","000006978 - CCOCHIRIHUAY",null,"11","PAUCARTAMBO","11 - PAUCARTAMBO",null,"02","02","ACOPIA","0202","0202 - ACOPIA"]
[null,null,null,null,null,"01","HOSPITAL REGIONAL CUSCO",{"$f":"CONCATENATE(F22,\" - \",G22)","v":"01 - HOSPITAL REGIONAL CUSCO"},null,"02","03","ANTA                                                                                                ","0203 - ANTA                                                                                                ",10,"000002504","HUANOQUITE","01","03","10","05","0103","000002504 - HUANOQUITE",null,"12","QUISPICANCHI","12 - QUISPICANCHI",null,"02","03","ACOS","0203","0203 - ACOS"]
[null,null,null,null,null,"02","HOSPITAL ANTONIO LORENA",{"$f":"CONCATENATE(F23,\" - \",G23)","v":"02 - HOSPITAL ANTONIO LORENA"},null,"02","04","LIMATAMBO                                                                                           ","0204 - LIMATAMBO                                                                                           ",11,"000002505","OMACHA","01","03","10","06","0103","000002505 - OMACHA",null,"13","URUBAMBA","13 - URUBAMBA",null,"02","04","MOSOC LLACTA","0204","0204 - MOSOC LLACTA"]
[null,null,null,null,null,"03","CUSCO NORTE","03 - CUSCO NORTE",null,"02","05","PISAC                                                                                               ","0205 - PISAC                                                                                               ",12,"000002506","ANTAPALLPA","01","03","10","06","0103","000002506 - ANTAPALLPA",null,null,null,null,null,"02","05","POMACANCHI","0205","0205 - POMACANCHI"]
[null,null,null,null,null,"04","CUSCO SUR","04 - CUSCO SUR",null,"02","06","CALCA                                                                                               ","0206 - CALCA                                                                                               ",13,"000007147","PUESTO DE SALUD DE HUASQUILLAY","01","03","10","06","0103","000007147 - PUESTO DE SALUD DE HUASQUILLAY",null,null,null,null,null,"02","06","RONDOCAN","0206","0206 - RONDOCAN"]
[null,null,null,null,null,"05","LA CONVENCION","05 - LA CONVENCION",null,"02","07","URUBAMBA                                                                                            ","0207 - URUBAMBA                                                                                            ",14,"000012924","SAHUA SAHUA","01","03","10","06","0103","000012924 - SAHUA SAHUA",null,null,null,null,null,"02","07","SANGARARA","0207","0207 - SANGARARA"]
[null,null,null,null,null,"06","HOSPITAL QUILLABAMBA","06 - HOSPITAL QUILLABAMBA",null,"02","08","YANATILE                                                                                            ","0208 - YANATILE                                                                                            ",15,"000002507","PACCARECTAMBO","01","03","10","07","0103","000002507 - PACCARECTAMBO",null,null,null,null,null,"03","00","(All)","0300","0300 - (All)"]
[null,null,null,null,null,"07","CANAS CANCHIS ESPINAR","07 - CANAS CANCHIS ESPINAR",null,"02","09","SIETE CUARTONES                                                                                     ","0209 - SIETE CUARTONES                                                                                     ",16,"000002509","YAURISQUE","01","03","10","09","0103","000002509 - YAURISQUE",null,null,null,null,null,"03","01","ANTA","0301","0301 - ANTA"]
[null,null,null,null,null,"08","HOSPITAL SICUANI","08 - HOSPITAL SICUANI",null,"02","99","(All)","0299 - (All)",17,"000000000","(All)","01","06",null,null,"0106","000000000 - (All)",null,null,null,null,null,"03","02","ANCAHUASI","0302","0302 - ANCAHUASI"]
[null,null,null,null,null,"09","HOSPITAL ESPINAR","09 - HOSPITAL ESPINAR",null,"03","00","NO PERTENECE A NINGUNA MICRORED                                                                     ","0300 - NO PERTENECE A NINGUNA MICRORED                                                                     ",null,"000002520","HUANCARANI","01","06","11","05","0106","000002520 - HUANCARANI",null,null,null,null,null,"03","03","CACHIMAYO","0303","0303 - CACHIMAYO"]
[null,null,null,null,null,"10","KIMBIRI PICHARI","10 - KIMBIRI PICHARI",null,"03","01","SANTA ANA                                                                                           ","0301 - SANTA ANA                                                                                           ",{"$f":"+N29+1","v":18},"000002521","PILCOPATA","01","06","11","06","0106","000002521 - PILCOPATA",null,null,null,null,null,"03","04","CHINCHAYPUJIO","0304","0304 - CHINCHAYPUJIO"]
[null,null,null,null,null,"11","CHUMBIVILCAS","11 - CHUMBIVILCAS",null,"03","02","MARANURA                                                                                            ","0302 - MARANURA                                                                                            ",19,"000002522","PATRIA","01","06","11","06","0106","000002522 - PATRIA",null,null,null,null,null,"03","05","HUAROCONDO","0305","0305 - HUAROCONDO"]
[null,null,null,null,null,"99","(ALL)",{"$f":"CONCATENATE(F33,\" - \",G33)","v":"99 - (ALL)"},null,"03","03","QUELLOUNO                                                                                           ","0303 - QUELLOUNO                                                                                           ",20,"000002510","PAUCARTAMBO","01","06","11","01","0106","000002510 - PAUCARTAMBO",null,null,null,null,null,"03","06","LIMATAMBO","0306","0306 - LIMATAMBO"]
[null,null,null,null,null,null,null,null,null,"03","04","KITENI                                                                                              ","0304 - KITENI                                                                                              ",21,"000002511","MOLLOMARCA","01","06","11","01","0106","000002511 - MOLLOMARCA",null,null,null,null,null,"03","07","MOLLEPATA","0307","0307 - MOLLEPATA"]
[null,null,null,null,null,null,null,null,null,"03","05","KAMISEA                                                                                             ","0305 - KAMISEA                                                                                             ",22,"000010077","PAUCARTAMBO -ESSALUD","01","06","11","01","0106","000010077 - PAUCARTAMBO -ESSALUD",null,null,null,null,null,"03","08","PUCYURA","0308","0308 - PUCYURA"]
[null,null,null,null,null,"SECTORES",null,null,null,"03","06","PUCYURA                                                                                             ","0306 - PUCYURA                                                                                             ",23,"000033777","MENTAL COMUNITARIO VIRGEN DEL ROSARIO","01","06","11","01","0106","000033777 - MENTAL COMUNITARIO VIRGEN DEL ROSARIO",null,null,null,null,null,"03","09","ZURITE","0309","0309 - ZURITE"]
[null,null,null,null,null,"COD_SECTOR","DESC_RED","CONCATENAR",null,"03","07","PALMA REAL","0307 - PALMA REAL",24,"000002512","CAICAY","01","06","11","02","0106","000002512 - CAICAY",null,null,null,null,null,"04","00","(All)","0400","0400 - (All)"]
[null,null,null,null,null,"1","GORE",{"$f":"CONCATENATE(F38,\" - \",G38)","v":"1 - GORE"},null,"03","99","(All)","0399 - (All)",25,"000002513","HUASAC","01","06","11","02","0106","000002513 - HUASAC",null,null,null,null,null,"04","01","CALCA","0401","0401 - CALCA"]
[null,null,null,null,null,"2","ESSALUD",{"$f":"CONCATENATE(F39,\" - \",G39)","v":"2 - ESSALUD"},null,"04","00","NO PERTENECE A NINGUNA MICRORED                                                                     ","0400 - NO PERTENECE A NINGUNA MICRORED                                                                     ",26,"000002514","CHALLABAMBA","01","06","11","03","0106","000002514 - CHALLABAMBA",null,null,null,null,null,"04","02","COYA","0402","0402 - COYA"]
[null,null,null,null,null,"3","OTROS","3 - OTROS",null,"04","01","YANAOCA                                                                                             ","0401 - YANAOCA                                                                                             ",27,"000002516","COLQUEPATA","01","06","11","04","0106","000002516 - COLQUEPATA",null,null,null,null,null,"04","03","LAMAY","0403","0403 - LAMAY"]
[null,null,null,null,null,"99","(ALL)","99 - (ALL)",null,"04","02","EL DESCANSO                                                                                         ","0402 - EL DESCANSO                                                                                         ",28,"000002517","PICHIHUA COLQUEPATA","01","06","11","04","0106","000002517 - PICHIHUA COLQUEPATA",null,null,null,null,null,"04","04","LARES","0404","0404 - LARES"]
[null,null,null,null,null,null,null,null,null,"04","03","COMBAPATA                                                                                           ","0403 - COMBAPATA                                                                                           ",29,"000002518","VIZCOCHONI","01","06","11","04","0106","000002518 - VIZCOCHONI",null,null,null,null,null,"04","05","PISAC","0405","0405 - PISAC"]
[null,null,null,null,null,null,null,null,null,"04","04","TECHO OBRERO                                                                                        ","0404 - TECHO OBRERO                                                                                        ",30,"000002519","AYRE","01","06","11","04","0106","000002519 - AYRE",null,null,null,null,null,"04","06","SAN SALVADOR","0406","0406 - SAN SALVADOR"]
[null,null,null,null,null,null,null,null,null,"04","05","PAMPAPHALLA                                                                                         ","0405 - PAMPAPHALLA                                                                                         ",31,"000006979","TOCRA","01","06","11","04","0106","000006979 - TOCRA",null,null,null,null,null,"04","07","TARAY","0407","0407 - TARAY"]
[null,null,null,null,null,null,null,null,null,"04","06","YAURI                                                                                               ","0406 - YAURI                                                                                               ",32,"000000000","(All)","01","12",null,null,"0112","000000000 - (All)",null,null,null,null,null,"04","08","YANATILE","0408","0408 - YANATILE"]
[null,null,null,null,null,null,null,null,null,"04","99","(All)","0499 - (All)",null,"000002523","URCOS","01","12","12","01","0112","000002523 - URCOS",null,null,null,null,null,"05","00","(All)","0500","0500 - (All)"]
[null,null,null,null,null,null,null,null,null,"05","00","NO PERTENECE A NINGUNA MICRORED                                                                     ","0500 - NO PERTENECE A NINGUNA MICRORED                                                                     ",{"$f":"+N45+1","v":33},"000026385","ESSALUD-URCOS","01","12","12","01","0112","000026385 - ESSALUD-URCOS",null,null,null,null,null,"05","01","YANAOCA","0501","0501 - YANAOCA"]
[null,null,null,null,null,null,null,null,null,"05","01","KIMBIRI                                                                                             ","0501 - KIMBIRI                                                                                             ",34,"000002525","ANDAHUAYLILLAS","01","12","12","02","0112","000002525 - ANDAHUAYLILLAS",null,null,null,null,null,"05","02","CHECCA","0502","0502 - CHECCA"]
[null,null,null,null,null,null,null,null,null,"05","02","PICHARI                                                                                             ","0502 - PICHARI                                                                                             ",35,"000008911","HUARA HUARA","01","12","12","05","0112","000008911 - HUARA HUARA",null,null,null,null,null,"05","03","KUNTURKANKI","0503","0503 - KUNTURKANKI"]
[null,null,null,null,null,null,null,null,null,"05","99","(All)","0599 - (All)",36,"000002530","CUSIPATA","01","12","12","06","0112","000002530 - CUSIPATA",null,null,null,null,null,"05","04","LANGUI","0504","0504 - LANGUI"]
[null,null,null,null,null,null,null,null,null,"06","00","NO PERTENECE A NINGUNA MICRORED                                                                     ","0600 - NO PERTENECE A NINGUNA MICRORED                                                                     ",37,"000006980","CHILLIHUANI","01","12","12","06","0112","000006980 - CHILLIHUANI",null,null,null,null,null,"05","05","LAYO","0505","0505 - LAYO"]
[null,null,null,null,null,null,null,null,null,"06","09","SANTO TOMAS                                                                                         ","0609 - SANTO TOMAS                                                                                         ",38,"000002532","HUARO","01","12","12","07","0112","000002532 - HUARO",null,null,null,null,null,"05","06","PAMPAMARCA","0506","0506 - PAMPAMARCA"]
[null,null,null,null,null,null,null,null,null,"06","01","LIVITACA                                                                                            ","0601 - LIVITACA                                                                                            ",39,"000002533","URPAY","01","12","12","07","0112","000002533 - URPAY",null,null,null,null,null,"05","07","QUEHUE","0507","0507 - QUEHUE"]
[null,null,null,null,null,null,null,null,null,"06","99","(All)","0699 - (All)",40,"000011747","POSTA MEDICA POLICIAL PUCUTO","01","12","12","07","0112","000011747 - POSTA MEDICA POLICIAL PUCUTO",null,null,null,null,null,"05","08","TUPAC AMARU","0508","0508 - TUPAC AMARU"]
[null,null,null,null,null,null,null,null,null,"99","99","(All)","9999 - (All)",41,"000030708","MENTAL COMUNITARIO HUARO","01","12","12","07","0112","000030708 - MENTAL COMUNITARIO HUARO",null,null,null,null,null,"06","00","(All)","0600","0600 - (All)"]
[null,null,null,null,null,null,null,null,null,null,null,null,null,42,"000002534","LUCRE","01","12","12","08","0112","000002534 - LUCRE",null,null,null,null,null,"06","01","SICUANI","0601","0601 - SICUANI"]
[null,null,null,null,null,null,null,null,null,null,null,null,null,43,"000002537","OROPESA","01","12","12","11","0112","000002537 - OROPESA",null,null,null,null,null,"06","02","CHECACUPE","0602","0602 - CHECACUPE"]
[null,null,null,null,null,null,null,null,null,null,null,null,null,44,"000002538","QUIQUIJANA","01","12","12","12","0112","000002538 - QUIQUIJANA",null,null,null,null,null,"06","03","COMBAPATA","0603","0603 - COMBAPATA"]
[null,null,null,null,null,null,null,null,null,null,null,null,null,45,"000002539","CCOLCA","01","12","12","12","0112","000002539 - CCOLCA",null,null,null,null,null,"06","04","MARANGANI","0604","0604 - MARANGANI"]
[null,null,null,null,null,null,null,null,null,null,null,null,null,46,"000000000","(All)","01","13",null,null,"0113","000000000 - (All)",null,null,null,null,null,"06","05","PITUMARCA","0605","0605 - PITUMARCA"]
[null,null,null,null,null,null,null,null,null,null,null,null,null,null,"000002317","ACOMAYO","01","13","02","01","0113","000002317 - ACOMAYO",null,null,null,null,null,"06","06","SAN PABLO","0606","0606 - SAN PABLO"]
[null,null,null,null,null,null,null,null,null,null,null,null,null,{"$f":"+N60+1","v":47},"000010076","ACOMAYO - ESSALUD","01","13","02","01","0113","000010076 - ACOMAYO - ESSALUD",null,null,null,null,null,"06","07","SAN PEDRO","0607","0607 - SAN PEDRO"]
[null,null,null,null,null,null,null,null,null,null,null,null,null,48,"000002318","ACOPIA","01","13","02","02","0113","000002318 - ACOPIA",null,null,null,null,null,"06","08","TINTA","0608","0608 - TINTA"]
[null,null,null,null,null,null,null,null,null,null,null,null,null,49,"000002319","ACOS","01","13","02","03","0113","000002319 - ACOS",null,null,null,null,null,"07","00","(All)","0700","0700 - (All)"]
[null,null,null,null,null,null,null,null,null,null,null,null,null,50,"000002321","POMACANCHI","01","13","02","05","0113","000002321 - POMACANCHI",null,null,null,null,null,"07","01","SANTO TOMAS","0701","0701 - SANTO TOMAS"]
[null,null,null,null,null,null,null,null,null,null,null,null,null,51,"000002322","SAN JUAN DE POMACANCHI","01","13","02","05","0113","000002322 - SAN JUAN DE POMACANCHI",null,null,null,null,null,"07","02","CAPACMARCA","0702","0702 - CAPACMARCA"]
[null,null,null,null,null,null,null,null,null,null,null,null,null,52,"000012926","SANTA LUCIA","01","13","02","05","0113","000012926 - SANTA LUCIA",null,null,null,null,null,"07","03","CHAMACA","0703","0703 - CHAMACA"]
[null,null,null,null,null,null,null,null,null,null,null,null,null,53,"000002324","PUESTO DE SALUD SANGARARA","01","13","02","07","0113","000002324 - PUESTO DE SALUD SANGARARA",null,null,null,null,null,"07","04","COLQUEMARCA","0704","0704 - COLQUEMARCA"]
[null,null,null,null,null,null,null,null,null,null,null,null,null,54,"000002325","PUESTO DE SALUD MARCACONGA","01","13","02","07","0113","000002325 - PUESTO DE SALUD MARCACONGA",null,null,null,null,null,"07","05","LIVITACA","0705","0705 - LIVITACA"]
[null,null,null,null,null,null,null,null,null,null,null,null,null,55,"000002508","PILLPINTO","01","13","10","08","0113","000002508 - PILLPINTO",null,null,null,null,null,"07","06","LLUSCO","0706","0706 - LLUSCO"]
[null,null,null,null,null,null,null,null,null,null,null,null,null,56,"000000000","(All)","01","15",null,null,"0115","000000000 - (All)",null,null,null,null,null,"07","07","QUIÑOTA","0707","0707 - QUIÑOTA"]
[null,null,null,null,null,null,null,null,null,null,null,null,null,null,"000002526","QUINCE MIL","01","15","12","03","0115","000002526 - QUINCE MIL",null,null,null,null,null,"07","08","VELILLE","0708","0708 - VELILLE"]
[null,null,null,null,null,null,null,null,null,null,null,null,null,{"$f":"+N71+1","v":57},"000002527","CCARHUAYO","01","15","12","04","0115","000002527 - CCARHUAYO",null,null,null,null,null,"08","00","(All)","0800","0800 - (All)"]
[null,null,null,null,null,null,null,null,null,null,null,null,null,58,"000002524","PAMPACAMARA","01","15","12","05","0115","000002524 - PAMPACAMARA",null,null,null,null,null,"08","01","ESPINAR","0801","0801 - ESPINAR"]
[null,null,null,null,null,null,null,null,null,null,null,null,null,59,"000002528","CCATCCA","01","15","12","05","0115","000002528 - CCATCCA",null,null,null,null,null,"08","02","CONDOROMA",{"$f":"CONCATENATE(AB75,AC75)","v":"0802"},{"$f":"CONCATENATE(AB75,AC75,\" - \",AD75)","v":"0802 - CONDOROMA"}]
[null,null,null,null,null,null,null,null,null,null,null,null,null,60,"000002529","KCAURY","01","15","12","05","0115","000002529 - KCAURY",null,null,null,null,null,"08","03","COPORAQUE","0803","0803 - COPORAQUE"]
[null,null,null,null,null,null,null,null,null,null,null,null,null,{"$f":"+N76+1","v":61},"000012931","CHICHINA","01","15","12","05","0115","000012931 - CHICHINA",null,null,null,null,null,"08","04","OCORURO","0804","0804 - OCORURO"]
[null,null,null,null,null,null,null,null,null,null,null,null,null,62,"000016335","CCAPANA","01","15","12","05","0115","000016335 - CCAPANA",null,null,null,null,null,"08","05","PALLPATA","0805","0805 - PALLPATA"]
[null,null,null,null,null,null,null,null,null,null,null,null,null,63,"000002535","MARCAPATA","01","15","12","09","0115","000002535 - MARCAPATA",null,null,null,null,null,"08","06","PICHIGUA","0806","0806 - PICHIGUA"]
[null,null,null,null,null,null,null,null,null,null,null,null,null,64,"000007110","INCACANCHA","01","15","12","09",{"$f":"CONCATENATE(Q80,R80)","v":"0115"},{"$f":"CONCATENATE(O80,\" - \",P80)","v":"000007110 - INCACANCHA"},null,null,null,null,null,"08","07","SUYCKUTAMBO","0807","0807 - SUYCKUTAMBO"]
[null,null,null,null,null,null,null,null,null,null,null,null,null,65,"000002536","OCONGATE","01","15","12","10","0115","000002536 - OCONGATE",null,null,null,null,null,"08","08","ALTO PICHIGUA","0808","0808 - ALTO PICHIGUA"]
[null,null,null,null,null,null,null,null,null,null,null,null,null,66,"000006977","TINKI","01","15","12","10","0115","000006977 - TINKI",null,null,null,null,null,"09","00","(All)","0900","0900 - (All)"]
[null,null,null,null,null,null,null,null,null,null,null,null,null,67,"000000000","(All)","01","16",null,null,"0116","000000000 - (All)",null,null,null,null,null,"09","01","SANTA ANA","0901","0901 - SANTA ANA"]
[null,null,null,null,null,null,null,null,null,null,null,null,null,null,"000002300","SAN JERONIMO","01","16","01","04","0116","000002300 - SAN JERONIMO",null,null,null,null,null,"09","02","ECHARATE","0902","0902 - ECHARATE"]
[null,null,null,null,null,null,null,null,null,null,null,null,null,{"$f":"+N83+1","v":68},"000007699","CONCHACALLE","01","16","01","04","0116","000007699 - CONCHACALLE",null,null,null,null,null,"09","03","HUAYOPATA","0903","0903 - HUAYOPATA"]
[null,null,null,null,null,null,null,null,null,null,null,null,null,69,"000018926","ESTABLECIMIENTO PENITENCIARIO CUSCO VARONES","01","16","01","04","0116","000018926 - ESTABLECIMIENTO PENITENCIARIO CUSCO VARONES",null,null,null,null,null,"09","04","MARANURA","0904","0904 - MARANURA"]
[null,null,null,null,null,null,null,null,null,null,null,null,null,70,"000021187","ESTABLECIMIENTO PENITENCIARIO CUSCO MUJERES","01","16","01","04","0116","000021187 - ESTABLECIMIENTO PENITENCIARIO CUSCO MUJERES",null,null,null,null,null,"09","05","OCOBAMBA","0905","0905 - OCOBAMBA"]
[null,null,null,null,null,null,null,null,null,null,null,null,null,71,"000030727","PATRÓN SAN SEBASTIAN","01","16","01","04","0116","000030727 - PATRÓN SAN SEBASTIAN",null,null,null,null,null,"09","06","QUELLOUNO","0906","0906 - QUELLOUNO"]
[null,null,null,null,null,null,null,null,null,null,null,null,null,72,"000002301","SAN SEBASTIAN","01","16","01","05","0116","000002301 - SAN SEBASTIAN",null,null,null,null,null,"09","07","KIMBIRI","0907","0907 - KIMBIRI"]
[null,null,null,null,null,null,null,null,null,null,null,null,null,73,"000002303","SANTA ROSA","01","16","01","05","0116","000002303 - SANTA ROSA",null,null,null,null,null,"09","08","SANTA TERESA","0908","0908 - SANTA TERESA"]
[null,null,null,null,null,null,null,null,null,null,null,null,null,74,"000010065","SAN SEBASTIAN ESSALUD","01","16","01","05","0116","000010065 - SAN SEBASTIAN ESSALUD",null,null,null,null,null,"09","09","VILCABAMBA","0909","0909 - VILCABAMBA"]
[null,null,null,null,null,null,null,null,null,null,null,null,null,75,"000011743","POLICIAL \"SANTA ROSA\"  CUSCO","01","16","01","05","0116","000011743 - POLICIAL \"SANTA ROSA\"  CUSCO",null,null,null,null,null,"09","10","PICHARI","0910","0910 - PICHARI"]
[null,null,null,null,null,null,null,null,null,null,null,null,null,76,"000026181","MENTAL SAN SEBASTIAN","01","16","01","05","0116","000026181 - MENTAL SAN SEBASTIAN",null,null,null,null,null,"09","11","INKAWASI                                ","0911","0911 - INKAWASI                                "]
[null,null,null,null,null,null,null,null,null,null,null,null,null,77,"000002314","SAYLLA","01","16","01","07","0116","000002314 - SAYLLA",null,null,null,null,null,"09","12","VILLA VIRGEN","0912","0912 - VILLA VIRGEN"]
[null,null,null,null,null,null,null,null,null,null,null,null,null,78,"000002323","RONDOCAN","01","16","02","06","0116","000002323 - RONDOCAN",null,null,null,null,null,"09","13","VILLA KINTIARINA","0913","0913 - VILLA KINTIARINA"]
[null,null,null,null,null,null,null,null,null,null,null,null,null,79,"999999999","(All)","01","99",null,null,"0199","999999999 - (All)",null,null,null,null,null,"09","14","MEGANTONI","0914","0914 - MEGANTONI"]
[null,null,null,null,null,null,null,null,null,null,null,null,null,null,"000000000","(All)","02","01",null,null,"0201","000000000 - (All)",null,null,null,null,null,"09","15","KUMPIRUSHIATO","0915","0915 - KUMPIRUSHIATO"]
[null,null,null,null,null,null,null,null,null,null,null,null,null,null,"000002292","INDEPENDENCIA","02","01","01","01","0201","000002292 - INDEPENDENCIA",null,null,null,null,null,"09","16","CIELO PUNCO","0916","0916 - CIELO PUNCO"]
[null,null,null,null,null,null,null,null,null,null,null,null,null,{"$f":"+N96+1","v":80},"000002297","CCORCCA","02","01","01","02","0201","000002297 - CCORCCA",null,null,null,null,null,"09","17","MANITEA","0917","0917 - MANITEA"]
[null,null,null,null,null,null,null,null,null,null,null,null,null,81,"000002306","BELEMPAMPA","02","01","01","06","0201","000002306 - BELEMPAMPA",null,null,null,null,null,"09","18","UNION ASHANINKA","0918","0918 - UNION ASHANINKA"]
[null,null,null,null,null,null,null,null,null,null,null,null,null,82,"000002308","ZARZUELA ALTA","02","01","01","06","0201","000002308 - ZARZUELA ALTA",null,null,null,null,null,"09","00","(All)","0900","0900 - (All)"]
[null,null,null,null,null,null,null,null,null,null,null,null,null,83,"000002309","DIGNIDAD NACIONAL","02","01","01","06","0201","000002309 - DIGNIDAD NACIONAL",null,null,null,null,null,"10","01","PARURO","1001","1001 - PARURO"]
[null,null,null,null,null,null,null,null,null,null,null,null,null,84,"000002313","OCCOPATA","02","01","01","06","0201","000002313 - OCCOPATA",null,null,null,null,null,"10","02","ACCHA","1002","1002 - ACCHA"]
[null,null,null,null,null,null,null,null,null,null,null,null,null,85,"000010920","QUINTA BRIGADA DE MONTAÑA","02","01","01","06","0201","000010920 - QUINTA BRIGADA DE MONTAÑA",null,null,null,null,null,"10","03","CCAPI","1003","1003 - CCAPI"]
[null,null,null,null,null,null,null,null,null,null,null,null,null,86,"000026182","MENTAL SANTIAGO","02","01","01","06","0201","000026182 - MENTAL SANTIAGO",null,null,null,null,null,"10","04","COLCHA","1004","1004 - COLCHA"]
[null,null,null,null,null,null,null,null,null,null,null,null,null,87,"000034933","SANTIAGO ESSALUD","02","01","01","06","0201","000034933 - SANTIAGO ESSALUD",null,null,null,null,null,"10","05","HUANOQUITE","1005","1005 - HUANOQUITE"]
[null,null,null,null,null,null,null,null,null,null,null,null,null,88,"000023721","EJERCITO-PERUANO 5TA BM","02","01","01","06","0201","000023721 - EJERCITO-PERUANO 5TA BM",null,null,null,null,null,"10","06","OMACHA","1006","1006 - OMACHA"]
[null,null,null,null,null,null,null,null,null,null,null,null,null,null,"000000000","(All)","02","02",null,null,"0202","000000000 - (All)",null,null,null,null,null,"10","07","PACCARITAMBO","1007","1007 - PACCARITAMBO"]
[null,null,null,null,null,null,null,null,null,null,null,null,null,{"$f":"+N107+1","v":89},"000034419","MENTAL COMUNITARIO CUSCO","02","02","01","01","0202","000034419 - MENTAL COMUNITARIO CUSCO",null,null,null,null,null,"10","08","PILLPINTO","1008","1008 - PILLPINTO"]
[null,null,null,null,null,null,null,null,null,null,null,null,null,90,"000002302","CCORAO","02","02","01","05","0202","000002302 - CCORAO",null,null,null,null,null,"10","09","YAURISQUE","1009","1009 - YAURISQUE"]
[null,null,null,null,null,null,null,null,null,null,null,null,null,91,"000002307","MANCO CAPAC","02","02","01","06","0202","000002307 - MANCO CAPAC",null,null,null,null,null,"11","00","(All)","1100","1100 - (All)"]
[null,null,null,null,null,null,null,null,null,null,null,null,null,92,"000002310","CHOCCO","02","02","01","06","0202","000002310 - CHOCCO",null,null,null,null,null,"11","01","PAUCARTAMBO","1101","1101 - PAUCARTAMBO"]
[null,null,null,null,null,null,null,null,null,null,null,null,null,93,"000002315","WANCHAQ","02","02","01","08","0202","000002315 - WANCHAQ",null,null,null,null,null,"11","02","CAICAY","1102","1102 - CAICAY"]
[null,null,null,null,null,null,null,null,null,null,null,null,null,94,"000002316","TTIO","02","02","01","08","0202","000002316 - TTIO",null,null,null,null,null,"11","03","CHALLABAMBA","1103","1103 - CHALLABAMBA"]
[null,null,null,null,null,null,null,null,null,null,null,null,null,95,"000010041","ADOLFO GUEVARA VELASCO","02","02","01","08","0202","000010041 - ADOLFO GUEVARA VELASCO",null,null,null,null,null,"11","04","COLQUEPATA","1104","1104 - COLQUEPATA"]
[null,null,null,null,null,null,null,null,null,null,null,null,null,96,"000026183","METROPOLITANO","02","02","01","08","0202","000026183 - METROPOLITANO",null,null,null,null,null,"11","05","HUANCARANI","1105","1105 - HUANCARANI"]
[null,null,null,null,null,null,null,null,null,null,null,null,null,null,"000030730","PATRON SANTIAGO","02","02","01","08","0202","000030730 - PATRON SANTIAGO",null,null,null,null,null,"11","06","KOSÑIPATA","1106","1106 - KOSÑIPATA"]
[null,null,null,null,null,null,null,null,null,null,null,null,null,{"$f":"+N116+1","v":97},"000000000","(All)","02","03",null,null,"0203","000000000 - (All)",null,null,null,null,null,"12","00","(All)","1200","1200 - (All)"]
[null,null,null,null,null,null,null,null,null,null,null,null,null,98,"000002326","ANTA","02","03","03","01","0203","000002326 - ANTA",null,null,null,null,null,"12","01","URCOS","1201","1201 - URCOS"]
[null,null,null,null,null,null,null,null,null,null,null,null,null,99,"000002328","COMPONE","02","03","03","01","0203","000002328 - COMPONE",null,null,null,null,null,"12","02","ANDAHUAYLILLAS","1202","1202 - ANDAHUAYLILLAS"]
[null,null,null,null,null,null,null,null,null,null,null,null,null,100,"000002329","CONCHACALLA","02","03","03","01","0203","000002329 - CONCHACALLA",null,null,null,null,null,"12","03","CAMANTI","1203","1203 - CAMANTI"]
[null,null,null,null,null,null,null,null,null,null,null,null,null,101,"000027790","MENTAL COMUNITARIO ANTA","02","03","03","01","0203","000027790 - MENTAL COMUNITARIO ANTA",null,null,null,null,null,"12","04","CCARHUAYO","1204","1204 - CCARHUAYO"]
[null,null,null,null,null,null,null,null,null,null,null,null,null,102,"000029514","ESSALUD ANTA","02","03","03","01","0203","000029514 - ESSALUD ANTA",null,null,null,null,null,"12","05","CCATCA","1205","1205 - CCATCA"]
[null,null,null,null,null,null,null,null,null,null,null,null,null,103,"000002330","ANCAHUASI","02","03","03","02","0203","000002330 - ANCAHUASI",null,null,null,null,null,"12","06","CUSIPATA","1206","1206 - CUSIPATA"]
[null,null,null,null,null,null,null,null,null,null,null,null,null,104,"000002331","CACHIMAYO","02","03","03","03","0203","000002331 - CACHIMAYO",null,null,null,null,null,"12","07","HUARO","1207","1207 - HUARO"]
[null,null,null,null,null,null,null,null,null,null,null,null,null,105,"000006972","PANTIPATA","02","03","03","04","0203","000006972 - PANTIPATA",null,null,null,null,null,"12","08","LUCRE","1208","1208 - LUCRE"]
[null,null,null,null,null,null,null,null,null,null,null,null,null,106,"000036240","CHINCHAYPUJIO","02","03","03","04","0203","000036240 - CHINCHAYPUJIO",null,null,null,null,null,"12","09","MARCAPATA","1209","1209 - MARCAPATA"]
[null,null,null,null,null,null,null,null,null,null,null,null,null,107,"000035838","PARCCOTICA","02","03","03","04","0203","000035838 - PARCCOTICA",null,null,null,null,null,"12","10","OCONGATE","1210","1210 - OCONGATE"]
[null,null,null,null,null,null,null,null,null,null,null,null,null,108,"000002333","HUAROCONDO","02","03","03","05","0203","000002333 - HUAROCONDO",null,null,null,null,null,"12","11","OROPESA","1211","1211 - OROPESA"]
[null,null,null,null,null,null,null,null,null,null,null,null,null,109,"000002334","HUAYLLACOCHA","02","03","03","05","0203","000002334 - HUAYLLACOCHA",null,null,null,null,null,"12","12","QUIQUIJANA","1212","1212 - QUIQUIJANA"]
[null,null,null,null,null,null,null,null,null,null,null,null,null,110,"000002339","PUCYURA ANTA","02","03","03","08","0203","000002339 - PUCYURA ANTA",null,null,null,null,null,"13","00","(All)","1300","1300 - (All)"]
[null,null,null,null,null,null,null,null,null,null,null,null,null,null,"000002340","ZURITE","02","03","03","09","0203","000002340 - ZURITE",null,null,null,null,null,"13","01","URUBAMBA","1301","1301 - URUBAMBA"]
[null,null,null,null,null,null,null,null,null,null,null,null,null,{"$f":"+N131+1","v":111},"000002327","CHACAN","02","03","03","01","0203","000002327 - CHACAN",null,null,null,null,null,"13","02","CHINCHERO","1302","1302 - CHINCHERO"]
[null,null,null,null,null,null,null,null,null,null,null,null,null,112,"000000000","(All)","02","04",null,null,"0204","000000000 - (All)",null,null,null,null,null,"13","03","HUAYLLABAMBA","1303","1303 - HUAYLLABAMBA"]
[null,null,null,null,null,null,null,null,null,null,null,null,null,113,"000002336","LIMATAMBO","02","04","03","06","0204","000002336 - LIMATAMBO",null,null,null,null,null,"13","04","MACHUPICCHU","1304","1304 - MACHUPICCHU"]
[null,null,null,null,null,null,null,null,null,null,null,null,null,114,"000002337","PAMPACONGA","02","04","03","06","0204","000002337 - PAMPACONGA",null,null,null,null,null,"13","05","MARAS","1305","1305 - MARAS"]
[null,null,null,null,null,null,null,null,null,null,null,null,null,115,"000010761","URATARI","02","04","03","06","0204","000010761 - URATARI",null,null,null,null,null,"13","06","OLLANTAYTAMBO","1306","1306 - OLLANTAYTAMBO"]
[null,null,null,null,null,null,null,null,null,null,null,null,null,null,"000002338","MOLLEPATA","02","04","03","07","0204","000002338 - MOLLEPATA",null,null,null,null,null,"13","07","YUCAY",{"$f":"CONCATENATE(AB138,AC138)","v":"1307"},"1307 - YUCAY"]
[null,null,null,null,null,null,null,null,null,null,null,null,null,{"$f":"+N137+1","v":116},"000021061","HUAMANPATA","02","04","03","07","0204","000021061 - HUAMANPATA",null,null,null,null,null,"00","00","(All)",{"$f":"CONCATENATE(AB139,AC139)","v":"0000"},"0000 - (All)"]
[null,null,null,null,null,null,null,null,null,null,null,null,null,117,"000000000","(All)","02","05",null,null,"0205","000000000 - (All)"]
[null,null,null,null,null,null,null,null,null,null,null,null,null,{"$f":"+N140+1","v":118},"000002343","COYA","02","05","04","02","0205","000002343 - COYA"]
[null,null,null,null,null,null,null,null,null,null,null,null,null,119,"000002344","LAMAY","02","05","04","03","0205","000002344 - LAMAY"]
[null,null,null,null,null,null,null,null,null,null,null,null,null,120,"000006975","SAYLLAFAYA","02","05","04","03","0205","000006975 - SAYLLAFAYA"]
[null,null,null,null,null,null,null,null,null,null,null,null,null,121,"000007145","HUAMA","02","05","04","03","0205","000007145 - HUAMA"]
[null,null,null,null,null,null,null,null,null,null,null,null,null,122,"000007146","POQUES","02","05","04","03","0205","000007146 - POQUES"]
[null,null,null,null,null,null,null,null,null,null,null,null,null,123,"000036012","HUARQUI","02","05","04","03","0205","000036012 - HUARQUI"]
[null,null,null,null,null,null,null,null,null,null,null,null,null,124,"000002348","PISAC","02","05","04","05","0205","000002348 - PISAC"]
[null,null,null,null,null,null,null,null,null,null,null,null,null,125,"000002349","CUYO CHICO","02","05","04","05","0205","000002349 - CUYO CHICO"]
[null,null,null,null,null,null,null,null,null,null,null,null,null,126,"000002350","CUYO GRANDE","02","05","04","05","0205","000002350 - CUYO GRANDE"]
[null,null,null,null,null,null,null,null,null,null,null,null,null,127,"000002351","QUELLO QUELLO","02","05","04","05",{"$f":"CONCATENATE(Q150,R150)","v":"0205"},{"$f":"CONCATENATE(O150,\" - \",P150)","v":"000002351 - QUELLO QUELLO"}]
[null,null,null,null,null,null,null,null,null,null,null,null,null,128,"000002352","SAN SALVADOR","02","05","04","06","0205","000002352 - SAN SALVADOR"]
[null,null,null,null,null,null,null,null,null,null,null,null,null,129,"000036087","TIRACANCHA","02","05","04","06","0205","000036087 - TIRACANCHA"]
[null,null,null,null,null,null,null,null,null,null,null,null,null,null,"000002353","TARAY","02","05","04","07","0205","000002353 - TARAY"]
[null,null,null,null,null,null,null,null,null,null,null,null,null,{"$f":"+N152+1","v":130},"000002354","HUANCALLE","02","05","04","07","0205","000002354 - HUANCALLE"]
[null,null,null,null,null,null,null,null,null,null,null,null,null,131,"000000000","(All)","02","06",null,null,"0206","000000000 - (All)"]
[null,null,null,null,null,null,null,null,null,null,null,null,null,132,"000002341","CALCA","02","06","04","01","0206","000002341 - CALCA"]
[null,null,null,null,null,null,null,null,null,null,null,null,null,133,"000010069","ESSALUD CALCA","02","06","04","01","0206","000010069 - ESSALUD CALCA"]
[null,null,null,null,null,null,null,null,null,null,null,null,null,134,"000010759","HUARAN","02","06","04","01","0206","000010759 - HUARAN"]
[null,null,null,null,null,null,null,null,null,null,null,null,null,135,"000010762","ACCHA ALTA - PAMPALLACTA","02","06","04","01","0206","000010762 - ACCHA ALTA - PAMPALLACTA"]
[null,null,null,null,null,null,null,null,null,null,null,null,null,136,"000026273","MENTAL COMUNITARIO VIRGEN ASUNTA DE CALCA","02","06","04","01","0206","000026273 - MENTAL COMUNITARIO VIRGEN ASUNTA DE CALCA"]
[null,null,null,null,null,null,null,null,null,null,null,null,null,137,"000002342","AMPARAES","02","06","04","04","0206","000002342 - AMPARAES"]
[null,null,null,null,null,null,null,null,null,null,null,null,null,138,"000002345","CCACHIN","02","06","04","04","0206","000002345 - CCACHIN"]
[null,null,null,null,null,null,null,null,null,null,null,null,null,139,"000002346","CHOQUECANCHA","02","06","04","04","0206","000002346 - CHOQUECANCHA"]
[null,null,null,null,null,null,null,null,null,null,null,null,null,140,"000002347","LARES","02","06","04","04","0206","000002347 - LARES"]
[null,null,null,null,null,null,null,null,null,null,null,null,null,141,"000002361","SUYO","02","06","04","04","0206","000002361 - SUYO"]
[null,null,null,null,null,null,null,null,null,null,null,null,null,142,"000007144","PATABAMBA","02","06","04","07","0206","000007144 - PATABAMBA"]
[null,null,null,null,null,null,null,null,null,null,null,null,null,143,"000002515","PAROBAMBA","02","06","11","03","0206","000002515 - PAROBAMBA"]
[null,null,null,null,null,null,null,null,null,null,null,null,null,144,"000007143","OTOCANI","02","06","11","03","0206","000007143 - OTOCANI"]
[null,null,null,null,null,null,null,null,null,null,null,null,null,145,"000000000","(All)","02","07",null,null,"0207","000000000 - (All)"]
[null,null,null,null,null,null,null,null,null,null,null,null,null,146,"000002540","URUBAMBA","02","07","13","01","0207","000002540 - URUBAMBA"]
[null,null,null,null,null,null,null,null,null,null,null,null,null,147,"000002541","YANAHUARA","02","07","13","01","0207","000002541 - YANAHUARA"]
[null,null,null,null,null,null,null,null,null,null,null,null,null,148,"000010060","CAS URUBAMBA -ESSALUD","02","07","13","01","0207","000010060 - CAS URUBAMBA -ESSALUD"]
[null,null,null,null,null,null,null,null,null,null,null,null,null,149,"000030666","MENTAL COMUNITARIO URUBAMBA","02","07","13","01","0207","000030666 - MENTAL COMUNITARIO URUBAMBA"]
[null,null,null,null,null,null,null,null,null,null,null,null,null,150,"000035851","URUBAMBA - ESSALUD","02","07","13","01","0207","000035851 - URUBAMBA - ESSALUD"]
[null,null,null,null,null,null,null,null,null,null,null,null,null,151,"000002543","CHINCHERO","02","07","13","02","0207","000002543 - CHINCHERO"]
[null,null,null,null,null,null,null,null,null,null,null,null,null,152,"000002544","OCCOTUAN","02","07","13","02","0207","000002544 - OCCOTUAN"]
[null,null,null,null,null,null,null,null,null,null,null,null,null,153,"000002545","HUAYLLABAMBA","02","07","13","03","0207","000002545 - HUAYLLABAMBA"]
[null,null,null,null,null,null,null,null,null,null,null,null,null,154,"000002546","MACHUPICCHU","02","07","13","04","0207","000002546 - MACHUPICCHU"]
[null,null,null,null,null,null,null,null,null,null,null,null,null,155,"000002547","COLLPANI","02","07","13","04","0207","000002547 - COLLPANI"]
[null,null,null,null,null,null,null,null,null,null,null,null,null,156,"000006974","CAMINO INCA HUAYLLABAMBA","02","07","13","04","0207","000006974 - CAMINO INCA HUAYLLABAMBA"]
[null,null,null,null,null,null,null,null,null,null,null,null,null,157,"000010073","MACHU PICCHU - ESSALUD","02","07","13","04","0207","000010073 - MACHU PICCHU - ESSALUD"]
[null,null,null,null,null,null,null,null,null,null,null,null,null,158,"000002548","MARAS","02","07","13","05","0207","000002548 - MARAS"]
[null,null,null,null,null,null,null,null,null,null,null,null,null,159,"000010758","CRUZPATA","02","07","13","05","0207","000010758 - CRUZPATA"]
[null,null,null,null,null,null,null,null,null,null,null,null,null,160,"000002549","OLLANTAYTAMBO","02","07","13","06","0207","000002549 - OLLANTAYTAMBO"]
[null,null,null,null,null,null,null,null,null,null,null,null,null,161,"000002550","CHILLCA","02","07","13","06","0207","000002550 - CHILLCA"]
[null,null,null,null,null,null,null,null,null,null,null,null,null,162,"000010760","PATACANCHA","02","07","13","06","0207","000010760 - PATACANCHA"]
[null,null,null,null,null,null,null,null,null,null,null,null,null,163,"000002551","YUCAY","02","07","13","07","0207","000002551 - YUCAY"]
[null,null,null,null,null,null,null,null,null,null,null,null,null,164,"000000000","(All)","02","08",null,null,"0208","000000000 - (All)"]
[null,null,null,null,null,null,null,null,null,null,null,null,null,165,"000002355","LA QUEBRADA","02","08","04","08","0208","000002355 - LA QUEBRADA"]
[null,null,null,null,null,null,null,null,null,null,null,null,null,166,"000002356","CCORIMAYO","02","08","04","08","0208","000002356 - CCORIMAYO"]
[null,null,null,null,null,null,null,null,null,null,null,null,null,167,"000002357","COLCCA YANATILE","02","08","04","08","0208","000002357 - COLCCA YANATILE"]
[null,null,null,null,null,null,null,null,null,null,null,null,null,168,"000002358","MUYUPAY","02","08","04","08","0208","000002358 - MUYUPAY"]
[null,null,null,null,null,null,null,null,null,null,null,null,null,169,"000002359","PUTUCUSI","02","08","04","08","0208","000002359 - PUTUCUSI"]
[null,null,null,null,null,null,null,null,null,null,null,null,null,170,"000002360","QUESQUENTO","02","08","04","08","0208","000002360 - QUESQUENTO"]
[null,null,null,null,null,null,null,null,null,null,null,null,null,171,"000002362","HUACHIBAMBA","02","08","04","08","0208","000002362 - HUACHIBAMBA"]
[null,null,null,null,null,null,null,null,null,null,null,null,null,172,"000006971","COMBAPATA YANATILE","02","08","04","08","0208","000006971 - COMBAPATA YANATILE"]
[null,null,null,null,null,null,null,null,null,null,null,null,null,173,"000006973","BELLAVISTA","02","08","04","08","0208","000006973 - BELLAVISTA"]
[null,null,null,null,null,null,null,null,null,null,null,null,null,174,"000007142","CHANCAMAYO","02","08","04","08","0208","000007142 - CHANCAMAYO"]
[null,null,null,null,null,null,null,null,null,null,null,null,null,175,"000002464","VERSALLES","02","08","09","05","0208","000002464 - VERSALLES"]
[null,null,null,null,null,null,null,null,null,null,null,null,null,176,"000002467","PUENTE SANTIAGO","02","08","09","06","0208","000002467 - PUENTE SANTIAGO"]
[null,null,null,null,null,null,null,null,null,null,null,null,null,177,"000000000","(All)","02","09",null,null,"0209","000000000 - (All)"]
[null,null,null,null,null,null,null,null,null,null,null,null,null,178,"000002290","SAN PEDRO CUSCO","02","09","01","01","0209","000002290 - SAN PEDRO CUSCO"]
[null,null,null,null,null,null,null,null,null,null,null,null,null,179,"000002291","SIETE CUARTONES","02","09","01","01","0209","000002291 - SIETE CUARTONES"]
[null,null,null,null,null,null,null,null,null,null,null,null,null,180,"000002293","MIRAFLORES","02","09","01","01","0209","000002293 - MIRAFLORES"]
[null,null,null,null,null,null,null,null,null,null,null,null,null,{"$f":"+N204+1","v":181},"000002294","PICCHU LA RINCONADA","02","09","01","01","0209","000002294 - PICCHU LA RINCONADA"]
[null,null,null,null,null,null,null,null,null,null,null,null,null,182,"000002295","BUENA VISTA","02","09","01","01","0209","000002295 - BUENA VISTA"]
[null,null,null,null,null,null,null,null,null,null,null,null,null,183,"000002299","POROY","02","09","01","03","0209","000002299 - POROY"]
[null,null,null,null,null,null,null,null,null,null,null,null,null,184,"999999999","(All)","02","99",null,null,"0299","999999999 - (All)"]
[null,null,null,null,null,null,null,null,null,null,null,null,null,185,"000002421","QUILLABAMBA","03","00","09","01","0300","000002421 - QUILLABAMBA"]
[null,null,null,null,null,null,null,null,null,null,null,null,null,186,"000000000","(All)","03","01",null,null,"0301","000000000 - (All)"]
[null,null,null,null,null,null,null,null,null,null,null,null,null,187,"000002422","HUAYANAY","03","01","09","01","0301","000002422 - HUAYANAY"]
[null,null,null,null,null,null,null,null,null,null,null,null,null,188,"000002423","IDMA","03","01","09","01","0301","000002423 - IDMA"]
[null,null,null,null,null,null,null,null,null,null,null,null,null,189,"000002424","POTRERO","03","01","09","01","0301","000002424 - POTRERO"]
[null,null,null,null,null,null,null,null,null,null,null,null,null,190,"000008910","SANTA ANA","03","01","09","01","0301","000008910 - SANTA ANA"]
[null,null,null,null,null,null,null,null,null,null,null,null,null,191,"000010062","QUILLABAMBA - ESSALUD","03","01","09","01","0301","000010062 - QUILLABAMBA - ESSALUD"]
[null,null,null,null,null,null,null,null,null,null,null,null,null,192,"000011744","POSTA MEDICO POLICIAL LA CONVENCION - QUILLABAMBA","03","01","09","01","0301","000011744 - POSTA MEDICO POLICIAL LA CONVENCION - QUILLABAMBA"]
[null,null,null,null,null,null,null,null,null,null,null,null,null,193,"000015842","PAVAYOC","03","01","09","01",{"$f":"CONCATENATE(Q217,R217)","v":"0301"},{"$f":"CONCATENATE(O217,\" - \",P217)","v":"000015842 - PAVAYOC"}]
[null,null,null,null,null,null,null,null,null,null,null,null,null,194,"000024653","INPE QUILLABAMBA","03","01","09","01","0301","000024653 - INPE QUILLABAMBA"]
[null,null,null,null,null,null,null,null,null,null,null,null,null,195,"000026386","MENTAL QUILLABAMBA","03","01","09","01","0301","000026386 - MENTAL QUILLABAMBA"]
[null,null,null,null,null,null,null,null,null,null,null,null,null,196,"000002425","ECHARATE","03","01","09","02","0301","000002425 - ECHARATE"]
[null,null,null,null,null,null,null,null,null,null,null,null,null,197,"000002430","PAMPA CONCEPCION","03","01","09","02","0301","000002430 - PAMPA CONCEPCION"]
[null,null,null,null,null,null,null,null,null,null,null,null,null,198,"000002446","CHACCO","03","01","09","02","0301","000002446 - CHACCO"]
[null,null,null,null,null,null,null,null,null,null,null,null,null,199,"000002451","CHAHUARES","03","01","09","02","0301","000002451 - CHAHUARES"]
[null,null,null,null,null,null,null,null,null,null,null,null,null,200,"000033273","SAN ISIDRO LABRADOR - ECHARATI","03","01","09","02","0301","000033273 - SAN ISIDRO LABRADOR - ECHARATI"]
[null,null,null,null,null,null,null,null,null,null,null,null,null,201,"000024296","EJERCITO-MIARIA 334","03","01","09","02","0301","000024296 - EJERCITO-MIARIA 334"]
[null,null,null,null,null,null,null,null,null,null,null,null,null,202,"000000000","(All)","03","02",null,null,"0302","000000000 - (All)"]
[null,null,null,null,null,null,null,null,null,null,null,null,null,203,"000002453","HUYRO","03","02","09","03","0302","000002453 - HUYRO"]
[null,null,null,null,null,null,null,null,null,null,null,null,null,204,"000002454","ALFAMAYO","03","02","09","03","0302","000002454 - ALFAMAYO"]
[null,null,null,null,null,null,null,null,null,null,null,null,null,205,"000002455","HUAYOPATA","03","02","09","03","0302","000002455 - HUAYOPATA"]
[null,null,null,null,null,null,null,null,null,null,null,null,null,206,"000002456","AMAYBAMBA","03","02","09","03","0302","000002456 - AMAYBAMBA"]
[null,null,null,null,null,null,null,null,null,null,null,null,null,207,"000002457","SAN PABLO HUAYOPATA","03","02","09","03","0302","000002457 - SAN PABLO HUAYOPATA"]
[null,null,null,null,null,null,null,null,null,null,null,null,null,208,"000010075","CAP HUYRO - ESSALUD","03","02","09","03","0302","000010075 - CAP HUYRO - ESSALUD"]
[null,null,null,null,null,null,null,null,null,null,null,null,null,209,"000002458","MARANURA","03","02","09","04","0302","000002458 - MARANURA"]
[null,null,null,null,null,null,null,null,null,null,null,null,null,210,"000002460","SANTA MARIA","03","02","09","04","0302","000002460 - SANTA MARIA"]
[null,null,null,null,null,null,null,null,null,null,null,null,null,211,"000002461","UCHUMAYO","03","02","09","04","0302","000002461 - UCHUMAYO"]
[null,null,null,null,null,null,null,null,null,null,null,null,null,212,"000002476","SANTA TERESA","03","02","09","08","0302","000002476 - SANTA TERESA"]
[null,null,null,null,null,null,null,null,null,null,null,null,null,213,"000002477","SULLUCUYOC","03","02","09","08","0302","000002477 - SULLUCUYOC"]
[null,null,null,null,null,null,null,null,null,null,null,null,null,214,"000002478","TOTORA","03","02","09","08","0302","000002478 - TOTORA"]
[null,null,null,null,null,null,null,null,null,null,null,null,null,215,"000000000","(All)","03","03",null,null,"0303","000000000 - (All)"]
[null,null,null,null,null,null,null,null,null,null,null,null,null,216,"000002363","TUPAC AMARU QUELLOUNO","03","03","04","08","0303","000002363 - TUPAC AMARU QUELLOUNO"]
[null,null,null,null,null,null,null,null,null,null,null,null,null,217,"000002462","OCCOBAMBA LACONVENCION","03","03","09","05","0303","000002462 - OCCOBAMBA LACONVENCION"]
[null,null,null,null,null,null,null,null,null,null,null,null,null,218,"000002463","CHINGANILLA","03","03","09","05","0303","000002463 - CHINGANILLA"]
[null,null,null,null,null,null,null,null,null,null,null,null,null,219,"000002465","QUELLOUNO","03","03","09","06","0303","000002465 - QUELLOUNO"]
[null,null,null,null,null,null,null,null,null,null,null,null,null,220,"000002466","HUILLCAPAMPA","03","03","09","06","0303","000002466 - HUILLCAPAMPA"]
[null,null,null,null,null,null,null,null,null,null,null,null,null,221,"000002468","SAN MARTIN","03","03","09","06","0303","000002468 - SAN MARTIN"]
[null,null,null,null,null,null,null,null,null,null,null,null,null,222,"000008906","ESTRELLA","03","03","09","06","0303","000008906 - ESTRELLA"]
[null,null,null,null,null,null,null,null,null,null,null,null,null,223,"000008907","MATORIATO","03","03","09","06","0303","000008907 - MATORIATO"]
[null,null,null,null,null,null,null,null,null,null,null,null,null,224,"000008908","CHIRUMBIA","03","03","09","06","0303","000008908 - CHIRUMBIA"]
[null,null,null,null,null,null,null,null,null,null,null,null,null,225,"000008909","CHAPO BOYERO","03","03","09","06","0303","000008909 - CHAPO BOYERO"]
[null,null,null,null,null,null,null,null,null,null,null,null,null,226,"000000000","(All)","03","04",null,null,"0304","000000000 - (All)"]
[null,null,null,null,null,null,null,null,null,null,null,null,null,227,"000002427","KITENI","03","04","09","02","0304","000002427 - KITENI"]
[null,null,null,null,null,null,null,null,null,null,null,null,null,228,"000002431","IVOCHOTE","03","04","09","02","0304","000002431 - IVOCHOTE"]
[null,null,null,null,null,null,null,null,null,null,null,null,null,229,"000002438","PACHIRI","03","04","09","02","0304","000002438 - PACHIRI"]
[null,null,null,null,null,null,null,null,null,null,null,null,null,230,"000002440","PANGOA","03","04","09","02","0304","000002440 - PANGOA"]
[null,null,null,null,null,null,null,null,null,null,null,null,null,231,"000002443","SANIRIATO","03","04","09","02","0304","000002443 - SANIRIATO"]
[null,null,null,null,null,null,null,null,null,null,null,null,null,232,"000002447","KAMANQUIRIATO","03","04","09","02","0304","000002447 - KAMANQUIRIATO"]
[null,null,null,null,null,null,null,null,null,null,null,null,null,233,"000014531","CAP I ECHARATE - KITENI","03","04","09","02","0304","000014531 - CAP I ECHARATE - KITENI"]
[null,null,null,null,null,null,null,null,null,null,null,null,null,234,"000024583","BCT N° 314 - KEPASHIATO","03","04","09","02","0304","000024583 - BCT N° 314 - KEPASHIATO"]
[null,null,null,null,null,null,null,null,null,null,null,null,null,235,"000002489","YUVENI","03","04","09","09","0304","000002489 - YUVENI"]
[null,null,null,null,null,null,null,null,null,null,null,null,null,236,"000002493","SELVA ALEGRE","03","04","09","09","0304","000002493 - SELVA ALEGRE"]
[null,null,null,null,null,null,null,null,null,null,null,null,null,237,"000006976","CHONTABAMBA","03","04","09","09","0304","000006976 - CHONTABAMBA"]
[null,null,null,null,null,null,null,null,null,null,null,null,null,238,"000002432","KEPASHIATO","03","04","09","15","0304","000002432 - KEPASHIATO"]
[null,null,null,null,null,null,null,null,null,null,null,null,null,239,"000002434","MATERIATO","03","04","09","15","0304","000002434 - MATERIATO"]
[null,null,null,null,null,null,null,null,null,null,null,null,null,240,"000013068","TRIO RIO","03","04","09","15","0304","000013068 - TRIO RIO"]
[null,null,null,null,null,null,null,null,null,null,null,null,null,241,"000013069","PUGUIENTIMARI","03","04","09","15","0304","000013069 - PUGUIENTIMARI"]
[null,null,null,null,null,null,null,null,null,null,null,null,null,242,"000000000","(All)","03","05",null,null,"0305","000000000 - (All)"]
[null,null,null,null,null,null,null,null,null,null,null,null,null,243,"000002426","KIRIGUETI","03","05","09","14","0305","000002426 - KIRIGUETI"]
[null,null,null,null,null,null,null,null,null,null,null,null,null,244,"000002428","CHOCORIARI","03","05","09","14","0305","000002428 - CHOCORIARI"]
[null,null,null,null,null,null,null,null,null,null,null,null,null,{"$f":"+N268+1","v":245},"000002435","MIARIA","03","05","09","14","0305","000002435 - MIARIA"]
[null,null,null,null,null,null,null,null,null,null,null,null,null,246,"000002436","NUEVA LUZ","03","05","09","14","0305","000002436 - NUEVA LUZ"]
[null,null,null,null,null,null,null,null,null,null,null,null,null,247,"000002437","NUEVO MUNDO","03","05","09","14","0305","000002437 - NUEVO MUNDO"]
[null,null,null,null,null,null,null,null,null,null,null,null,null,248,"000002441","PUERTO HUALLANA","03","05","09","14","0305","000002441 - PUERTO HUALLANA"]
[null,null,null,null,null,null,null,null,null,null,null,null,null,249,"000002442","PUERTO RICO","03","05","09","14","0305","000002442 - PUERTO RICO"]
[null,null,null,null,null,null,null,null,null,null,null,null,null,250,"000002444","SENSA","03","05","09","14","0305","000002444 - SENSA"]
[null,null,null,null,null,null,null,null,null,null,null,null,null,251,"000002445","TIMPIA","03","05","09","14","0305","000002445 - TIMPIA"]
[null,null,null,null,null,null,null,null,null,null,null,null,null,252,"000002448","KAMISEA","03","05","09","14","0305","000002448 - KAMISEA"]
[null,null,null,null,null,null,null,null,null,null,null,null,null,253,"000002452","SHIVANKORENI","03","05","09","14","0305","000002452 - SHIVANKORENI"]
[null,null,null,null,null,null,null,null,null,null,null,null,null,254,"000013066","MONTETONI","03","05","09","14","0305","000013066 - MONTETONI"]
[null,null,null,null,null,null,null,null,null,null,null,null,null,255,"000013067","TANGOSHIARI","03","05","09","14","0305","000013067 - TANGOSHIARI"]
[null,null,null,null,null,null,null,null,null,null,null,null,null,256,"000015235","NUEVA VIDA","03","05","09","14","0305","000015235 - NUEVA VIDA"]
[null,null,null,null,null,null,null,null,null,null,null,null,null,257,"000015843","CASHIRIARI","03","05","09","14",{"$f":"CONCATENATE(Q281,R281)","v":"0305"},{"$f":"CONCATENATE(O281,\" - \",P281)","v":"000015843 - CASHIRIARI"}]
[null,null,null,null,null,null,null,null,null,null,null,null,null,258,"000015844","CAMANA","03","05","09","14","0305","000015844 - CAMANA"]
[null,null,null,null,null,null,null,null,null,null,null,null,null,259,"000000000","(All)","03","06",null,null,"0306","000000000 - (All)"]
[null,null,null,null,null,null,null,null,null,null,null,null,null,260,"000002480","PUCYURA","03","06","09","09","0306","000002480 - PUCYURA"]
[null,null,null,null,null,null,null,null,null,null,null,null,null,261,"000002484","OYARA","03","06","09","09","0306","000002484 - OYARA"]
[null,null,null,null,null,null,null,null,null,null,null,null,null,262,"000002486","PAMPACONAS","03","06","09","09","0306","000002486 - PAMPACONAS"]
[null,null,null,null,null,null,null,null,null,null,null,null,null,263,"000002490","ARMA","03","06","09","09","0306","000002490 - ARMA"]
[null,null,null,null,null,null,null,null,null,null,null,null,null,264,"000002492","PALTAYBAMBA","03","06","09","09","0306","000002492 - PALTAYBAMBA"]
[null,null,null,null,null,null,null,null,null,null,null,null,null,265,"000002481","CCARCCO","03","06","09","11","0306","000002481 - CCARCCO"]
[null,null,null,null,null,null,null,null,null,null,null,null,null,266,"000002482","INCAHUASI","03","06","09","11","0306","000002482 - INCAHUASI"]
[null,null,null,null,null,null,null,null,null,null,null,null,null,267,"000002485","PACCAYBAMBA","03","06","09","11","0306","000002485 - PACCAYBAMBA"]
[null,null,null,null,null,null,null,null,null,null,null,null,null,268,"000002487","CHOQUETIRA","03","06","09","11","0306","000002487 - CHOQUETIRA"]
[null,null,null,null,null,null,null,null,null,null,null,null,null,269,"000002491","LUCMAHUAYCO","03","06","09","11","0306","000002491 - LUCMAHUAYCO"]
[null,null,null,null,null,null,null,null,null,null,null,null,null,270,"000035520","CHANCAVINE","03","06","09","12","0306","000035520 - CHANCAVINE"]
[null,null,null,null,null,null,null,null,null,null,null,null,null,271,"000000000","(All)","03","07",null,null,"0307","000000000 - (All)"]
[null,null,null,null,null,null,null,null,null,null,null,null,null,272,"000002429","CIRIALO","03","07","09","02","0307","000002429 - CIRIALO"]
[null,null,null,null,null,null,null,null,null,null,null,null,null,273,"000002433","KORIBENI","03","07","09","02","0307","000002433 - KORIBENI"]
[null,null,null,null,null,null,null,null,null,null,null,null,null,274,"000002439","PALMA REAL","03","07","09","02","0307","000002439 - PALMA REAL"]
[null,null,null,null,null,null,null,null,null,null,null,null,null,275,"000002449","ICHIQUIATO","03","07","09","02","0307","000002449 - ICHIQUIATO"]
[null,null,null,null,null,null,null,null,null,null,null,null,null,276,"000002450","SAN ANTONIO","03","07","09","02","0307","000002450 - SAN ANTONIO"]
[null,null,null,null,null,null,null,null,null,null,null,null,null,277,"999999999","(All)","03","99",null,null,"0399","999999999 - (All)"]
[null,null,null,null,null,null,null,null,null,null,null,null,null,278,"000000000","(All)","04","00",null,null,"0400","000000000 - (All)"]
[null,null,null,null,null,null,null,null,null,null,null,null,null,279,"000002378","SICUANI","04","00","06","01","0400","000002378 - SICUANI"]
[null,null,null,null,null,null,null,null,null,null,null,null,null,280,"000007135","ESPINAR","04","00","08","01","0400","000007135 - ESPINAR"]
[null,null,null,null,null,null,null,null,null,null,null,null,null,281,"000000000","(All)","04","01",null,null,"0401","000000000 - (All)"]
[null,null,null,null,null,null,null,null,null,null,null,null,null,282,"000002364","YANAOCA","04","01","05","01","0401","000002364 - YANAOCA"]
[null,null,null,null,null,null,null,null,null,null,null,null,null,283,"000002365","PONGOÑA","04","01","05","01","0401","000002365 - PONGOÑA"]
[null,null,null,null,null,null,null,null,null,null,null,null,null,284,"000018241","HAMPATURA","04","01","05","01","0401","000018241 - HAMPATURA"]
[null,null,null,null,null,null,null,null,null,null,null,null,null,285,"000002367","CHITIBAMBA","04","01","05","02","0401","000002367 - CHITIBAMBA"]
[null,null,null,null,null,null,null,null,null,null,null,null,null,286,"000002372","PAMPAMARCA","04","01","05","06","0401","000002372 - PAMPAMARCA"]
[null,null,null,null,null,null,null,null,null,null,null,null,null,287,"000002373","QUEHUE","04","01","05","07","0401","000002373 - QUEHUE"]
[null,null,null,null,null,null,null,null,null,null,null,null,null,288,"000002374","HUINCHIRI","04","01","05","07","0401","000002374 - HUINCHIRI"]
[null,null,null,null,null,null,null,null,null,null,null,null,null,289,"000034449","CHAUPIBANDA","04","01","05","07","0401","000034449 - CHAUPIBANDA"]
[null,null,null,null,null,null,null,null,null,null,null,null,null,290,"000002375","SURIMANA","04","01","05","08","0401","000002375 - SURIMANA"]
[null,null,null,null,null,null,null,null,null,null,null,null,null,291,"000002376","TUNGASUCA","04","01","05","08","0401","000002376 - TUNGASUCA"]
[null,null,null,null,null,null,null,null,null,null,null,null,null,292,"000002377","TOCCOCCORI","04","01","05","08","0401","000002377 - TOCCOCCORI"]
[null,null,null,null,null,null,null,null,null,null,null,null,null,293,"000032339","CCOCHAPATA","04","01","05","08","0401","000032339 - CCOCHAPATA"]
[null,null,null,null,null,null,null,null,null,null,null,null,null,294,"000000000","(All)","04","02",null,null,"0402","000000000 - (All)"]
[null,null,null,null,null,null,null,null,null,null,null,null,null,295,"000002366","CHECCA","04","02","05","02","0402","000002366 - CHECCA"]
[null,null,null,null,null,null,null,null,null,null,null,null,null,296,"000007700","EL DESCANSO","04","02","05","03","0402","000007700 - EL DESCANSO"]
[null,null,null,null,null,null,null,null,null,null,null,null,null,297,"000002369","LANGUI","04","02","05","04","0402","000002369 - LANGUI"]
[null,null,null,null,null,null,null,null,null,null,null,null,null,298,"000002370","CONDEVILUYO","04","02","05","04","0402","000002370 - CONDEVILUYO"]
[null,null,null,null,null,null,null,null,null,null,null,null,null,299,"000002371","LAYO","04","02","05","05","0402","000002371 - LAYO"]
[null,null,null,null,null,null,null,null,null,null,null,null,null,300,"000000000","(All)","04","03",null,null,"0403","000000000 - (All)"]
[null,null,null,null,null,null,null,null,null,null,null,null,null,301,"000002320","MOSOCLLACTA","04","03","02","04","0403","000002320 - MOSOCLLACTA"]
[null,null,null,null,null,null,null,null,null,null,null,null,null,302,"000034929","CHECACUPE","04","03","06","02","0403","000034929 - CHECACUPE"]
[null,null,null,null,null,null,null,null,null,null,null,null,null,303,"000002386","COMBAPATA CANCHIS","04","03","06","03","0403","000002386 - COMBAPATA CANCHIS"]
[null,null,null,null,null,null,null,null,null,null,null,null,null,304,"000034448","CHIARA","04","03","06","03","0403","000034448 - CHIARA"]
[null,null,null,null,null,null,null,null,null,null,null,null,null,305,"000034887","PITUMARCA","04","03","06","05","0403","000034887 - PITUMARCA"]
[null,null,null,null,null,null,null,null,null,null,null,null,null,306,"000002397","TINTA","04","03","06","08","0403","000002397 - TINTA"]
[null,null,null,null,null,null,null,null,null,null,null,null,null,307,"000000000","(All)","04","04",null,null,"0404","000000000 - (All)"]
[null,null,null,null,null,null,null,null,null,null,null,null,null,308,"000002379","HERCCA","04","04","06","01","0404","000002379 - HERCCA"]
[null,null,null,null,null,null,null,null,null,null,null,null,null,{"$f":"+N332+1","v":309},"000002380","TECHO OBRERO","04","04","06","01","0404","000002380 - TECHO OBRERO"]
[null,null,null,null,null,null,null,null,null,null,null,null,null,310,"000010063","ESSALUD SICUANI","04","04","06","01","0404","000010063 - ESSALUD SICUANI"]
[null,null,null,null,null,null,null,null,null,null,null,null,null,311,"000024639","INPE SICUANI","04","04","06","01","0404","000024639 - INPE SICUANI"]
[null,null,null,null,null,null,null,null,null,null,null,null,null,312,"000024663","SANIDAD PNP  SICUANI","04","04","06","01","0404","000024663 - SANIDAD PNP  SICUANI"]
[null,null,null,null,null,null,null,null,null,null,null,null,null,313,"000002388","MARANGANI","04","04","06","04","0404","000002388 - MARANGANI"]
[null,null,null,null,null,null,null,null,null,null,null,null,null,314,"000002389","CHECTUYOC","04","04","06","04","0404","000002389 - CHECTUYOC"]
[null,null,null,null,null,null,null,null,null,null,null,null,null,315,"000002390","CCUYO","04","04","06","04","0404","000002390 - CCUYO"]
[null,null,null,null,null,null,null,null,null,null,null,null,null,316,"000002391","OCCOBAMBA MARANGANI","04","04","06","04","0404","000002391 - OCCOBAMBA MARANGANI"]
[null,null,null,null,null,null,null,null,null,null,null,null,null,317,"000000000","(All)","04","05",null,null,"0405","000000000 - (All)"]
[null,null,null,null,null,null,null,null,null,null,null,null,null,318,"000002381","QUEHUAR","04","05","06","01","0405","000002381 - QUEHUAR"]
[null,null,null,null,null,null,null,null,null,null,null,null,null,319,"000002382","UZCUPATA","04","05","06","01","0405","000002382 - UZCUPATA"]
[null,null,null,null,null,null,null,null,null,null,null,null,null,320,"000002383","LA FLORIDA","04","05","06","01","0405","000002383 - LA FLORIDA"]
[null,null,null,null,null,null,null,null,null,null,null,null,null,321,"000026387","MENTAL COMUNITARIO SICUANI","04","05","06","01","0405","000026387 - MENTAL COMUNITARIO SICUANI"]
[null,null,null,null,null,null,null,null,null,null,null,null,null,322,"000032923","SR DE PAMPACUCHO-SICUANI","04","05","06","01","0405","000032923 - SR DE PAMPACUCHO-SICUANI"]
[null,null,null,null,null,null,null,null,null,null,null,null,null,323,"000035845","PAMPAPHALLA","04","05","06","01","0405","000035845 - PAMPAPHALLA"]
[null,null,null,null,null,null,null,null,null,null,null,null,null,324,"000035848","MENTAL COMUNITARIO SICUANI","04","05","06","01",{"$f":"CONCATENATE(Q348,R348)","v":"0405"},{"$f":"CONCATENATE(O348,\" - \",P348)","v":"000035848 - MENTAL COMUNITARIO SICUANI"}]
[null,null,null,null,null,null,null,null,null,null,null,null,null,325,"000002393","PHINAYA","04","05","06","05","0405","000002393 - PHINAYA"]
[null,null,null,null,null,null,null,null,null,null,null,null,null,326,"000002394","SAN PABLO CANCHIS","04","05","06","06","0405","000002394 - SAN PABLO CANCHIS"]
[null,null,null,null,null,null,null,null,null,null,null,null,null,327,"000002395","SANTA BARBARA","04","05","06","06","0405","000002395 - SANTA BARBARA"]
[null,null,null,null,null,null,null,null,null,null,null,null,null,328,"000002396","SAN PEDRO CANCHIS","04","05","06","07","0405","000002396 - SAN PEDRO CANCHIS"]
[null,null,null,null,null,null,null,null,null,null,null,null,null,329,"000000000","(All)","04","06",null,null,"0406","000000000 - (All)"]
[null,null,null,null,null,null,null,null,null,null,null,null,null,330,"000002410","YAURI","04","06","08","01","0406","000002410 - YAURI"]
[null,null,null,null,null,null,null,null,null,null,null,null,null,331,"000006745","TINTAYA MARQUIRI","04","06","08","01","0406","000006745 - TINTAYA MARQUIRI"]
[null,null,null,null,null,null,null,null,null,null,null,null,null,332,"000010061","ESPINAR - ESSALUD","04","06","08","01","0406","000010061 - ESPINAR - ESSALUD"]
[null,null,null,null,null,null,null,null,null,null,null,null,null,333,"000030366","MENTAL COMUNITARIO ESPINAR \"MUSUQ KAWSAY\"","04","06","08","01","0406","000030366 - MENTAL COMUNITARIO ESPINAR \"MUSUQ KAWSAY\""]
[null,null,null,null,null,null,null,null,null,null,null,null,null,334,"000002411","CONDOROMA","04","06","08","02","0406","000002411 - CONDOROMA"]
[null,null,null,null,null,null,null,null,null,null,null,null,null,335,"000002412","COPORAQUE","04","06","08","03","0406","000002412 - COPORAQUE"]
[null,null,null,null,null,null,null,null,null,null,null,null,null,336,"000002413","URINSAYA","04","06","08","03","0406","000002413 - URINSAYA"]
[null,null,null,null,null,null,null,null,null,null,null,null,null,337,"000002414","HUAYHUAHUASI","04","06","08","03","0406","000002414 - HUAYHUAHUASI"]
[null,null,null,null,null,null,null,null,null,null,null,null,null,338,"000002415","OCCORURO","04","06","08","04","0406","000002415 - OCCORURO"]
[null,null,null,null,null,null,null,null,null,null,null,null,null,339,"000002416","PALLPATA","04","06","08","05","0406","000002416 - PALLPATA"]
[null,null,null,null,null,null,null,null,null,null,null,null,null,340,"000002418","SAN MIGUEL","04","06","08","06","0406","000002418 - SAN MIGUEL"]
[null,null,null,null,null,null,null,null,null,null,null,null,null,341,"000034450","PICHIGUA ESPINAR","04","06","08","06","0406","000034450 - PICHIGUA ESPINAR"]
[null,null,null,null,null,null,null,null,null,null,null,null,null,342,"000002419","SUYKUTAMBO","04","06","08","07","0406","000002419 - SUYKUTAMBO"]
[null,null,null,null,null,null,null,null,null,null,null,null,null,343,"000002420","ACCOCUNCA","04","06","08","08","0406","000002420 - ACCOCUNCA"]
[null,null,null,null,null,null,null,null,null,null,null,null,null,344,"999999999","(All)","04","99",null,null,"0499","999999999 - (All)"]
[null,null,null,null,null,null,null,null,null,null,null,null,null,345,"000002469","SAN JUAN DE KIMBIRI-VRAEM","05","00","09","07","0500","000002469 - SAN JUAN DE KIMBIRI-VRAEM"]
[null,null,null,null,null,null,null,null,null,null,null,null,null,346,"000000000","(All)","05","01",null,null,"0501","000000000 - (All)"]
[null,null,null,null,null,null,null,null,null,null,null,null,null,347,"000002472","MAPITUNARI","05","01","09","07","0501","000002472 - MAPITUNARI"]
[null,null,null,null,null,null,null,null,null,null,null,null,null,348,"000002474","SAMANIATO","05","01","09","07","0501","000002474 - SAMANIATO"]
[null,null,null,null,null,null,null,null,null,null,null,null,null,349,"000002475","KIMBIRI ALTO","05","01","09","07","0501","000002475 - KIMBIRI ALTO"]
[null,null,null,null,null,null,null,null,null,null,null,null,null,350,"000008285","ANGELES","05","01","09","07","0501","000008285 - ANGELES"]
[null,null,null,null,null,null,null,null,null,null,null,null,null,351,"000002479","VILLA VIRGEN","05","01","09","12","0501","000002479 - VILLA VIRGEN"]
[null,null,null,null,null,null,null,null,null,null,null,null,null,352,"000024957","BTC LA OROYA  N°34 VILLA VIRGEN","05","01","09","12","0501","000024957 - BTC LA OROYA  N°34 VILLA VIRGEN"]
[null,null,null,null,null,null,null,null,null,null,null,null,null,353,"000002488","VILLA KINTIARINA","05","01","09","13","0501","000002488 - VILLA KINTIARINA"]
[null,null,null,null,null,null,null,null,null,null,null,null,null,354,"000008283","PUEBLO LIBRE","05","01","09","13","0501","000008283 - PUEBLO LIBRE"]
[null,null,null,null,null,null,null,null,null,null,null,null,null,355,"000002470","CHIRUMPIARI","05","01","09","16","0501","000002470 - CHIRUMPIARI"]
[null,null,null,null,null,null,null,null,null,null,null,null,null,356,"000002471","LOBO TAHUANTINSUYO","05","01","09","17","0501","000002471 - LOBO TAHUANTINSUYO"]
[null,null,null,null,null,null,null,null,null,null,null,null,null,357,"000002473","UNION ROSALES","05","01","09","17","0501","000002473 - UNION ROSALES"]
[null,null,null,null,null,null,null,null,null,null,null,null,null,358,"000008284","MANITEA ALTA","05","01","09","17","0501","000008284 - MANITEA ALTA"]
[null,null,null,null,null,null,null,null,null,null,null,null,null,359,"000000000","(All)","05","02",null,null,"0502","000000000 - (All)"]
[null,null,null,null,null,null,null,null,null,null,null,null,null,360,"000002496","OMAYA","05","02","09","10","0502","000002496 - OMAYA"]
[null,null,null,null,null,null,null,null,null,null,null,null,null,361,"000002497","OTARI","05","02","09","10","0502","000002497 - OTARI"]
[null,null,null,null,null,null,null,null,null,null,null,null,null,362,"000002498","PUERTO MAYO","05","02","09","10","0502","000002498 - PUERTO MAYO"]
[null,null,null,null,null,null,null,null,null,null,null,null,null,363,"000007113","NATIVIDAD","05","02","09","10","0502","000007113 - NATIVIDAD"]
[null,null,null,null,null,null,null,null,null,null,null,null,null,364,"000007114","QUISTO CENTRAL","05","02","09","10","0502","000007114 - QUISTO CENTRAL"]
[null,null,null,null,null,null,null,null,null,null,null,null,null,365,"000015104","TAMBO DEL ENE","05","02","09","10","0502","000015104 - TAMBO DEL ENE"]
[null,null,null,null,null,null,null,null,null,null,null,null,null,366,"000015170","PICHARI BAJA","05","02","09","10","0502","000015170 - PICHARI BAJA"]
[null,null,null,null,null,null,null,null,null,null,null,null,null,367,"000024638","MILITAR PICHARI","05","02","09","10","0502","000024638 - MILITAR PICHARI"]
[null,null,null,null,null,null,null,null,null,null,null,null,null,368,"000027230","MEDICA POLICIAL PICHARI","05","02","09","10","0502","000027230 - MEDICA POLICIAL PICHARI"]
[null,null,null,null,null,null,null,null,null,null,null,null,null,369,"000027948","ESSALUD PICHARI","05","02","09","10","0502","000027948 - ESSALUD PICHARI"]
[null,null,null,null,null,null,null,null,null,null,null,null,null,370,"000032211","NUEVO PROGRESO","05","02","09","10","0502","000032211 - NUEVO PROGRESO"]
[null,null,null,null,null,null,null,null,null,null,null,null,null,371,"000033988","MENTAL COMUNITARIO PICHARI","05","02","09","10","0502","000033988 - MENTAL COMUNITARIO PICHARI"]
[null,null,null,null,null,null,null,null,null,null,null,null,null,372,"000034418","PICHARI VRAEM","05","02","09","10","0502","000034418 - PICHARI VRAEM"]
[null,null,null,null,null,null,null,null,null,null,null,null,null,{"$f":"+N396+1","v":373},"000024637","EJERCITO-INCAHUASI 331","05","02","09","10","0502","000024637 - EJERCITO-INCAHUASI 331"]
[null,null,null,null,null,null,null,null,null,null,null,null,null,374,"000034417","CAP I ECHARATE - KITENI","05","02","09","10","0502","000034417 - CAP I ECHARATE - KITENI"]
[null,null,null,null,null,null,null,null,null,null,null,null,null,375,"000002495","MANTARO","05","02","09","18","0502","000002495 - MANTARO"]
[null,null,null,null,null,null,null,null,null,null,null,null,null,376,"000015169","PITIRINQUINI","05","02","09","18","0502","000015169 - PITIRINQUINI"]
[null,null,null,null,null,null,null,null,null,null,null,null,null,377,"999999999","(All)","05","99",null,null,"0599","999999999 - (All)"]
[null,null,null,null,null,null,null,null,null,null,null,null,null,378,"000002398","SANTO TOMAS","06","00","07","01","0600","000002398 - SANTO TOMAS"]
[null,null,null,null,null,null,null,null,null,null,null,null,null,379,"000000000","(All)","06","01",null,null,"0601","000000000 - (All)"]
[null,null,null,null,null,null,null,null,null,null,null,null,null,380,"000035864","CANGALLE","06","01","07","01","0601","000035864 - CANGALLE"]
[null,null,null,null,null,null,null,null,null,null,null,null,null,381,"000002402","CHAMACA","06","01","07","03","0601","000002402 - CHAMACA"]
[null,null,null,null,null,null,null,null,null,null,null,null,null,382,"000002403","AÑAHUICHI","06","01","07","03","0601","000002403 - AÑAHUICHI"]
[null,null,null,null,null,null,null,null,null,null,null,null,null,383,"000016328","UCCHUCCARCCO","06","01","07","03","0601","000016328 - UCCHUCCARCCO"]
[null,null,null,null,null,null,null,null,null,null,null,null,null,384,"000016329","INGATA","06","01","07","03","0601","000016329 - INGATA"]
[null,null,null,null,null,null,null,null,null,null,null,null,null,385,"000016330","CCONCHACCOLLO","06","01","07","03","0601","000016330 - CCONCHACCOLLO"]
[null,null,null,null,null,null,null,null,null,null,null,null,null,386,"000035861","CCACHO","06","01","07","03","0601","000035861 - CCACHO"]
[null,null,null,null,null,null,null,null,null,null,null,null,null,387,"000035863","TINCURCA","06","01","07","03","0601","000035863 - TINCURCA"]
[null,null,null,null,null,null,null,null,null,null,null,null,null,388,"000002406","LIVITACA","06","01","07","05","0601","000002406 - LIVITACA"]
[null,null,null,null,null,null,null,null,null,null,null,null,null,389,"000016325","CHILLOROYA - LIVITACA","06","01","07","05","0601","000016325 - CHILLOROYA - LIVITACA"]
[null,null,null,null,null,null,null,null,null,null,null,null,null,390,"000016327","AUSANTA","06","01","07","05","0601","000016327 - AUSANTA"]
[null,null,null,null,null,null,null,null,null,null,null,null,null,391,"000016332","PATAQUEÑA - LIVITACA","06","01","07","05","0601","000016332 - PATAQUEÑA - LIVITACA"]
[null,null,null,null,null,null,null,null,null,null,null,null,null,392,"000016334","KISIO","06","01","07","05","0601","000016334 - KISIO"]
[null,null,null,null,null,null,null,null,null,null,null,null,null,393,"000025739","PISQUICOCHA","06","01","07","05","0601","000025739 - PISQUICOCHA"]
[null,null,null,null,null,null,null,null,null,null,null,null,null,394,"000025740","TOTORA - REYNA DE LOS ANGELES","06","01","07","05","0601","000025740 - TOTORA - REYNA DE LOS ANGELES"]
[null,null,null,null,null,null,null,null,null,null,null,null,null,395,"000035860","KAYNO","06","01","07","05",{"$f":"CONCATENATE(Q419,R419)","v":"0601"},{"$f":"CONCATENATE(O419,\" - \",P419)","v":"000035860 - KAYNO"}]
[null,null,null,null,null,null,null,null,null,null,null,null,null,396,"000035862","SANTA ISABEL JALCCO","06","01","07","05","0601","000035862 - SANTA ISABEL JALCCO"]
[null,null,null,null,null,null,null,null,null,null,null,null,null,397,"000000000","(All)","06","09",null,null,"0609","000000000 - (All)"]
[null,null,null,null,null,null,null,null,null,null,null,null,null,398,"000002399","PULPERA","06","09","07","01","0609","000002399 - PULPERA"]
[null,null,null,null,null,null,null,null,null,null,null,null,null,399,"000002400","ALHUACCHULLO","06","09","07","01","0609","000002400 - ALHUACCHULLO"]
[null,null,null,null,null,null,null,null,null,null,null,null,null,400,"000006746","LLIQUE","06","09","07","01","0609","000006746 - LLIQUE"]
[null,null,null,null,null,null,null,null,null,null,null,null,null,401,"000006981","CCOYO","06","09","07","01","0609","000006981 - CCOYO"]
[null,null,null,null,null,null,null,null,null,null,null,null,null,402,"000006982","MELLOTOTORA","06","09","07","01","0609","000006982 - MELLOTOTORA"]
[null,null,null,null,null,null,null,null,null,null,null,null,null,403,"000006983","ORCCOMA","06","09","07","01","0609","000006983 - ORCCOMA"]
[null,null,null,null,null,null,null,null,null,null,null,null,null,404,"000007111","YAVINA","06","09","07","01",{"$f":"CONCATENATE(Q428,R428)","v":"0609"},{"$f":"CONCATENATE(O428,\" - \",P428)","v":"000007111 - YAVINA"}]
[null,null,null,null,null,null,null,null,null,null,null,null,null,405,"000008915","PFULLPURI CONDEPAMPA","06","09","07","01","0609","000008915 - PFULLPURI CONDEPAMPA"]
[null,null,null,null,null,null,null,null,null,null,null,null,null,406,"000013185","CAP I SANTO TOMÁS  ESSALUD","06","09","07","01","0609","000013185 - CAP I SANTO TOMÁS  ESSALUD"]
[null,null,null,null,null,null,null,null,null,null,null,null,null,407,"000030940","ARCANGEL SAN MIGUEL DE ESQUINA CONGUNYA","06","09","07","01","0609","000030940 - ARCANGEL SAN MIGUEL DE ESQUINA CONGUNYA"]
[null,null,null,null,null,null,null,null,null,null,null,null,null,408,"000002401","CCAPACMARCA","06","09","07","02","0609","000002401 - CCAPACMARCA"]
[null,null,null,null,null,null,null,null,null,null,null,null,null,409,"000009963","CANCAHUANI","06","09","07","02","0609","000009963 - CANCAHUANI"]
[null,null,null,null,null,null,null,null,null,null,null,null,null,410,"000027009","TAHUAY","06","09","07","02","0609","000027009 - TAHUAY"]
[null,null,null,null,null,null,null,null,null,null,null,null,null,411,"000002404","COLQUEMARCA","06","09","07","04","0609","000002404 - COLQUEMARCA"]
[null,null,null,null,null,null,null,null,null,null,null,null,null,412,"000002405","CHARAMURAY","06","09","07","04","0609","000002405 - CHARAMURAY"]
[null,null,null,null,null,null,null,null,null,null,null,null,null,413,"000008913","HUARACO","06","09","07","04","0609","000008913 - HUARACO"]
[null,null,null,null,null,null,null,null,null,null,null,null,null,414,"000008914","HUAYLLANI","06","09","07","04","0609","000008914 - HUAYLLANI"]
[null,null,null,null,null,null,null,null,null,null,null,null,null,415,"000012932","YANQUE","06","09","07","04","0609","000012932 - YANQUE"]
[null,null,null,null,null,null,null,null,null,null,null,null,null,416,"000002407","LLUSCO","06","09","07","06","0609","000002407 - LLUSCO"]
[null,null,null,null,null,null,null,null,null,null,null,null,null,417,"000006747","LUTTO","06","09","07","06","0609","000006747 - LUTTO"]
[null,null,null,null,null,null,null,null,null,null,null,null,null,418,"000006748","COLLPA","06","09","07","06",{"$f":"CONCATENATE(Q442,R442)","v":"0609"},{"$f":"CONCATENATE(O442,\" - \",P442)","v":"000006748 - COLLPA"}]
[null,null,null,null,null,null,null,null,null,null,null,null,null,419,"000006985","TOTORAPALLCA","06","09","07","06","0609","000006985 - TOTORAPALLCA"]
[null,null,null,null,null,null,null,null,null,null,null,null,null,420,"000027008","ANTUYO","06","09","07","06","0609","000027008 - ANTUYO"]
[null,null,null,null,null,null,null,null,null,null,null,null,null,421,"000002408","QUIÑOTA","06","09","07","07","0609","000002408 - QUIÑOTA"]
[null,null,null,null,null,null,null,null,null,null,null,null,null,422,"000006984","CCOLLANA","06","09","07","07","0609","000006984 - CCOLLANA"]
[null,null,null,null,null,null,null,null,null,null,null,null,null,423,"000007112","YORENCCA","06","09","07","07","0609","000007112 - YORENCCA"]
[null,null,null,null,null,null,null,null,null,null,null,null,null,424,"000025369","PUMALLACTA","06","09","07","07","0609","000025369 - PUMALLACTA"]
[null,null,null,null,null,null,null,null,null,null,null,null,null,425,"000002409","VELILLE","06","09","07","08","0609","000002409 - VELILLE"]
[null,null,null,null,null,null,null,null,null,null,null,null,null,426,"000008912","ALCCA VICTORIA","06","09","07","08","0609","000008912 - ALCCA VICTORIA"]
[null,null,null,null,null,null,null,null,null,null,null,null,null,427,"000025371","TUNTUMA","06","09","07","08","0609","000025371 - TUNTUMA"]
[null,null,null,null,null,null,null,null,null,null,null,null,null,428,"000027011","AYACCASI","06","09","07","08","0609","000027011 - AYACCASI"]
[null,null,null,null,null,null,null,null,null,null,null,null,null,429,"000027016","HUAYCUÑUTA - URCURUTA","06","09","07","08","0609","000027016 - HUAYCUÑUTA - URCURUTA"]
[null,null,null,null,null,null,null,null,null,null,null,null,null,430,"999999999","(All)","99","99",null,null,"9999","999999999 - (All)"]