{"text_format":"1","workbook":"xlsx","n_sheets":4,"sheets":["MENU","TABLAS","INFORME","Datos"],"not_rendered":{"charts":0,"images":30,"macros":1,"external_links":0,"defined_names":3,"comments":0,"pivot_tables":3},"unopened":[],"bounds":{"document_bytes":16777216,"sheet_cells":100000,"rows_first":2000,"rows_last":500,"rows_between":2000,"halvings":0,"cell_chars":16384,"cell_head_chars":4096},"cells_cut":0,"cells_raw":0,"read":"whole","date_system":"1900"}

{"sheet":"MENU","index":0,"n_rows":29,"n_cols":12,"rows_kept":29,"cut":false,"hidden":false,"merged":[[28,7,29,10],[26,7,27,10]]}
[]
[]
[]
[null,null,null,null,null,null,null,null,null,null,null,{"$f":"+TABLAS!A97","v":"1-2-3-Total general--------"}]
[null,null,null,null,null,null,null,null,null,null,null,{"$f":"+TABLAS!A133","v":"1-2-3-Total general--------"}]
[null,null,null,null,null,null,null,null,null,null,null,{"$f":"+TABLAS!A168","v":"1-2-3-Total general--------"}]
[]
[]
[]
[]
[]
[]
[]
[]
[]
[]
[]
[]
[]
[]
[]
[]
[]
[]
[]
[]
[null,null,null,null,null,null,null,"CONTROL DE MESES"]
[]
[null,null,null,null,null,null,null,{"$f":"+TABLAS!A97","v":"1-2-3-Total general--------"}]

{"sheet":"TABLAS","index":1,"n_rows":170,"n_cols":232,"rows_kept":170,"cut":false,"hidden":true,"merged":[[7,2,7,6],[8,3,8,6],[9,3,9,6],[10,3,10,6],[96,0,96,1],[132,0,132,1],[167,0,167,1],[11,3,11,6],[12,3,12,6],[13,3,13,6]]}
[]
[]
[]
[]
[]
[]
[]
[null,null,"Valores",null,null,null,null,null,"Tabla",{"$f":"IF(I9=\"(Todas)\",\"CUSCO \",\"\")","v":""}]
[null,null,"RED","03 - LA CONVENCION",null,null,null,null,{"$f":"IF(MID(D9,1,2)=\"99\",\"(All)\",MID(D9,1,2))","v":"03"},{"$f":"IF(I9=\"(All)\",\" \",I9)","v":"03"},null,null,{"$f":"LEN(MID(D9,5,90))","v":14},null,{"$f":"IF(MID(D9,6,5)=\"(All)\",\"\",D9)","v":"03 - LA CONVENCION"}]
[null,null,"Micro RED","0399 - (All)",null,null,null,null,{"$f":"IF(MID(D10,3,2)=\"99\",\"(All)\",MID(D10,1,4))","v":"(All)"}," ",null,null,{"$f":"LEN(MID(D10,7,90))","v":6},null,{"$f":"IF(MID(D10,8,5)=\"(All)\",\"\",D10)","v":""}]
[null,null,"Establecimiento","999999999 - (All)",null,null,null,null,{"$f":"IF(OR(MID(D11,1,9)=\"999999999\",MID(D11,1,9)=\"000000000\"),\"(All)\",MID(D11,1,9))","v":"(All)"}," ",null,null,{"$f":"LEN(MID(D11,12,90))","v":6},null,{"$f":"IF(MID(D11,13,5)=\"(All)\",\"\",D11)","v":""}]
[null,null,"Provincia","00 - (All)",null,null,null,null,{"$f":"IF(MID(D12,1,2)=\"00\",\"(All)\",MID(D12,1,2))","v":"(All)"}," ",null,null,{"$f":"LEN(MID(D12,6,90))","v":5},null,{"$f":"IF(MID(D12,6,5)=\"(All)\",\"\",D12)","v":""}]
[null,null,"Distrito","0000 - (All)",null,null,null,null,{"$f":"IF(OR(MID(D13,1,4)=\"0000\",MID(D13,3,2)=\"00\"),\"(All)\",MID(D13,1,4))","v":"(All)"}," ",null,null,{"$f":"LEN(MID(D13,8,90))","v":5},null,{"$f":"IF(MID(D13,8,5)=\"(All)\",\"\",D13)","v":""}]
[null,null,"Ejecutira","99 - (ALL)",null,null,null,null,{"$f":"IF(MID(D14,1,2)=\"99\",\"(All)\",MID(D14,1,2))","v":"(All)"}," ",null,null,{"$f":"LEN(MID(D14,5,90))","v":6},null,{"$f":"IF(MID(D14,6,5)=\"(All)\",\"\",D14)","v":""}]
[]
[null,null,"Año","2025",null,null,null,null,{"$f":"+D16","v":"2025"},{"$f":"IF(I16=\"(Todas)\",\" \",I16)","v":"2025"}]
[]
[]
[]
[null,1,1,1,0,0,0,0,0,0,0,0,0,{"$f":"SUM(B20:M20)","v":3}]
[null,{"$f":"IF(B20=1,\"ENERO\",\"\")","v":"ENERO"},{"$f":"IF(C20=1,\"FEBRERO\",\"\")","v":"FEBRERO"},{"$f":"IF(D20=1,\"MARZO\",\"\")","v":"MARZO"},{"$f":"IF(E20=1,\"ABRIL\",\"\")","v":""},{"$f":"IF(F20=1,\"MAYO\",\"\")","v":""},{"$f":"IF(G20=1,\"JUNIO\",\"\")","v":""},{"$f":"IF(H20=1,\"JULIO\",\"\")","v":""},{"$f":"IF(I20=1,\"AGOSTO\",\"\")","v":""},{"$f":"IF(J20=1,\"SETIEMBRE\",\"\")","v":""},{"$f":"IF(K20=1,\"OCTUBRE\",\"\")","v":""},{"$f":"IF(L20=1,\"NOVIEMBRE\",\"\")","v":""},{"$f":"IF(M20=1,\"DICIEMBRE\",\"\")","v":""},{"$f":"IF(B20=1,B21,IF(C20=1,C21,IF(D20=1,D21,IF(E20=1,E21,IF(F20=1,F21,IF(G20=1,G21,IF(H20=1,H21,IF(I20=1,I21,IF(J20=1,J21,IF(K20=1,K21,IF(L20=1,L21,IF(M20=1,M21,\"\"))))))))))))","v":"ENERO"}]
[null,null,null,null,null,null,null,null,null,null,null,null,null,{"$f":"IF(N20=1,N21,\"\")","v":""}]
[null,2,4,6,null,null,null,null,null,null,null,null,null,{"$f":"MIN(B23:M23)","v":2},{"$f":"MAX(B23:M23)","v":6},{"$f":"MAX(C23:N23)","v":6}]
[null,{"$f":"IF(B23=2,\"ENE\",\"\")","v":"ENE"},{"$f":"IF(C23=4,\"FEB\",\"\")","v":"FEB"},{"$f":"IF(D23=6,\"MAR\",\"\")","v":"MAR"},{"$f":"IF(E23=8,\"ABR\",\"\")","v":""},{"$f":"IF(F23=10,\"MAY\",\"\")","v":""},{"$f":"IF(G23=12,\"JUN\",\"\")","v":""},{"$f":"IF(H23=14,\"JUL\",\"\")","v":""},{"$f":"IF(I23=16,\"AGO\",\"\")","v":""},{"$f":"IF(J23=18,\"SET\",\"\")","v":""},{"$f":"IF(K23=20,\"OCT\",\"\")","v":""},{"$f":"IF(L23=22,\"NOV\",\"\")","v":""},{"$f":"IF(M23=24,\"DIC\",\"\")","v":""},{"$f":"IF(N23=B23,B24,IF(N23=C23,C24,IF(N23=D23,D24,IF(N23=E23,E24,IF(N23=F23,F24,IF(N23=G23,G24,IF(N23=H23,H58,IF(N23=I23,I24,IF(N23=J23,J24,IF(N23=K23,K24,IF(N23=L23,L24,IF(N23=M23,M24,\"\"))))))))))))","v":"ENE"},{"$f":"IF(O23=C23,C24,IF(O23=D23,D24,IF(O23=E23,E24,IF(O23=F23,F24,IF(O23=G23,G24,IF(O23=H23,H24,IF(O23=I23,I24,IF(O23=J23,J24,IF(O23=K23,K24,IF(O23=L23,L24,IF(O23=M23,M24,\"\")))))))))))","v":"MAR"},{"$f":"IF(P23=D23,D24,IF(P23=E23,E24,IF(P23=F23,F24,IF(P23=G23,G24,IF(P23=H23,H24,IF(P23=I23,I24,IF(P23=J23,J24,IF(P23=K23,K24,IF(P23=L23,L24,IF(P23=M23,M24,IF(P23=N23,N24,\"\")))))))))))","v":"MAR"}]
[null,null,null,null,null,null,null,null,null,null,null,null,null,{"$f":"CONCATENATE(N24,\" - \",O24)","v":"ENE - MAR"}]
[null,null,null,null,null,null,null,null,null,null,null,null,null,{"$f":"IF(N23=O23,N22,N25)","v":"ENE - MAR"}]
[]
[]
[]
[]
[]
[]
[]
[]
[]
[]
[]
[]
[]
[]
[]
[]
[]
[]
[]
[]
[]
[]
[]
[]
[]
[]
[]
[]
[]
[]
[]
[]
[]
[]
[]
[]
[]
[]
[]
["TUBERCU_01"]
["anno",2025]
["cod_red","03"]
["codmic","(Todas)"]
["cod_prov","(Todas)"]
["coddist","(Todas)"]
["cod_estab","(Todas)"]
["cod_eje","(Todas)"]
[]
[null,"Valores"]
["Etiquetas de fila"," BAS001"," BAS002"," BAS003"," BAS004"," BAS005"," BAS006"," BAS007"," BAS008"," BAS009"," BAS010"," BAS011"," BAS012"," BAS013"," BAS014"," BAS015"," BAS016"," BAS017"," BAS018"," BAS019"," BAS020"," BAS021"," BAS022"," BAS023"," BAS024"," BAS025"," BAS026"," BAS027"," BAS028"," BAS029"," BAS030"," BAS031"," BAS032"," BAS033"," BAS034"," BAS035"," BAS036"," BAS037"," BAS038"," BAS039"," BAS040"," BAS041"," BAS042"," BAS043"," BAS044"," BAS045"," BAS046"," BAS047"," BAS048"," BAS049"," BAS050"," BAS051"," BAS052"," BAS053"," BAS054"," BAS055"," BAS056"," BAS057"," BAS058"," BAS059"," BAS060"," BAS061"," BAS062"," BAS063"," BAS064"," BAS065"," BAS066"," BAS067"," BAS068"," BAS069"," BAS070"," BAS071"," BAS072"," BAS073"," BAS074"," BAS075"," BAS076"," BAS077"," BAS078"," BAS079"," BAS080"," BAS081"," BAS082"," BAS083"," BAS084"," BAS085"," BAS086"," BAS087"," BAS088"," BAS089"," BAS090"," BAS091"," BAS092"," BAS093"," BAS094"," BAS095"," BAS096"," BAS097"," BAS098"," BAS099"," BAS100"," BAS101"," BAS102"," BAS103"," BAS104"," BAS105"," BAS106"," BAS107"," BAS108"," BAS109"," BAS110"," BAS111"," BAS112"," BAS113"," BAS114"," BAS115"," BAS116"," BAS117"," BAS118"," BAS119"," BAS120"," BAS121"," BAS122"," BAS123"," BAS124"," BAS125"," BAS126"," BAS127"," BAS128"," BAS129"," BAS130"," BAS131"," BAS132"," BAS133"," BAS134"," BAS135"," BAS136"," BAS137"," BAS138"," BAS139"," BAS140"," BAS141"," BAS142"," BAS143"," BAS144"," BAS145"," BAS146"," BAS147"," BAS148"," BAS149"," BAS150"," BAS151"," BAS152"," BAS153"," BAS154"," BAS155"," BAS156"," BAS157"," BAS158"," BAS159"," BAS160"," BAS161"," BAS162"," BAS163"," BAS164"," BAS165"," BAS166"," BAS167"," BAS168"," BAS169"," BAS170"," BAS171"," BAS172"," BAS173"," BAS174"," BAS175"," BAS176"," BAS177"," BAS178"," BAS179"," BAS180"," BAS181"," BAS182"," BAS183"," BAS184"," BAS185"," BAS186"," BAS187"," BAS188"," BAS189"," BAS190"," BAS191"," BAS192"," BAS193"," BAS194"," BAS195"," BAS196"," BAS197"," BAS198"," BAS199"," BAS200"," BAS201"," BAS202"," BAS203"," BAS204"," BAS205"," BAS206"," BAS207"," BAS208"," BAS209"," BAS210"," BAS211"," BAS219"," BAS220"," BAS221"," BAS222"," BAS223"," BAS224"," BAS225"," BAS226"," BAS227"," BAS228"," BAS229"," BAS230"]
[1,0,0,0,0,0,0,0,0,1,0,0,0,0,0,0,0,0,0,8,34,2,108,3,1,1,21,0,0,0,0,0,0,0,0,0,0,0,0,0,0,0,0,0,0,0,0,0,0,0,0,0,0,0,0,0,0,0,0,0,0,0,0,0,0,0,0,7,5,0,0,5,0,0,0,0,47,34,0,0,41,41,0,0,0,0,0,0,0,0,0,0,0,0,0,0,0,0,0,0,115,114,47,34,0,0,41,41,0,0,0,0,0,0,1,3,2,0,0,0,0,0,0,0,0,0,0,0,0,0,0,0,0,0,0,0,22,41,5,15,24,56,0,0,0,0,0,0,11,18,33,30,57,38,3,4,0,1,0,0,5,4,21,33,6,0,0,0,0,0,4,7,1,1,1,1,0,0,0,0,75,116,60,99,1,0,0,0,74,59,56,43,2,0,58,46,0,0,49,37,0,0,99,146,98,146,0,0,102,131,2,4,0,0,0,0,0,0,0,0,0,0,0,0]
[2,0,0,0,0,0,0,0,0,0,0,0,0,0,1,0,0,0,0,2,34,0,74,0,0,1,9,0,0,0,0,0,0,0,0,0,0,0,0,0,0,0,0,0,0,0,0,0,0,0,0,0,0,0,0,0,0,0,0,0,0,0,0,0,0,0,0,3,1,0,0,4,0,0,0,1,40,26,0,0,49,42,3,0,0,0,0,0,0,0,0,0,0,0,0,0,0,0,0,0,150,124,40,26,0,0,49,42,3,0,0,0,0,0,21,16,0,1,0,0,0,0,0,0,0,0,0,0,0,0,0,0,0,0,0,0,18,41,4,13,10,22,0,0,0,0,0,0,7,12,38,46,48,46,6,8,0,1,0,0,0,4,25,42,2,1,0,0,0,0,11,11,1,1,0,0,0,1,1,1,93,99,78,85,0,1,0,0,76,69,57,50,8,3,65,52,0,0,56,48,0,0,98,113,98,115,4,3,92,117,6,4,0,0,0,0,0,0,0,0,0,0,0,0]
[3,0,0,0,0,0,0,0,0,0,0,0,0,0,0,0,0,0,0,0,94,2,236,0,1,4,21,0,0,0,0,0,0,0,0,0,0,0,0,0,0,0,0,0,0,0,0,0,0,0,0,0,0,0,0,0,0,0,0,0,0,0,0,0,0,0,0,12,1,0,0,1,0,0,0,3,87,84,2,0,78,73,6,3,0,0,0,0,8,2,0,0,2,2,0,0,0,0,0,0,258,228,87,84,2,0,78,73,6,3,0,0,0,0,35,27,8,4,1,0,0,0,0,0,0,0,0,0,0,0,0,0,0,0,0,0,10,38,4,21,13,45,0,0,0,0,0,0,12,12,95,75,117,100,11,8,1,2,0,0,0,8,67,62,1,0,0,0,0,0,11,8,7,5,0,0,0,1,2,1,115,95,60,57,1,0,0,0,142,107,110,91,6,2,60,51,0,0,105,87,0,0,120,108,120,108,6,7,124,104,9,8,0,0,0,0,0,0,0,0,0,0,0,0]
["Total general",0,0,0,0,0,0,0,0,1,0,0,0,0,1,0,0,0,0,10,162,4,418,3,2,6,51,0,0,0,0,0,0,0,0,0,0,0,0,0,0,0,0,0,0,0,0,0,0,0,0,0,0,0,0,0,0,0,0,0,0,0,0,0,0,0,0,22,7,0,0,10,0,0,0,4,174,144,2,0,168,156,9,3,0,0,0,0,8,2,0,0,2,2,0,0,0,0,0,0,523,466,174,144,2,0,168,156,9,3,0,0,0,0,57,46,10,5,1,0,0,0,0,0,0,0,0,0,0,0,0,0,0,0,0,0,50,120,13,49,47,123,0,0,0,0,0,0,30,42,166,151,222,184,20,20,1,4,0,0,5,16,113,137,9,1,0,0,0,0,26,26,9,7,1,1,0,2,3,2,283,310,198,241,2,1,0,0,292,235,223,184,16,5,183,149,0,0,210,172,0,0,317,367,316,369,10,10,318,352,17,16,0,0,0,0,0,0,0,0,0,0,0,0]
[]
[]
[]
[]
[]
[]
[]
[]
[]
[]
[]
[]
[]
[]
["TOTAL"]
[{"$f":"COUNT(A77:A93)","v":3},{"$f":"SUM(B77:B93)","v":0},{"$f":"SUM(C77:C93)","v":0},0,0,0,0,0,0,2,0,0,0,0,2,0,0,0,0,20,324,8,836,6,4,12,102,0,0,0,0,0,0,0,0,0,0,0,0,0,0,0,0,0,0,0,0,0,0,0,0,0,0,0,0,0,0,0,0,0,0,0,0,0,0,0,{"$f":"SUM(BO77:BO93)","v":0},44,14,0,0,20,0,0,0,8,348,288,4,0,336,312,18,6,0,0,0,0,16,4,0,0,4,4,0,0,0,0,0,0,1046,932,348,288,4,0,336,312,18,6,0,0,0,0,114,92,20,10,2,0,0,0,0,0,0,0,0,0,0,0,{"$f":"SUM(EA77:EA93)","v":0},0,0,0,0,0,100,240,26,98,94,246,0,0,0,0,0,0,60,84,332,302,444,368,40,40,2,8,0,0,10,32,226,274,18,2,0,0,0,0,52,52,18,14,2,2,0,4,6,4,566,620,396,482,4,2,0,0,584,470,446,368,32,10,{"$f":"SUM(GM77:GM93)","v":366},298,0,0,420,344,0,0,634,734,632,738,20,20,636,704,34,32,0,0,0,0,0,0,0,0,0,0,0,0,0,0,0,0,0,0,0,0]
[{"$f":"CONCATENATE(A77,\"-\",A78,\"-\",A79,\"-\",A80,\"-\",A81,\"-\",A82,\"-\",A83,\"-\",A84,\"-\",A85,\"-\",A86,\"-\",A87,\"-\",A88)","v":"1-2-3-Total general--------"}]
[null," BAS001"," BAS002"," BAS003"," BAS004"," BAS005"," BAS006"," BAS007"," BAS008"," BAS009"," BAS010"," BAS011"," BAS012"," BAS013"," BAS014"," BAS015"," BAS016"," BAS017"," BAS018"," BAS019"," BAS020"," BAS021"," BAS022"," BAS023"," BAS024"," BAS025"," BAS026"," BAS027"," BAS028"," BAS029"," BAS030"," BAS031"," BAS032"," BAS033"," BAS034"," BAS035"," BAS036"," BAS037"," BAS038"," BAS039"," BAS040"," BAS041"," BAS042"," BAS043"," BAS044"," BAS045"," BAS046"," BAS047"," BAS048"," BAS049"," BAS050"," BAS051"," BAS052"," BAS053"," BAS054"," BAS055"," BAS056"," BAS057"," BAS058"," BAS059"," BAS060"," BAS061"," BAS062"," BAS063"," BAS064"," BAS065"," BAS066"," BAS067"," BAS068"," BAS069"," BAS070"," BAS071"," BAS072"," BAS073"," BAS074"," BAS075"," BAS076"," BAS077"," BAS078"," BAS079"," BAS080"," BAS081"," BAS082"," BAS083"," BAS084"," BAS085"," BAS086"," BAS087"," BAS088"," BAS089"," BAS090"," BAS091"," BAS092"," BAS093"," BAS094"," BAS095"," BAS096"," BAS097"," BAS098"," BAS099"," BAS100"," BAS101"," BAS102"," BAS103"," BAS104"," BAS105"," BAS106"," BAS107"," BAS108"," BAS109"," BAS110"," BAS111"," BAS112"," BAS113"," BAS114"," BAS115"," BAS116"," BAS117"," BAS118"," BAS119"," BAS120"," BAS121"," BAS122"," BAS123"," BAS124"," BAS125"," BAS126"," BAS127"," BAS128"," BAS129"," BAS130"," BAS131"," BAS132"," BAS133"," BAS134"," BAS135"," BAS136"," BAS137"," BAS138"," BAS139"," BAS140"," BAS141"," BAS142"," BAS143"," BAS144"," BAS145"," BAS146"," BAS147"," BAS148"," BAS149"," BAS150"," BAS151"," BAS152"," BAS153"," BAS154"," BAS155"," BAS156"," BAS157"," BAS158"," BAS159"," BAS160"," BAS161"," BAS162"," BAS163"," BAS164"," BAS165"," BAS166"," BAS167"," BAS168"," BAS169"," BAS170"," BAS171"," BAS172"," BAS173"," BAS174"," BAS175"," BAS176"," BAS177"," BAS178"," BAS179"," BAS180"," BAS181"," BAS182"," BAS183"," BAS184"," BAS185"," BAS186"," BAS187"," BAS188"," BAS189"," BAS190"," BAS191"," BAS192"," BAS193"," BAS194"," BAS195"," BAS196"," BAS197"," BAS198"," BAS199"," BAS200"," BAS201"," BAS202"," BAS203"," BAS204"," BAS205"," BAS206"," BAS207"," BAS208"," BAS209"," BAS210"," BAS211"," BAS212"," BAS213"," BAS214"," BAS215"," BAS216"," BAS217"," BAS218"," BAS219"," BAS220"," BAS221"," BAS222"," BAS223"," BAS224"," BAS225"," BAS226"," BAS227"," BAS228"," BAS229"," BAS230"]
[null,{"$f":"IF(B98=B76,\"SI\",\"NO\")","v":"SI"},{"$f":"IF(C98=C76,\"SI\",\"NO\")","v":"SI"},"SI","SI","SI","SI","SI","SI","SI","SI","SI","SI","SI","SI","SI","SI","SI","SI","SI","SI","SI","SI","SI","SI","SI","SI","SI","SI","SI","SI","SI","SI","SI","SI","SI","SI","SI","SI","SI","SI","SI","SI","SI","SI","SI","SI","SI","SI","SI","SI","SI","SI","SI","SI","SI","SI","SI","SI","SI","SI","SI","SI","SI","SI","SI",{"$f":"IF(BO98=BO76,\"SI\",\"NO\")","v":"SI"},"SI","SI","SI","SI","SI","SI","SI","SI","SI","SI","SI","SI","SI","SI","SI","SI","SI","SI","SI","SI","SI","SI","SI","SI","SI","SI","SI","SI","SI","SI","SI","SI","SI","SI","SI","SI","SI","SI","SI","SI","SI","SI","SI","SI","SI","SI","SI","SI","SI","SI","SI","SI","SI","SI","SI","SI","SI","SI","SI","SI","SI","SI","SI",{"$f":"IF(EA98=EA76,\"SI\",\"NO\")","v":"SI"},"SI","SI","SI","SI","SI","SI","SI","SI","SI","SI","SI","SI","SI","SI","SI","SI","SI","SI","SI","SI","SI","SI","SI","SI","SI","SI","SI","SI","SI","SI","SI","SI","SI","SI","SI","SI","SI","SI","SI","SI","SI","SI","SI","SI","SI","SI","SI","SI","SI","SI","SI","SI","SI","SI","SI","SI","SI","SI","SI","SI","SI","SI","SI",{"$f":"IF(GM98=GM76,\"SI\",\"NO\")","v":"SI"},"SI","SI","SI","SI","SI","SI","SI","SI","SI","SI","SI","SI","SI","SI","SI","SI","SI","NO","NO","NO","NO","NO","NO","NO","NO","NO","NO","NO","NO","NO","NO","NO","NO","NO","NO","NO",{"$f":"IF(HW98=HX76,\"SI\",\"NO\")","v":"NO"}]
[]
[]
["TUBERCU_02"]
["anno",2025]
["cod_red","03"]
["codmic","(Todas)"]
["cod_prov","(Todas)"]
["coddist","(Todas)"]
["cod_estab","(Todas)"]
["cod_eje","(Todas)"]
[]
[null,"Valores"]
["Etiquetas de fila"," BAS001"," BAS002"," BAS003"," BAS004"," BAS005"," BAS006"," BAS007"," BAS008"," BAS009"," BAS010"," BAS011"," BAS012"," BAS013"," BAS014"," BAS015"," BAS016"," BAS017"," BAS018"," BAS019"," BAS020"," BAS021"," BAS022"," BAS023"," BAS024"," BAS025"," BAS026"," BAS027"," BAS028"," BAS029"," BAS030"," BAS031"," BAS032"," BAS033"," BAS034"," BAS035"," BAS036"," BAS037"," BAS038"," BAS039"," BAS040"," BAS041"," BAS042"," BAS043"," BAS044"," BAS045"," BAS046"," BAS047"," BAS048"," BAS049"," BAS050"," BAS051"," BAS052"," BAS053"," BAS054"," BAS055"," BAS056"," BAS057"," BAS058"," BAS059"," BAS060"," BAS061"," BAS062"," BAS063"," BAS064"," BAS065"," BAS066"," BAS067"," BAS068"," BAS069"," BAS070"," BAS071"," BAS072"," BAS073"," BAS074"," BAS075"," BAS076"," BAS077"," BAS078"," BAS079"," BAS080"," BAS081"," BAS082"," BAS083"," BAS084"," BAS085"," BAS086"," BAS087"," BAS088"," BAS089"," BAS090"," BAS091"," BAS092"," BAS093"," BAS094"," BAS095"," BAS096"," BAS097"," BAS098"," BAS099"," BAS100"," BAS101"," BAS102"," BAS103"," BAS104"," BAS105"," BAS106"," BAS107"," BAS108"," BAS109"," BAS110"," BAS111"," BAS112"," BAS113"," BAS114"," BAS115"," BAS116"," BAS117"," BAS118"," BAS119"," BAS120"," BAS121"," BAS122"," BAS123"," BAS124"," BAS125"," BAS126"," BAS127"," BAS128"," BAS129"," BAS130"," BAS131"," BAS132"," BAS133"," BAS134"," BAS135"," BAS136"," BAS137"," BAS138"," BAS139"," BAS140"," BAS141"," BAS142"," BAS143"," BAS144"," BAS145"," BAS146"," BAS147"," BAS148"," BAS149"," BAS150"," BAS151"," BAS152"," BAS153"," BAS154"," BAS155"," BAS156"," BAS157"," BAS158"," BAS159"," BAS160"," BAS161"," BAS162"," BAS163"," BAS164"," BAS165"," BAS166"," BAS167"," BAS168"," BAS169"," BAS170"," BAS171"," BAS172"," BAS173"," BAS174"," BAS175"," BAS176"," BAS177"," BAS178"," BAS179"," BAS180"," BAS181"," BAS182"," BAS183"," BAS184"," BAS185"," BAS186"," BAS187"," BAS188"," BAS189"," BAS190"," BAS191"," BAS192"," BAS193"," BAS194"," BAS195"," BAS196"," BAS197"," BAS198"," BAS199"," BAS200"," BAS201"," BAS202"," BAS203"," BAS204"," BAS205"," BAS206"," BAS207"," BAS208"," BAS209"," BAS210"," BAS211"," BAS212"," BAS213"," BAS214"," BAS215"," BAS216"," BAS217"," BAS218"," BAS219"," BAS220"," BAS221"," BAS222"," BAS223"," BAS224"," BAS225"," BAS226"," BAS227"," BAS228"," BAS229"," BAS230"]
[1,5,4,0,0,0,0,0,0,0,0,1,0,0,4,0,0,0,0,0,0,5,11,1,0,0,2,0,0,0,0,1,1,29,41,25,109,0,0,0,5,3,26,6,3,1,6,0,3,0,0,0,0,0,1,0,0,0,0,0,0,0,0,3,8,1,6,9,4,0,0,0,0,5,9,17,7,1,1,0,0,1,0,0,0,0,0,1,1,1,1,0,0,2,8,18,32,36,63,51,137,97,180,0,1,0,5,118,181,37,284,40,285,0,0,46,287,4,2,2,2,0,1,0,0,0,0,40,274,20,52,6,11,1,1,0,0,0,1,0,0,49,121,2,14,9,12,2,4,1,4,7,5,2,1,0,0,0,0,0,0,0,0,0,0,0,0,33,86,0,0,0,0,0,210,39,575,3,0,0,206,10,0,1,7359,1,1,0,0,0,8,1,0,1,0,0,0,0,0,0,0,0,0,0,0,0,0,0,0,0,0,0,0,0,0,0,0,0,0,0,0,0,0,0,0,0,0,0,0,0,0]
[2,2,6,0,0,0,0,0,0,0,0,0,0,0,12,0,4,0,3,0,0,11,18,6,3,6,1,0,0,0,0,5,6,59,34,35,104,0,0,2,4,3,24,5,6,2,6,1,7,0,0,0,0,0,0,0,0,0,0,0,0,0,0,5,10,1,5,5,3,0,0,0,0,5,5,10,13,1,0,1,0,1,0,1,0,0,0,2,2,0,0,0,0,5,8,26,38,70,62,84,141,98,159,0,0,0,3,150,195,65,114,69,119,0,0,76,123,6,1,0,3,0,0,0,0,0,0,61,105,41,52,21,8,0,4,0,2,2,0,0,0,53,95,12,14,11,15,9,3,12,6,7,4,3,3,0,1,0,0,0,1,0,0,0,0,0,0,19,54,0,0,0,0,31,168,38,783,0,1,0,288,29,0,4,8337,10,0,0,0,0,3,5,3,7,0,0,0,0,0,0,0,0,0,0,0,0,0,0,0,0,0,0,0,0,0,0,0,0,0,0,0,0,0,0,0,0,0,0,0,0,0]
[3,14,5,0,0,0,0,0,0,0,0,2,0,0,9,0,1,0,0,0,0,9,11,4,1,0,1,0,0,0,0,3,36,78,88,48,128,0,0,0,7,3,19,4,6,3,10,0,7,0,0,0,0,1,0,3,2,0,0,0,0,0,1,7,8,0,1,13,6,0,0,0,0,5,8,20,7,0,0,1,2,0,0,0,0,0,0,1,3,0,0,0,1,1,19,25,19,90,107,124,182,166,211,0,0,0,4,254,292,79,219,82,227,0,1,97,236,0,4,5,6,0,0,0,0,0,1,58,200,58,125,15,11,1,3,2,2,1,0,0,0,118,141,36,18,46,31,28,14,62,33,5,8,0,5,0,0,0,0,0,0,0,0,0,0,0,0,28,113,0,0,0,0,221,242,69,667,3,149,0,247,14,0,9,9619,9,0,0,0,0,10,25,1,22,0,0,0,0,0,0,0,0,0,0,0,0,0,0,0,0,0,0,0,0,0,0,0,0,0,0,0,0,0,0,0,0,0,0,0,0,0]
["Total general",21,15,0,0,0,0,0,0,0,0,3,0,0,25,0,5,0,3,0,0,25,40,11,4,6,4,0,0,0,0,9,43,166,163,108,341,0,0,2,16,9,69,15,15,6,22,1,17,0,0,0,0,1,1,3,2,0,0,0,0,0,1,15,26,2,12,27,13,0,0,0,0,15,22,47,27,2,1,2,2,2,0,1,0,0,0,4,6,1,1,0,1,8,35,69,89,196,232,259,460,361,550,0,1,0,12,522,668,181,617,191,631,0,1,219,646,10,7,7,11,0,1,0,0,0,1,159,579,119,229,42,30,2,8,2,4,3,1,0,0,220,357,50,46,66,58,39,21,75,43,19,17,5,9,0,1,0,0,0,1,0,0,0,0,0,0,80,253,0,0,0,0,252,620,146,2025,6,150,0,741,53,0,14,25315,20,1,0,0,0,21,31,4,30,0,0,0,0,0,0,0,0,0,0,0,0,0,0,0,0,0,0,0,0,0,0,0,0,0,0,0,0,0,0,0,0,0,0,0,0,0]
[]
[]
[]
[]
[]
[]
[]
[]
[]
[]
[]
[]
[]
[]
["TOTAL"]
[{"$f":"COUNT(A113:A129)","v":3},{"$f":"SUM(B113:B129)","v":42},{"$f":"SUM(C113:C129)","v":30},0,0,0,0,0,0,0,0,6,0,0,50,0,10,0,6,0,0,50,80,22,8,12,8,0,0,0,0,18,86,332,326,216,682,0,0,4,32,18,138,30,30,12,44,2,34,0,0,0,0,2,2,6,4,0,0,0,0,0,2,30,52,4,{"$f":"SUM(BO113:BO129)","v":24},54,26,0,0,0,0,30,44,94,54,4,2,4,4,4,0,2,0,0,0,8,12,2,2,0,2,16,70,138,178,392,464,518,920,722,1100,0,2,0,24,1044,1336,362,1234,382,1262,0,2,438,1292,20,14,14,22,0,2,0,0,0,2,318,1158,238,{"$f":"SUM(EA113:EA129)","v":458},84,60,4,16,4,8,6,2,0,0,440,714,100,92,132,116,78,42,150,86,38,34,10,18,0,2,0,0,0,2,0,0,0,0,0,0,160,506,0,0,0,0,504,1240,292,4050,12,300,0,1482,106,0,28,50630,40,2,0,0,0,42,62,8,60,{"$f":"SUM(GM113:GM129)","v":0},0,0,0,0,0,0,0,0,0,0,0,0,0,0,0,0,0,0,0,0,0,0,0,0,0,0,0,0,0,0,0,0,0,0,0,0]
[{"$f":"CONCATENATE(A113,\"-\",A114,\"-\",A115,\"-\",A116,\"-\",A117,\"-\",A118,\"-\",A119,\"-\",A120,\"-\",A121,\"-\",A122,\"-\",A123,\"-\",A124)","v":"1-2-3-Total general--------"}]
[null," BAS001"," BAS002"," BAS003"," BAS004"," BAS005"," BAS006"," BAS007"," BAS008"," BAS009"," BAS010"," BAS011"," BAS012"," BAS013"," BAS014"," BAS015"," BAS016"," BAS017"," BAS018"," BAS019"," BAS020"," BAS021"," BAS022"," BAS023"," BAS024"," BAS025"," BAS026"," BAS027"," BAS028"," BAS029"," BAS030"," BAS031"," BAS032"," BAS033"," BAS034"," BAS035"," BAS036"," BAS037"," BAS038"," BAS039"," BAS040"," BAS041"," BAS042"," BAS043"," BAS044"," BAS045"," BAS046"," BAS047"," BAS048"," BAS049"," BAS050"," BAS051"," BAS052"," BAS053"," BAS054"," BAS055"," BAS056"," BAS057"," BAS058"," BAS059"," BAS060"," BAS061"," BAS062"," BAS063"," BAS064"," BAS065"," BAS066"," BAS067"," BAS068"," BAS069"," BAS070"," BAS071"," BAS072"," BAS073"," BAS074"," BAS075"," BAS076"," BAS077"," BAS078"," BAS079"," BAS080"," BAS081"," BAS082"," BAS083"," BAS084"," BAS085"," BAS086"," BAS087"," BAS088"," BAS089"," BAS090"," BAS091"," BAS092"," BAS093"," BAS094"," BAS095"," BAS096"," BAS097"," BAS098"," BAS099"," BAS100"," BAS101"," BAS102"," BAS103"," BAS104"," BAS105"," BAS106"," BAS107"," BAS108"," BAS109"," BAS110"," BAS111"," BAS112"," BAS113"," BAS114"," BAS115"," BAS116"," BAS117"," BAS118"," BAS119"," BAS120"," BAS121"," BAS122"," BAS123"," BAS124"," BAS125"," BAS126"," BAS127"," BAS128"," BAS129"," BAS130"," BAS131"," BAS132"," BAS133"," BAS134"," BAS135"," BAS136"," BAS137"," BAS138"," BAS139"," BAS140"," BAS141"," BAS142"," BAS143"," BAS144"," BAS145"," BAS146"," BAS147"," BAS148"," BAS149"," BAS150"," BAS151"," BAS152"," BAS153"," BAS154"," BAS155"," BAS156"," BAS157"," BAS158"," BAS159"," BAS160"," BAS161"," BAS162"," BAS163"," BAS164"," BAS165"," BAS166"," BAS167"," BAS168"," BAS169"," BAS170"," BAS171"," BAS172"," BAS173"," BAS174"," BAS175"," BAS176"," BAS177"," BAS178"," BAS179"," BAS180"," BAS181"," BAS182"," BAS183"," BAS184"," BAS185"," BAS186"," BAS187"," BAS188"," BAS189"," BAS190"," BAS191"," BAS192"," BAS193"," BAS194"," BAS195"," BAS196"," BAS197"," BAS198"," BAS199"," BAS200"," BAS201"," BAS202"," BAS203"," BAS204"," BAS205"," BAS206"," BAS207"," BAS208"," BAS209"," BAS210"," BAS211"," BAS212"," BAS213"," BAS214"," BAS215"," BAS216"," BAS217"," BAS218"," BAS219"," BAS220"," BAS221"," BAS222"," BAS223"," BAS224"," BAS225"," BAS226"," BAS227"," BAS228"," BAS229"," BAS230"]
[null,{"$f":"IF(B134=B112,\"SI\",\"NO\")","v":"SI"},{"$f":"IF(C134=C112,\"SI\",\"NO\")","v":"SI"},"SI","SI","SI","SI","SI","SI","SI","SI","SI","SI","SI","SI","SI","SI","SI","SI","SI","SI","SI","SI","SI","SI","SI","SI","SI","SI","SI","SI","SI","SI","SI","SI","SI","SI","SI","SI","SI","SI","SI","SI","SI","SI","SI","SI","SI","SI","SI","SI","SI","SI","SI","SI","SI","SI","SI","SI","SI","SI","SI","SI","SI","SI","SI",{"$f":"IF(BO134=BO112,\"SI\",\"NO\")","v":"SI"},"SI","SI","SI","SI","SI","SI","SI","SI","SI","SI","SI","SI","SI","SI","SI","SI","SI","SI","SI","SI","SI","SI","SI","SI","SI","SI","SI","SI","SI","SI","SI","SI","SI","SI","SI","SI","SI","SI","SI","SI","SI","SI","SI","SI","SI","SI","SI","SI","SI","SI","SI","SI","SI","SI","SI","SI","SI","SI","SI","SI","SI","SI","SI",{"$f":"IF(EA134=EA112,\"SI\",\"NO\")","v":"SI"},"SI","SI","SI","SI","SI","SI","SI","SI","SI","SI","SI","SI","SI","SI","SI","SI","SI","SI","SI","SI","SI","SI","SI","SI","SI","SI","SI","SI","SI","SI","SI","SI","SI","SI","SI","SI","SI","SI","SI","SI","SI","SI","SI","SI","SI","SI","SI","SI","SI","SI","SI","SI","SI","SI","SI","SI","SI","SI","SI","SI","SI","SI","SI",{"$f":"IF(GM134=GM112,\"SI\",\"NO\")","v":"SI"},"SI","SI","SI","SI","SI","SI","SI","SI","SI","SI","SI","SI","SI","SI","SI","SI","SI","SI","SI","SI","SI","SI","SI","SI","SI","SI","SI","SI","SI","SI","SI","SI","SI","SI","SI","SI"]
[]
["TUBERCU_03"]
["anno",2025]
["cod_red","03"]
["codmic","(Todas)"]
["cod_prov","(Todas)"]
["coddist","(Todas)"]
["cod_estab","(Todas)"]
["cod_eje","(Todas)"]
[]
[null,"Valores"]
["Etiquetas de fila"," BAS001"," BAS002"," BAS003"," BAS004"," BAS005"," BAS006"," BAS007"," BAS008"," BAS009"," BAS010"," BAS011"," BAS012"," BAS013"," BAS014"," BAS015"," BAS016"," BAS017"," BAS018"," BAS019"," BAS020"," BAS021"," BAS022"," BAS023"," BAS024"," BAS025"," BAS026"," BAS027"," BAS028"," BAS029"," BAS030"," BAS031"," BAS032"," BAS033"," BAS034"," BAS035"," BAS036"," BAS037"," BAS038"," BAS039"," BAS040"," BAS041"," BAS042"," BAS043"," BAS044"," BAS045"," BAS046"," BAS047"," BAS048"," BAS049"," BAS050"," BAS051"," BAS052"," BAS053"," BAS054"," BAS055"," BAS056"," BAS057"," BAS058"," BAS059"," BAS060"," BAS061"," BAS062"," BAS063"," BAS064"," BAS065"," BAS066"," BAS067"," BAS068"," BAS069"," BAS070"," BAS071"," BAS072"," BAS073"," BAS074"," BAS075"," BAS076"," BAS077"," BAS078"," BAS079"," BAS080"," BAS081"," BAS082"," BAS083"," BAS084"," BAS085"," BAS086"," BAS087"," BAS088"," BAS089"," BAS090"," BAS091"," BAS092"," BAS093"," BAS094"," BAS095"," BAS096"," BAS097"," BAS098"," BAS099"," BAS100"," BAS101"," BAS102"," BAS103"," BAS104"," BAS105"," BAS106"," BAS107"," BAS108"," BAS109"," BAS110"," BAS111"," BAS112"," BAS113"," BAS114"," BAS115"," BAS116"," BAS117"," BAS118"," BAS119"," BAS120"," BAS121"," BAS122"," BAS123"," BAS124"," BAS125"," BAS126"," BAS127"," BAS128"," BAS129"," BAS130"," BAS131"," BAS132"," BAS133"," BAS134"," BAS135"," BAS136"," BAS137"," BAS138"," BAS139"," BAS140"," BAS141"," BAS142"," BAS143"," BAS144"," BAS145"," BAS146"," BAS147"," BAS148"," BAS149"," BAS150"," BAS151"," BAS152"," BAS153"," BAS154"," BAS155"," BAS156"," BAS157"," BAS158"," BAS159"," BAS160"," BAS161"," BAS162"," BAS163"," BAS164"," BAS165"," BAS166"," BAS167"," BAS168"," BAS169"," BAS170"," BAS171"," BAS172"," BAS173"," BAS174"," BAS175"," BAS176"," BAS177"," BAS178"," BAS179"," BAS180"," BAS181"," BAS182"," BAS183"," BAS184"," BAS185"," BAS186"," BAS187"," BAS188"," BAS189"," BAS190"," BAS191"," BAS192"," BAS193"," BAS194"," BAS195"," BAS196"," BAS197"," BAS198"," BAS199"," BAS200"," BAS201"," BAS202"," BAS203"," BAS204"," BAS205"," BAS206"," BAS207"," BAS208"," BAS209"," BAS210"," BAS211"," BAS212"," BAS213"," BAS214"," BAS215"," BAS216"," BAS217"," BAS218"," BAS219"," BAS220"," BAS221"," BAS222"," BAS223"," BAS224"," BAS225"," BAS226"," BAS227"," BAS228"," BAS229"," BAS230"]
[1,0,0,0,0,0,0,0,0,0,0,0,0,0,0,0,0,0,0,0,0,0,0,0,0,0,0,0,0,0,0,0,0,0,0,0,0,0,0,0,0,0,0,0,0,0,0,0,0,0,0,0,0,0,0,0,0,0,0,0,0,0,0,0,1,2,0,0,1,0,0,0,0,0,0,0,9,9,102,204,0,1,3,2,18,52,0,0,4,5,0,0,0,0,0,0,0,0,0,0,0,0,0,0,0,0,0,0,0,0,0,0,0,0,0,0,0,0,0,0,0,0,0,0,0,0,0,0,0,0,0,0,0,0,0,0,0,0,0,0,0,0,0,0,0,0,0,0,0,0,0,0,0,0,0,0,0,0,0,0,0,0,0,0,0,0,0,0,0,0,0,0,0,0,0,0,0,0,0,0,0,0,0,0,0,0,0,0,0,0,0,0,0,0,0,0,0,0,0,0,0,0,0,0,0,0,0,0,0,0,0,0,0,0,0,0,0,0,0,0,0,0,0,0,0,0,0,0,0,0,0]
[2,0,0,0,0,0,0,0,0,0,0,0,0,0,0,0,0,0,0,0,0,0,0,0,0,0,0,0,0,0,0,0,0,0,0,0,0,0,0,0,0,0,0,0,0,0,0,0,0,0,0,0,0,0,0,0,0,0,0,0,0,0,0,0,2,2,0,0,0,0,1,0,0,0,0,0,4,21,60,146,0,0,2,0,10,37,1,0,0,0,0,0,0,0,0,0,0,0,0,0,0,0,0,0,0,0,0,0,0,0,0,0,0,0,0,0,0,0,0,0,0,0,0,0,0,0,0,0,0,0,0,0,0,0,0,0,0,0,0,0,0,0,0,0,0,0,0,0,0,0,0,0,0,0,0,0,0,0,0,0,0,0,0,0,0,0,0,0,0,0,0,0,0,0,0,0,0,0,0,0,0,0,0,0,0,0,0,0,0,0,0,0,0,0,0,0,0,0,0,0,0,0,0,0,0,0,0,0,0,0,0,0,0,0,0,0,0,0,0,0,0,0,0,0,0,0,0,0,0,0,0]
[3,0,0,0,0,0,0,0,0,0,0,0,0,0,0,0,0,0,0,0,0,0,0,0,0,0,0,0,0,0,0,0,0,0,0,0,0,0,0,0,0,0,0,0,0,0,0,0,0,0,0,0,0,0,0,0,0,0,0,0,0,0,0,0,0,0,0,0,1,0,3,2,0,0,0,0,6,26,61,196,0,0,1,0,73,66,1,0,0,0,0,0,0,0,0,0,0,0,0,0,0,0,0,0,0,0,0,0,0,0,0,0,0,0,0,0,0,0,0,0,0,0,0,0,0,0,0,0,0,0,0,0,0,0,0,0,0,0,0,0,0,0,0,0,0,0,0,0,0,0,0,0,0,0,0,0,0,0,0,0,0,0,0,0,0,0,0,0,0,0,0,0,0,0,0,0,0,0,0,0,0,0,0,0,0,0,0,0,0,0,0,0,0,0,0,0,0,0,0,0,0,0,0,0,0,0,0,0,0,0,0,0,0,0,0,0,0,0,0,0,0,0,0,0,0,0,0,0,0,0,0]
["Total general",0,0,0,0,0,0,0,0,0,0,0,0,0,0,0,0,0,0,0,0,0,0,0,0,0,0,0,0,0,0,0,0,0,0,0,0,0,0,0,0,0,0,0,0,0,0,0,0,0,0,0,0,0,0,0,0,0,0,0,0,0,0,0,3,4,0,0,2,0,4,2,0,0,0,0,19,56,223,546,0,1,6,2,101,155,2,0,4,5,0,0,0,0,0,0,0,0,0,0,0,0,0,0,0,0,0,0,0,0,0,0,0,0,0,0,0,0,0,0,0,0,0,0,0,0,0,0,0,0,0,0,0,0,0,0,0,0,0,0,0,0,0,0,0,0,0,0,0,0,0,0,0,0,0,0,0,0,0,0,0,0,0,0,0,0,0,0,0,0,0,0,0,0,0,0,0,0,0,0,0,0,0,0,0,0,0,0,0,0,0,0,0,0,0,0,0,0,0,0,0,0,0,0,0,0,0,0,0,0,0,0,0,0,0,0,0,0,0,0,0,0,0,0,0,0,0,0,0,0,0]
[]
[]
[]
[]
[]
[]
[]
[]
[]
[]
[]
[]
[]
[]
["TOTAL"]
[{"$f":"COUNT(A148:A164)","v":3},{"$f":"SUM(B148:B164)","v":0},{"$f":"SUM(C148:C164)","v":0},0,0,0,0,0,0,0,0,0,0,0,0,0,0,0,0,0,0,0,0,0,0,0,0,0,0,0,0,0,0,0,0,0,0,0,0,0,0,0,0,0,0,0,0,0,0,0,0,0,0,0,0,0,0,0,0,0,0,0,0,0,6,8,{"$f":"SUM(BO148:BO164)","v":0},0,4,0,8,4,0,0,0,0,38,112,446,1092,0,2,12,4,202,310,4,0,8,10,0,0,0,0,0,0,0,0,0,0,0,0,0,0,0,0,0,0,0,0,0,0,0,0,0,0,0,0,0,0,0,0,0,0,0,0,0,0,0,0,{"$f":"SUM(EA148:EA164)","v":0},0,0,0,0,0,0,0,0,0,0,0,0,0,0,0,0,0,0,0,0,0,0,0,0,0,0,0,0,0,0,0,0,0,0,0,0,0,0,0,0,0,0,0,0,0,0,0,0,0,0,0,0,0,0,0,0,0,0,0,0,0,0,0,{"$f":"SUM(GM148:GM164)","v":0},0,0,0,0,0,0,0,0,0,0,0,0,0,0,0,0,0,0,0,0,0,0,0,0,0,0,0,0,0,0,0,0,0,0,0,0]
[{"$f":"CONCATENATE(A148,\"-\",A149,\"-\",A150,\"-\",A151,\"-\",A152,\"-\",A153,\"-\",A154,\"-\",A155,\"-\",A156,\"-\",A157,\"-\",A158,\"-\",A159)","v":"1-2-3-Total general--------"}]
[null," BAS001"," BAS002"," BAS003"," BAS004"," BAS005"," BAS006"," BAS007"," BAS008"," BAS009"," BAS010"," BAS011"," BAS012"," BAS013"," BAS014"," BAS015"," BAS016"," BAS017"," BAS018"," BAS019"," BAS020"," BAS021"," BAS022"," BAS023"," BAS024"," BAS025"," BAS026"," BAS027"," BAS028"," BAS029"," BAS030"," BAS031"," BAS032"," BAS033"," BAS034"," BAS035"," BAS036"," BAS037"," BAS038"," BAS039"," BAS040"," BAS041"," BAS042"," BAS043"," BAS044"," BAS045"," BAS046"," BAS047"," BAS048"," BAS049"," BAS050"," BAS051"," BAS052"," BAS053"," BAS054"," BAS055"," BAS056"," BAS057"," BAS058"," BAS059"," BAS060"," BAS061"," BAS062"," BAS063"," BAS064"," BAS065"," BAS066"," BAS067"," BAS068"," BAS069"," BAS070"," BAS071"," BAS072"," BAS073"," BAS074"," BAS075"," BAS076"," BAS077"," BAS078"," BAS079"," BAS080"," BAS081"," BAS082"," BAS083"," BAS084"," BAS085"," BAS086"," BAS087"," BAS088"," BAS089"," BAS090"," BAS091"," BAS092"," BAS093"," BAS094"," BAS095"," BAS096"," BAS097"," BAS098"," BAS099"," BAS100"," BAS101"," BAS102"," BAS103"," BAS104"," BAS105"," BAS106"," BAS107"," BAS108"," BAS109"," BAS110"," BAS111"," BAS112"," BAS113"," BAS114"," BAS115"," BAS116"," BAS117"," BAS118"," BAS119"," BAS120"," BAS121"," BAS122"," BAS123"," BAS124"," BAS125"," BAS126"," BAS127"," BAS128"," BAS129"," BAS130"," BAS131"," BAS132"," BAS133"," BAS134"," BAS135"," BAS136"," BAS137"," BAS138"," BAS139"," BAS140"," BAS141"," BAS142"," BAS143"," BAS144"," BAS145"," BAS146"," BAS147"," BAS148"," BAS149"," BAS150"," BAS151"," BAS152"," BAS153"," BAS154"," BAS155"," BAS156"," BAS157"," BAS158"," BAS159"," BAS160"," BAS161"," BAS162"," BAS163"," BAS164"," BAS165"," BAS166"," BAS167"," BAS168"," BAS169"," BAS170"," BAS171"," BAS172"," BAS173"," BAS174"," BAS175"," BAS176"," BAS177"," BAS178"," BAS179"," BAS180"," BAS181"," BAS182"," BAS183"," BAS184"," BAS185"," BAS186"," BAS187"," BAS188"," BAS189"," BAS190"," BAS191"," BAS192"," BAS193"," BAS194"," BAS195"," BAS196"," BAS197"," BAS198"," BAS199"," BAS200"," BAS201"," BAS202"," BAS203"," BAS204"," BAS205"," BAS206"," BAS207"," BAS208"," BAS209"," BAS210"," BAS211"," BAS212"," BAS213"," BAS214"," BAS215"," BAS216"," BAS217"," BAS218"," BAS219"," BAS220"," BAS221"," BAS222"," BAS223"," BAS224"," BAS225"," BAS226"," BAS227"," BAS228"," BAS229"," BAS230"]
[null,{"$f":"IF(B169=B147,\"SI\",\"NO\")","v":"SI"},{"$f":"IF(C169=C147,\"SI\",\"NO\")","v":"SI"},"SI","SI","SI","SI","SI","SI","SI","SI","SI","SI","SI","SI","SI","SI","SI","SI","SI","SI","SI","SI","SI","SI","SI","SI","SI","SI","SI","SI","SI","SI","SI","SI","SI","SI","SI","SI","SI","SI","SI","SI","SI","SI","SI","SI","SI","SI","SI","SI","SI","SI","SI","SI","SI","SI","SI","SI","SI","SI","SI","SI","SI","SI","SI",{"$f":"IF(BO169=BO147,\"SI\",\"NO\")","v":"SI"},"SI","SI","SI","SI","SI","SI","SI","SI","SI","SI","SI","SI","SI","SI","SI","SI","SI","SI","SI","SI","SI","SI","SI","SI","SI","SI","SI","SI","SI","SI","SI","SI","SI","SI","SI","SI","SI","SI","SI","SI","SI","SI","SI","SI","SI","SI","SI","SI","SI","SI","SI","SI","SI","SI","SI","SI","SI","SI","SI","SI","SI","SI","SI",{"$f":"IF(EA169=EA147,\"SI\",\"NO\")","v":"SI"},"SI","SI","SI","SI","SI","SI","SI","SI","SI","SI","SI","SI","SI","SI","SI","SI","SI","SI","SI","SI","SI","SI","SI","SI","SI","SI","SI","SI","SI","SI","SI","SI","SI","SI","SI","SI","SI","SI","SI","SI","SI","SI","SI","SI","SI","SI","SI","SI","SI","SI","SI","SI","SI","SI","SI","SI","SI","SI","SI","SI","SI","SI","SI",{"$f":"IF(GM169=GM147,\"SI\",\"NO\")","v":"SI"},"SI","SI","SI","SI","SI","SI","SI","SI","SI","SI","SI","SI","SI","SI","SI","SI","SI","SI","SI","SI","SI","SI","SI","SI","SI","SI","SI","SI","SI","SI","SI","SI","SI","SI","SI","SI"]

{"sheet":"INFORME","index":2,"n_rows":393,"n_cols":33,"rows_kept":393,"cut":false,"hidden":false,"merged":[[60,3,60,6],[61,3,61,6],[62,3,62,6],[63,3,63,6],[52,3,52,6],[53,3,53,6],[54,3,54,6],[8,6,8,7],[9,6,9,7],[57,3,57,6],[46,3,46,6],[47,3,47,6],[48,3,48,6],[51,3,51,6],[58,3,58,6],[59,3,59,6],[34,3,34,6],[39,3,39,6],[6,6,6,7],[7,6,7,7],[81,2,91,3],[81,4,83,4],[89,4,91,4],[81,5,81,6],[82,5,82,6],[83,5,83,6],[90,5,90,6],[91,5,91,6],[84,4,84,6],[85,4,85,6],[86,4,86,6],[87,4,87,6],[88,4,88,6],[78,5,78,6],[79,5,79,6],[7,3,7,5],[64,3,64,6],[65,3,65,6],[66,3,66,6],[67,3,67,6],[68,3,68,6],[69,3,69,6],[69,11,69,14],[38,9,38,14],[36,1,36,7],[36,9,36,15],[37,2,37,6],[63,11,63,14],[64,11,64,14],[65,11,65,14],[66,11,66,14],[67,11,67,14],[68,11,68,14],[57,11,57,14],[58,11,58,14],[59,11,59,14],[60,11,60,14],[61,11,61,14],[62,11,62,14],[49,3,49,6],[50,3,50,6],[46,9,46,10],[47,9,47,10],[40,11,40,14],[41,11,41,14],[42,11,42,14],[0,1,0,15],[1,1,1,15],[6,3,6,4],[11,8,11,11],[10,6,10,7],[11,6,11,7],[8,3,8,4],[10,2,10,3],[12,2,12,3],[9,3,9,5],[3,1,3,15],[5,3,5,5],[5,14,5,15],[6,14,6,15],[7,14,7,15],[7,8,7,11],[5,8,5,11],[9,8,9,11],[5,1,5,2],[6,1,6,2],[7,1,7,2],[8,1,8,2],[9,1,9,2],[5,6,5,7],[34,9,34,10],[32,3,32,6],[33,3,33,6],[55,11,55,14],[56,11,56,14],[46,11,46,14],[47,11,47,14],[48,11,48,14],[49,11,49,14],[50,11,50,14],[51,11,51,14],[52,11,52,14],[53,11,53,14],[54,11,54,14],[43,11,43,14],[44,11,44,14],[42,3,42,6],[43,3,43,6],[44,3,44,6],[54,9,54,10],[55,9,55,10],[56,9,56,10],[55,3,55,6],[56,3,56,6],[23,1,23,2],[23,11,23,14],[28,9,28,10],[45,3,45,6],[29,11,29,14],[30,11,30,14],[31,11,31,14],[32,11,32,14],[33,11,33,14],[34,11,34,14],[29,3,29,6],[30,3,30,6],[31,3,31,6],[39,9,39,10],[40,9,40,10],[41,9,41,10],[42,9,42,10],[43,9,43,10],[44,9,44,10],[45,9,45,10],[45,11,45,14],[39,11,39,14],[32,9,32,10],[33,9,33,10],[17,11,17,14],[18,11,18,14],[19,11,19,14],[20,11,20,14],[21,11,21,14],[26,3,26,6],[27,3,27,6],[28,3,28,6],[17,9,17,10],[18,9,18,10],[19,9,19,10],[20,9,20,10],[21,9,21,10],[22,9,22,10],[23,9,23,10],[24,9,24,10],[24,11,24,14],[25,11,25,14],[289,2,289,11],[17,3,17,6],[18,3,18,6],[19,3,19,6],[20,3,20,6],[21,3,21,6],[22,3,22,6],[23,3,23,6],[24,3,24,6],[25,3,25,6],[285,2,285,7],[286,2,286,7],[274,1,274,7],[234,2,234,11],[235,2,235,11],[236,2,236,11],[237,2,237,11],[232,1,232,11],[246,2,246,10],[245,1,245,10],[238,5,238,11],[239,5,239,11],[240,5,240,11],[241,5,241,11],[294,2,294,10],[295,2,295,10],[296,2,296,10],[297,2,297,10],[298,2,298,10],[299,2,299,10],[307,2,307,10],[308,2,308,10],[309,2,309,10],[310,2,310,10],[311,2,311,10],[312,2,312,10],[332,2,332,10],[317,2,317,10],[318,2,318,10],[319,2,319,10],[320,2,320,10],[321,2,321,10],[322,2,322,10],[343,2,343,10],[344,2,344,10],[345,2,345,10],[335,2,335,10],[325,2,325,10],[326,2,326,10],[327,2,327,10],[328,2,328,10],[329,2,329,10],[330,2,330,10],[356,2,356,10],[357,2,357,10],[358,2,358,10],[359,2,359,10],[360,2,360,10],[348,2,348,10],[349,2,349,10],[350,2,350,10],[351,2,351,10],[352,2,352,10],[353,2,353,10],[354,2,354,10],[371,2,371,8],[372,2,372,8],[373,2,373,8],[390,2,390,8],[386,1,386,8],[377,2,377,8],[378,2,378,8],[379,2,379,8],[380,2,380,8],[381,2,381,8],[382,2,382,8],[383,2,383,8],[387,2,387,8],[388,2,388,8],[389,2,389,8],[376,1,376,8],[363,1,363,8],[364,2,364,8],[365,2,365,8],[258,2,258,10],[259,2,259,10],[256,1,256,10],[275,2,275,7],[276,2,276,7],[277,2,277,7],[304,2,304,10],[305,2,305,10],[306,2,306,10],[302,2,302,10],[290,2,290,10],[291,2,291,10],[292,2,292,10],[293,2,293,10],[281,2,281,7],[282,2,282,7],[283,2,283,7],[284,2,284,7],[278,2,278,7],[279,2,279,7],[280,2,280,7],[189,2,189,8],[190,2,190,8],[191,2,191,8],[242,5,242,11],[207,1,207,8],[223,1,223,8],[224,2,224,8],[225,2,225,8],[226,2,226,8],[227,2,227,8],[211,2,211,8],[212,2,212,8],[213,2,213,8],[214,2,214,8],[215,2,215,8],[216,2,216,8],[228,2,228,8],[233,2,233,11],[218,2,218,8],[219,2,219,8],[220,2,220,8],[217,2,217,8],[204,2,204,8],[208,2,208,8],[169,1,169,8],[188,2,188,8],[187,1,187,8],[175,4,175,8],[176,4,176,8],[177,4,177,8],[178,4,178,8],[179,4,179,8],[180,2,180,8],[174,2,177,3],[178,2,179,3],[181,2,183,3],[184,2,184,3],[170,2,170,8],[171,2,171,8],[172,2,172,8],[173,2,173,8],[174,4,174,8],[185,3,185,6],[181,4,181,8],[182,4,182,8],[183,4,183,8],[184,4,184,8],[109,4,109,9],[110,4,110,9],[111,4,111,9],[112,4,112,9],[109,2,113,3],[113,4,113,9],[157,2,157,9],[158,2,158,9],[159,2,159,9],[156,1,156,9],[135,2,136,4],[135,1,136,1],[135,5,135,6],[136,5,136,6],[143,2,143,8],[144,2,144,8],[134,2,134,6],[140,2,140,8],[141,2,141,8],[142,2,142,8],[139,1,139,8],[128,1,129,1],[133,1,133,6],[127,2,127,7],[66,9,66,10],[67,9,67,10],[68,9,68,10],[69,9,69,10],[80,2,80,6],[76,5,76,6],[77,5,77,6],[60,9,60,10],[61,9,61,10],[62,9,62,10],[63,9,63,10],[64,9,64,10],[65,9,65,10],[69,1,69,2],[72,7,72,9],[72,10,72,12],[73,1,73,6],[74,2,79,3],[74,5,74,6],[75,5,75,6],[63,1,63,2],[64,1,64,2],[65,1,65,2],[66,1,66,2],[57,9,57,10],[58,9,58,10],[59,9,59,10],[48,9,48,10],[49,9,49,10],[50,9,50,10],[51,9,51,10],[52,9,52,10],[53,9,53,10],[51,1,51,2],[52,1,52,2],[53,1,53,2],[54,1,54,2],[55,1,55,2],[56,1,56,2],[39,1,39,2],[40,1,40,2],[41,1,41,2],[33,1,33,2],[34,1,34,2],[37,10,37,14],[38,1,38,6],[40,3,40,6],[41,3,41,6],[72,13,72,15],[42,1,42,2],[43,1,43,2],[44,1,44,2],[67,1,67,2],[68,1,68,2],[57,1,57,2],[58,1,58,2],[59,1,59,2],[60,1,60,2],[61,1,61,2],[62,1,62,2],[45,1,45,2],[46,1,46,2],[47,1,47,2],[48,1,48,2],[49,1,49,2],[50,1,50,2],[29,9,29,10],[30,9,30,10],[31,9,31,10],[15,10,15,14],[25,9,25,10],[26,9,26,10],[27,9,27,10],[22,11,22,14],[15,2,15,6],[24,1,24,2],[25,1,25,2],[26,1,26,2],[27,1,27,2],[28,1,28,2],[17,1,17,2],[18,1,18,2],[19,1,19,2],[20,1,20,2],[21,1,21,2],[22,1,22,2],[26,11,26,14],[27,11,27,14],[28,11,28,14],[16,1,16,6],[14,9,14,14],[16,9,16,14],[29,1,29,2],[30,1,30,2],[31,1,31,2],[32,1,32,2],[392,1,392,9],[367,2,367,8],[368,2,368,8],[369,2,369,8],[370,2,370,8],[366,2,366,8],[355,2,355,10],[339,2,339,10],[340,2,340,10],[341,2,341,10],[342,2,342,10],[336,2,336,10],[337,2,337,10],[338,2,338,10],[331,2,331,10],[313,2,313,10],[314,2,314,10],[303,2,303,10],[267,2,267,6],[268,2,268,6],[269,2,269,6],[270,2,270,6],[271,2,271,6],[262,1,262,6],[263,2,263,6],[264,2,264,6],[265,2,265,6],[266,2,266,6],[251,2,251,10],[252,2,252,10],[253,2,253,10],[257,2,257,10],[247,2,247,10],[248,2,248,10],[249,2,249,10],[250,2,250,10],[238,2,242,3],[209,2,209,8],[210,2,210,8],[202,2,202,8],[203,2,203,8],[192,2,192,8],[193,2,193,8],[194,2,194,8],[195,2,195,8],[196,2,196,8],[197,2,197,8],[198,2,198,8],[199,2,199,8],[200,2,200,8],[201,2,201,8],[166,2,166,9],[161,1,163,1],[164,1,165,1],[165,2,165,9],[151,2,151,6],[152,2,152,6],[153,2,153,6],[157,1,159,1],[147,1,147,6],[148,2,148,6],[149,2,149,6],[150,2,150,6],[160,2,160,9],[161,2,161,9],[162,2,162,9],[163,2,163,9],[164,2,164,9],[128,2,128,7],[129,2,129,7],[130,2,130,7],[125,2,125,7],[126,2,126,7],[124,1,124,7],[114,2,116,3],[114,4,114,9],[115,4,115,9],[116,4,116,9],[117,2,117,9],[118,2,118,9],[119,2,119,9],[120,2,120,9],[121,2,121,9],[106,1,108,1],[104,2,104,9],[105,2,105,9],[94,1,94,6],[95,1,97,1],[98,1,100,1],[103,1,103,9],[74,1,79,1],[81,1,91,1],[95,2,97,4],[98,2,100,4],[95,5,95,6],[96,5,96,6],[97,5,97,6],[98,5,98,6],[99,5,99,6],[100,5,100,6],[89,5,89,6],[106,2,108,4],[106,5,106,9],[107,5,107,9],[108,5,108,9],[74,4,76,4],[77,4,79,4]]}
[null,"GERENCIA REGIONAL DE SALUD CUSCO"]
[null,"DIRECCION DE ESTADISTICA, INFORMATICA Y TELECOMUNICACION"]
[]
[null,"REPORTE DE ACTIVIDADES MENSUALES DE LA ETAPA DE VIDA ADOLESCENTE"]
[]
[null,"DIRESA",null,"CUSCO",null,null,"PROVINCIA",null,{"$f":"+TABLAS!O12","v":""},null,null,null,null,"AÑO",{"$f":"+TABLAS!J16","v":"2025"}]
[]
[null,"RED DE SALUD ",null,{"$f":"+TABLAS!O9","v":"03 - LA CONVENCION"},null,null,"DISTRITO",null,{"$f":"+TABLAS!O13","v":""},null,null,null,null,"MES",{"$f":"+TABLAS!N26","v":"ENE - MAR"}]
[]
[null,"MICRO RED",null,{"$f":"+TABLAS!O10","v":""},null,null,"EE.SS.",null,{"$f":"+TABLAS!O11","v":""}]
[]
[null,null,null,null,null,null,"EJECUTORA",null,{"$f":"+TABLAS!O14","v":""}]
[]
[null,"usp_TRAMA_BASE_ADOLESCENTE_2020_RPT_01_MORBILIDAD",null,null,null,null,null,null,null,null,null,null,null,null,null,null,null,null,null,null,null,null,null,null,null,null,null,null,"usp_TRAMA_BASE_ADOLESCENTE_2020_RPT_01_MORBILIDAD"]
[null,"MORBILIDAD DEL ADOLESCENTE",null,null,null,null,null,null,null,"MORBILIDAD DEL ADOLESCENTE"]
[null,"CIE10","DIAGNÓSTICOS",null,null,null,null,"Nro",null,"CIE10","DIAGNÓSTICOS",null,null,null,null,"Nro",null,null,null,null,"\";TABLAS!$A$75)"]
[null,"Infecciones Respiratorias Agudas Complicadas",null,null,null,null,null,null,null,"Infecciones Respiratorias Agudas No Complicadas",null,null,null,null,null,null,null,null,null,null,"=+IMPORTARDATOSDINAMICOS(\" BAS",null,null,null,null,null,null,null,"SINTAXIS"]
[null,"A37",null,null,null,null,null,{"$f":"+GETPIVOTDATA(\" BAS001\",TABLAS!$A$75)","v":0},null,"H660+H669",null,null,null,null,null,{"$f":"+GETPIVOTDATA(\" BAS019\",TABLAS!$A$75)","v":10},null,null,null,{"$f":"CONCATENATE($U$17,V18,$U$16)","v":"=+IMPORTARDATOSDINAMICOS(\" BAS001\";TABLAS!$A$75)"},{"$f":"CONCATENATE($U$17,W18,$U$16)","v":"=+IMPORTARDATOSDINAMICOS(\" BAS019\";TABLAS!$A$75)"},{"$f":"IF(X18<10,CONCATENATE(\"00\",X18),IF(AND(X18<100,X18>9),CONCATENATE(\"0\",X18),X18))","v":"001"},{"$f":"IF(Y18<10,CONCATENATE(\"00\",Y18),IF(AND(Y18<100,Y18>9),CONCATENATE(\"0\",Y18),Y18))","v":"019"},1,{"$f":"+X35+1","v":19},null,null,null,"A37","H660+H669"]
[null,"J050+J051",null,null,null,null,null,{"$f":"+GETPIVOTDATA(\" BAS002\",TABLAS!$A$75)","v":0},null,"J00",null,null,null,null,null,{"$f":"+GETPIVOTDATA(\" BAS020\",TABLAS!$A$75)","v":162},null,null,null,{"$f":"CONCATENATE($U$17,V19,$U$16)","v":"=+IMPORTARDATOSDINAMICOS(\" BAS002\";TABLAS!$A$75)"},"=+IMPORTARDATOSDINAMICOS(\" BAS020\";TABLAS!$A$75)",{"$f":"IF(X19<10,CONCATENATE(\"00\",X19),IF(AND(X19<100,X19>9),CONCATENATE(\"0\",X19),X19))","v":"002"},"020",{"$f":"+X18+1","v":2},{"$f":"+Y18+1","v":20},null,null,null,"J050+J051","J00"]
[null,"J11",null,null,null,null,null,{"$f":"+GETPIVOTDATA(\" BAS003\",TABLAS!$A$75)","v":0},null,"J01",null,null,null,null,null,{"$f":"+GETPIVOTDATA(\" BAS021\",TABLAS!$A$75)","v":4},null,null,null,"=+IMPORTARDATOSDINAMICOS(\" BAS003\";TABLAS!$A$75)","=+IMPORTARDATOSDINAMICOS(\" BAS021\";TABLAS!$A$75)","003","021",{"$f":"+X19+1","v":3},21,null,null,null,"J11","J01"]
[null,"J13",null,null,null,null,null,{"$f":"+GETPIVOTDATA(\" BAS004\",TABLAS!$A$75)","v":0},null,"J020+J028+J029",null,null,null,null,null,{"$f":"+GETPIVOTDATA(\" BAS022\",TABLAS!$A$75)","v":418},null,null,null,"=+IMPORTARDATOSDINAMICOS(\" BAS004\";TABLAS!$A$75)","=+IMPORTARDATOSDINAMICOS(\" BAS022\";TABLAS!$A$75)","004","022",4,22,null,null,null,"J13","J020+J028+J029"]
[null,"J16",null,null,null,null,null,{"$f":"+GETPIVOTDATA(\" BAS005\",TABLAS!$A$75)","v":0},null,"J0309",null,null,null,null,null,{"$f":"+GETPIVOTDATA(\" BAS023\",TABLAS!$A$75)","v":3},null,null,null,"=+IMPORTARDATOSDINAMICOS(\" BAS005\";TABLAS!$A$75)","=+IMPORTARDATOSDINAMICOS(\" BAS023\";TABLAS!$A$75)","005","023",5,23,null,null,null,"J16","J0309"]
[null,"J180",null,null,null,null,null,{"$f":"+GETPIVOTDATA(\" BAS006\",TABLAS!$A$75)","v":0},null,"J040+J041+J042",null,null,null,null,null,{"$f":"+GETPIVOTDATA(\" BAS024\",TABLAS!$A$75)","v":2},null,null,null,"=+IMPORTARDATOSDINAMICOS(\" BAS006\";TABLAS!$A$75)","=+IMPORTARDATOSDINAMICOS(\" BAS024\";TABLAS!$A$75)","006","024",6,24,null,null,null,"J180","J040+J041+J042"]
[null,"J181",null,null,null,null,null,{"$f":"+GETPIVOTDATA(\" BAS007\",TABLAS!$A$75)","v":0},null,"J069",null,null,null,null,null,{"$f":"+GETPIVOTDATA(\" BAS025\",TABLAS!$A$75)","v":6},null,null,null,"=+IMPORTARDATOSDINAMICOS(\" BAS007\";TABLAS!$A$75)","=+IMPORTARDATOSDINAMICOS(\" BAS025\";TABLAS!$A$75)","007","025",7,25,null,null,null,"J181","J069"]
[null,"J188",null,null,null,null,null,{"$f":"+GETPIVOTDATA(\" BAS008\",TABLAS!$A$75)","v":0},null,"J209",null,null,null,null,null,{"$f":"+GETPIVOTDATA(\" BAS026\",TABLAS!$A$75)","v":51},null,null,null,"=+IMPORTARDATOSDINAMICOS(\" BAS008\";TABLAS!$A$75)","=+IMPORTARDATOSDINAMICOS(\" BAS026\";TABLAS!$A$75)","008","026",8,26,null,null,null,"J188","J209"]
[null,"J189",null,null,null,null,null,{"$f":"+GETPIVOTDATA(\" BAS009\",TABLAS!$A$75)","v":1},null,null,null,null,null,null,null,null,null,null,null,"=+IMPORTARDATOSDINAMICOS(\" BAS009\";TABLAS!$A$75)",null,"009","00",9,null,null,null,null,"J189"]
[null,"J229",null,null,null,null,null,{"$f":"+GETPIVOTDATA(\" BAS010\",TABLAS!$A$75)","v":0},null,null,null,null,null,null,null,null,null,null,null,"=+IMPORTARDATOSDINAMICOS(\" BAS010\";TABLAS!$A$75)",null,"010","00",10,null,null,null,null,"J229"]
[null,"J29",null,null,null,null,null,{"$f":"+GETPIVOTDATA(\" BAS011\",TABLAS!$A$75)","v":0},null,null,null,null,null,null,null,null,null,null,null,"=+IMPORTARDATOSDINAMICOS(\" BAS011\";TABLAS!$A$75)",null,"011","00",11,null,null,null,null,"J29"]
[null,"J448+J449",null,null,null,null,null,{"$f":"+GETPIVOTDATA(\" BAS012\",TABLAS!$A$75)","v":0},null,null,null,null,null,null,null,null,null,null,null,"=+IMPORTARDATOSDINAMICOS(\" BAS012\";TABLAS!$A$75)",null,"012","00",12,null,null,null,null,"J448+J449"]
[null,"J450+J459",null,null,null,null,null,{"$f":"+GETPIVOTDATA(\" BAS013\",TABLAS!$A$75)","v":0},null,null,null,null,null,null,null,null,null,null,null,"=+IMPORTARDATOSDINAMICOS(\" BAS013\";TABLAS!$A$75)",null,"013","00",13,null,null,null,null,"J450+J459"]
[null,"J46",null,null,null,null,null,{"$f":"+GETPIVOTDATA(\" BAS014\",TABLAS!$A$75)","v":1},null,null,null,null,null,null,null,null,null,null,null,"=+IMPORTARDATOSDINAMICOS(\" BAS014\";TABLAS!$A$75)",null,"014","00",14,null,null,null,null,"J46"]
[null,"J851",null,null,null,null,null,{"$f":"+GETPIVOTDATA(\" BAS015\",TABLAS!$A$75)","v":0},null,null,null,null,null,null,null,null,null,null,null,"=+IMPORTARDATOSDINAMICOS(\" BAS015\";TABLAS!$A$75)",null,"015","00",15,null,null,null,null,"J851"]
[null,"J86",null,null,null,null,null,{"$f":"+GETPIVOTDATA(\" BAS016\",TABLAS!$A$75)","v":0},null,null,null,null,null,null,null,null,null,null,null,"=+IMPORTARDATOSDINAMICOS(\" BAS016\";TABLAS!$A$75)",null,"016","00",16,null,null,null,null,"J86"]
[null,"J90",null,null,null,null,null,{"$f":"+GETPIVOTDATA(\" BAS017\",TABLAS!$A$75)","v":0},null,null,null,null,null,null,null,null,null,null,null,"=+IMPORTARDATOSDINAMICOS(\" BAS017\";TABLAS!$A$75)",null,"017","00",17,null,null,null,null,"J90"]
[null,"J939",null,null,null,null,null,{"$f":"+GETPIVOTDATA(\" BAS018\",TABLAS!$A$75)","v":0},null,null,null,null,null,null,null,null,null,null,null,"=+IMPORTARDATOSDINAMICOS(\" BAS018\";TABLAS!$A$75)",null,"018","00",18,null,null,null,null,"J939"]
[]
[null,"MORBILIDAD DEL ADOLESCENTE",null,null,null,null,null,null,null,"MORBILIDAD DEL ADOLESCENTE"]
[null,"CIE10","DIAGNÓSTICOS",null,null,null,null,"Nro",null,"CIE10","DIAGNÓSTICOS",null,null,null,null,"Nro"]
[null,"Enfermedades Diarreicas Agudas Complicadas",null,null,null,null,null,null,null,"Enfermedades Diarreicas Agudas No Complicadas",null,null,null,null,null,null,null,null,null,null,null,null,null,null,null,null,null,null,"(A00+E86 /D)",null,"A00"]
[null,"(A00+E86 /D)",null,null,null,null,null,{"$f":"+GETPIVOTDATA(\" BAS027\",TABLAS!$A$75)","v":0},null,"A00",null,null,null,null,null,{"$f":"+GETPIVOTDATA(\" BAS058\",TABLAS!$A$75)","v":0},null,null,null,{"$f":"CONCATENATE($U$17,V40,$U$16)","v":"=+IMPORTARDATOSDINAMICOS(\" BAS027\";TABLAS!$A$75)"},{"$f":"CONCATENATE($U$17,W40,$U$16)","v":"=+IMPORTARDATOSDINAMICOS(\" BAS058\";TABLAS!$A$75)"},{"$f":"IF(X40<10,CONCATENATE(\"00\",X40),IF(AND(X40<100,X40>9),CONCATENATE(\"0\",X40),X40))","v":"027"},{"$f":"IF(Y40<10,CONCATENATE(\"00\",Y40),IF(AND(Y40<100,Y40>9),CONCATENATE(\"0\",Y40),Y40))","v":"058"},{"$f":"+Y25+1","v":27},{"$f":"+X70+1","v":58},null,null,null,"(A00+R571 /D)",null,"A011"]
[null,"(A00+R571 /D)",null,null,null,null,null,{"$f":"+GETPIVOTDATA(\" BAS028\",TABLAS!$A$75)","v":0},null,"A011",null,null,null,null,null,{"$f":"+GETPIVOTDATA(\" BAS059\",TABLAS!$A$75)","v":0},null,null,null,"=+IMPORTARDATOSDINAMICOS(\" BAS028\";TABLAS!$A$75)","=+IMPORTARDATOSDINAMICOS(\" BAS059\";TABLAS!$A$75)","028","059",{"$f":"+X40+1","v":28},59,null,null,null,"(A011+E86 /D)",null,"A013"]
[null,"(A011+E86 /D)",null,null,null,null,null,{"$f":"+GETPIVOTDATA(\" BAS029\",TABLAS!$A$75)","v":0},null,"A013",null,null,null,null,null,{"$f":"+GETPIVOTDATA(\" BAS060\",TABLAS!$A$75)","v":0},null,null,null,"=+IMPORTARDATOSDINAMICOS(\" BAS029\";TABLAS!$A$75)","=+IMPORTARDATOSDINAMICOS(\" BAS060\";TABLAS!$A$75)","029","060",29,60,null,null,null,"(A011+R571 /D)",null,"A018"]
[null,"(A011+R571 /D)",null,null,null,null,null,{"$f":"+GETPIVOTDATA(\" BAS030\",TABLAS!$A$75)","v":0},null,"A018",null,null,null,null,null,{"$f":"+GETPIVOTDATA(\" BAS061\",TABLAS!$A$75)","v":0},null,null,null,"=+IMPORTARDATOSDINAMICOS(\" BAS030\";TABLAS!$A$75)","=+IMPORTARDATOSDINAMICOS(\" BAS061\";TABLAS!$A$75)","030","061",30,61,null,null,null,"(A013+E86 / D)",null,"A020"]
[null,"(A013+E86 / D)",null,null,null,null,null,{"$f":"+GETPIVOTDATA(\" BAS031\",TABLAS!$A$75)","v":0},null,"A020",null,null,null,null,null,{"$f":"+GETPIVOTDATA(\" BAS062\",TABLAS!$A$75)","v":0},null,null,null,"=+IMPORTARDATOSDINAMICOS(\" BAS031\";TABLAS!$A$75)","=+IMPORTARDATOSDINAMICOS(\" BAS062\";TABLAS!$A$75)","031","062",31,62,null,null,null,"(A013+R571 /D)",null,"A029"]
[null,"(A013+R571 /D)",null,null,null,null,null,{"$f":"+GETPIVOTDATA(\" BAS032\",TABLAS!$A$75)","v":0},null,"A029",null,null,null,null,null,{"$f":"+GETPIVOTDATA(\" BAS063\",TABLAS!$A$75)","v":0},null,null,null,"=+IMPORTARDATOSDINAMICOS(\" BAS032\";TABLAS!$A$75)","=+IMPORTARDATOSDINAMICOS(\" BAS063\";TABLAS!$A$75)","032","063",32,63,null,null,null,"(A018+E86 /D)",null,"A030"]
[null,"(A018+E86 /D)",null,null,null,null,null,{"$f":"+GETPIVOTDATA(\" BAS033\",TABLAS!$A$75)","v":0},null,"A030",null,null,null,null,null,{"$f":"+GETPIVOTDATA(\" BAS064\",TABLAS!$A$75)","v":0},null,null,null,"=+IMPORTARDATOSDINAMICOS(\" BAS033\";TABLAS!$A$75)","=+IMPORTARDATOSDINAMICOS(\" BAS064\";TABLAS!$A$75)","033","064",33,64,null,null,null,"(A018+R571 /D)",null,"A039"]
[null,"(A018+R571 /D)",null,null,null,null,null,{"$f":"+GETPIVOTDATA(\" BAS034\",TABLAS!$A$75)","v":0},null,"A039",null,null,null,null,null,{"$f":"+GETPIVOTDATA(\" BAS065\",TABLAS!$A$75)","v":0},null,null,null,"=+IMPORTARDATOSDINAMICOS(\" BAS034\";TABLAS!$A$75)","=+IMPORTARDATOSDINAMICOS(\" BAS065\";TABLAS!$A$75)","034","065",34,65,null,null,null,"(A020 + E86 / D)",null,"A045"]
[null,"(A020 + E86 / D)",null,null,null,null,null,{"$f":"+GETPIVOTDATA(\" BAS035\",TABLAS!$A$75)","v":0},null,"A045",null,null,null,null,null,{"$f":"+GETPIVOTDATA(\" BAS066\",TABLAS!$A$75)","v":0},null,null,null,"=+IMPORTARDATOSDINAMICOS(\" BAS035\";TABLAS!$A$75)","=+IMPORTARDATOSDINAMICOS(\" BAS066\";TABLAS!$A$75)","035","066",35,66,null,null,null,"(A020+R571 /D)",null,"A049"]
[null,"(A020+R571 /D)",null,null,null,null,null,{"$f":"+GETPIVOTDATA(\" BAS036\",TABLAS!$A$75)","v":0},null,"A049",null,null,null,null,null,{"$f":"+GETPIVOTDATA(\" BAS067\",TABLAS!$A$75)","v":22},null,null,null,"=+IMPORTARDATOSDINAMICOS(\" BAS036\";TABLAS!$A$75)","=+IMPORTARDATOSDINAMICOS(\" BAS067\";TABLAS!$A$75)","036","067",36,67,null,null,null,"(A029+E86 / D)",null,"A05"]
[null,"(A029+E86 / D)",null,null,null,null,null,{"$f":"+GETPIVOTDATA(\" BAS037\",TABLAS!$A$75)","v":0},null,"A05",null,null,null,null,null,{"$f":"+GETPIVOTDATA(\" BAS068\",TABLAS!$A$75)","v":7},null,null,null,"=+IMPORTARDATOSDINAMICOS(\" BAS037\";TABLAS!$A$75)","=+IMPORTARDATOSDINAMICOS(\" BAS068\";TABLAS!$A$75)","037","068",37,68,null,null,null,"(A029+R571 /D)",null,"A060"]
[null,"(A029+R571 /D)",null,null,null,null,null,{"$f":"+GETPIVOTDATA(\" BAS038\",TABLAS!$A$75)","v":0},null,"A060",null,null,null,null,null,{"$f":"+GETPIVOTDATA(\" BAS069\",TABLAS!$A$75)","v":0},null,null,null,"=+IMPORTARDATOSDINAMICOS(\" BAS038\";TABLAS!$A$75)","=+IMPORTARDATOSDINAMICOS(\" BAS069\";TABLAS!$A$75)","038","069",38,69,null,null,null,"(A030+E86 /D)",null,"A062"]
[null,"(A030+E86 /D)",null,null,null,null,null,{"$f":"+GETPIVOTDATA(\" BAS039\",TABLAS!$A$75)","v":0},null,"A062",null,null,null,null,null,{"$f":"+GETPIVOTDATA(\" BAS070\",TABLAS!$A$75)","v":0},null,null,null,"=+IMPORTARDATOSDINAMICOS(\" BAS039\";TABLAS!$A$75)","=+IMPORTARDATOSDINAMICOS(\" BAS070\";TABLAS!$A$75)","039","070",39,70,null,null,null,"(A039+E86 /D)",null,"A07"]
[null,"(A039+E86 /D)",null,null,null,null,null,{"$f":"+GETPIVOTDATA(\" BAS040\",TABLAS!$A$75)","v":0},null,"A07",null,null,null,null,null,{"$f":"+GETPIVOTDATA(\" BAS071\",TABLAS!$A$75)","v":10},null,null,null,"=+IMPORTARDATOSDINAMICOS(\" BAS040\";TABLAS!$A$75)","=+IMPORTARDATOSDINAMICOS(\" BAS071\";TABLAS!$A$75)","040","071",40,71,null,null,null,"(A045+E86 /D)",null,"A080"]
[null,"(A045+E86 /D)",null,null,null,null,null,{"$f":"+GETPIVOTDATA(\" BAS041\",TABLAS!$A$75)","v":0},null,"A080",null,null,null,null,null,{"$f":"+GETPIVOTDATA(\" BAS072\",TABLAS!$A$75)","v":0},null,null,null,"=+IMPORTARDATOSDINAMICOS(\" BAS041\";TABLAS!$A$75)","=+IMPORTARDATOSDINAMICOS(\" BAS072\";TABLAS!$A$75)","041","072",41,72,null,null,null,"(A049+E86 /D)",null,"A082"]
[null,"(A049+E86 /D)",null,null,null,null,null,{"$f":"+GETPIVOTDATA(\" BAS042\",TABLAS!$A$75)","v":0},null,"A082",null,null,null,null,null,{"$f":"+GETPIVOTDATA(\" BAS073\",TABLAS!$A$75)","v":0},null,null,null,"=+IMPORTARDATOSDINAMICOS(\" BAS042\";TABLAS!$A$75)","=+IMPORTARDATOSDINAMICOS(\" BAS073\";TABLAS!$A$75)","042","073",42,73,null,null,null,"(A05+E86 /D)",null,"A083"]
[null,"(A05+E86 /D)",null,null,null,null,null,{"$f":"+GETPIVOTDATA(\" BAS043\",TABLAS!$A$75)","v":0},null,"A083",null,null,null,null,null,{"$f":"+GETPIVOTDATA(\" BAS074\",TABLAS!$A$75)","v":0},null,null,null,"=+IMPORTARDATOSDINAMICOS(\" BAS043\";TABLAS!$A$75)","=+IMPORTARDATOSDINAMICOS(\" BAS074\";TABLAS!$A$75)","043","074",43,74,null,null,null,"(A05+R571 /D)",null,"A084"]
[null,"(A05+R571 /D)",null,null,null,null,null,{"$f":"+GETPIVOTDATA(\" BAS044\",TABLAS!$A$75)","v":0},null,"A084",null,null,null,null,null,{"$f":"+GETPIVOTDATA(\" BAS075\",TABLAS!$A$75)","v":4},null,null,null,"=+IMPORTARDATOSDINAMICOS(\" BAS044\";TABLAS!$A$75)","=+IMPORTARDATOSDINAMICOS(\" BAS075\";TABLAS!$A$75)","044","075",{"$f":"+X56+1","v":44},75,null,null,null,"(A060+E86 /D)"]
[null,"(A060+E86 /D)",null,null,null,null,null,{"$f":"+GETPIVOTDATA(\" BAS045\",TABLAS!$A$75)","v":0},null,null,null,null,null,null,null,null,null,null,null,"=+IMPORTARDATOSDINAMICOS(\" BAS045\";TABLAS!$A$75)",null,"045","00",45,null,null,null,null,"(A062+E86 /D)"]
[null,"(A062+E86 /D)",null,null,null,null,null,{"$f":"+GETPIVOTDATA(\" BAS046\",TABLAS!$A$75)","v":0},null,null,null,null,null,null,null,null,null,null,null,"=+IMPORTARDATOSDINAMICOS(\" BAS046\";TABLAS!$A$75)",null,"046","00",46,null,null,null,null,"(A07+E86 /D)"]
[null,"(A07+E86 /D)",null,null,null,null,null,{"$f":"+GETPIVOTDATA(\" BAS047\",TABLAS!$A$75)","v":0},null,null,null,null,null,null,null,null,null,null,null,"=+IMPORTARDATOSDINAMICOS(\" BAS047\";TABLAS!$A$75)",null,"047","00",47,null,null,null,null,"(A07+R571 /D)"]
[null,"(A07+R571 /D)",null,null,null,null,null,{"$f":"+GETPIVOTDATA(\" BAS048\",TABLAS!$A$75)","v":0},null,null,null,null,null,null,null,null,null,null,null,"=+IMPORTARDATOSDINAMICOS(\" BAS048\";TABLAS!$A$75)",null,"048","00",48,null,null,null,null,"(A080+E86 /D)"]
[null,"(A080+E86 /D)",null,null,null,null,null,{"$f":"+GETPIVOTDATA(\" BAS049\",TABLAS!$A$75)","v":0},null,null,null,null,null,null,null,null,null,null,null,"=+IMPORTARDATOSDINAMICOS(\" BAS049\";TABLAS!$A$75)",null,"049","00",49,null,null,null,null,"(A080+R571 /D)"]
[null,"(A080+R571 /D)",null,null,null,null,null,{"$f":"+GETPIVOTDATA(\" BAS050\",TABLAS!$A$75)","v":0},null,null,null,null,null,null,null,null,null,null,null,"=+IMPORTARDATOSDINAMICOS(\" BAS050\";TABLAS!$A$75)",null,"050","00",50,null,null,null,null,"(A082+E86 /D )"]
[null,"(A082+E86 /D )",null,null,null,null,null,{"$f":"+GETPIVOTDATA(\" BAS051\",TABLAS!$A$75)","v":0},null,null,null,null,null,null,null,null,null,null,null,"=+IMPORTARDATOSDINAMICOS(\" BAS051\";TABLAS!$A$75)",null,"051","00",51,null,null,null,null,"(A082+R571 /D )"]
[null,"(A082+R571 /D )",null,null,null,null,null,{"$f":"+GETPIVOTDATA(\" BAS052\",TABLAS!$A$75)","v":0},null,null,null,null,null,null,null,null,null,null,null,"=+IMPORTARDATOSDINAMICOS(\" BAS052\";TABLAS!$A$75)",null,"052","00",52,null,null,null,null,"(A083+E86 /D)"]
[null,"(A083+E86 /D)",null,null,null,null,null,{"$f":"+GETPIVOTDATA(\" BAS053\",TABLAS!$A$75)","v":0},null,null,null,null,null,null,null,null,null,null,null,"=+IMPORTARDATOSDINAMICOS(\" BAS053\";TABLAS!$A$75)",null,"053","00",53,null,null,null,null,"(A083+R571 /D)"]
[null,"(A083+R571 /D)",null,null,null,null,null,{"$f":"+GETPIVOTDATA(\" BAS054\",TABLAS!$A$75)","v":0},null,null,null,null,null,null,null,null,null,null,null,"=+IMPORTARDATOSDINAMICOS(\" BAS054\";TABLAS!$A$75)",null,"054","00",54,null,null,null,null,"(A084+E86 /D)"]
[null,"(A084+E86 /D)",null,null,null,null,null,{"$f":"+GETPIVOTDATA(\" BAS055\",TABLAS!$A$75)","v":0},null,null,null,null,null,null,null,null,null,null,null,"=+IMPORTARDATOSDINAMICOS(\" BAS055\";TABLAS!$A$75)",null,"055","00",55,null,null,null,null,"(A084+R571 /D)"]
[null,"(A084+R571 /D)",null,null,null,null,null,{"$f":"+GETPIVOTDATA(\" BAS056\",TABLAS!$A$75)","v":0},null,null,null,null,null,null,null,null,null,null,null,"=+IMPORTARDATOSDINAMICOS(\" BAS056\";TABLAS!$A$75)",null,"056","00",56,null,null,null,null,"(A099+R571 /D)"]
[null,"(A099+R571 /D)",null,null,null,null,null,{"$f":"+GETPIVOTDATA(\" BAS057\",TABLAS!$A$75)","v":0},null,null,null,null,null,null,null,null,null,null,null,"=+IMPORTARDATOSDINAMICOS(\" BAS057\";TABLAS!$A$75)",null,"057","00",57]
[]
[null,"usp_TRAMA_BASE_ADOLESCENTE_2020_RPT_02_CONTROL"]
[null,null,null,null,null,null,null,"1. EESS",null,null,"2. I.E.",null,null,"TOTAL"]
[null,"CONTROL Y SEGUIMIENTO DE ADOLESCENTES ",null,null,null,null,null,"Total","12a - 14a","15a-17a","Total","12a - 14a","15a-17a","Total","12a - 14a","15a-17a",null,null,null,null,null,null,null,null,null,null,null,null,"usp_TRAMA_BASE_ADOLESCENTE_2020_RPT_02_CONTROL"]
[null,"C8002","Plan de Atención Integral de Salud",null,"Iniciado","Paquete Basico",null,{"$f":"SUM(I75:J75)","v":318},{"$f":"+GETPIVOTDATA(\" BAS076\",TABLAS!$A$75)","v":174},{"$f":"+GETPIVOTDATA(\" BAS077\",TABLAS!$A$75)","v":144},{"$f":"SUM(L75:M75)","v":2},{"$f":"+GETPIVOTDATA(\" BAS078\",TABLAS!$A$75)","v":2},{"$f":"+GETPIVOTDATA(\" BAS079\",TABLAS!$A$75)","v":0},{"$f":"SUM(O75:P75)","v":320},{"$f":"+I75+L75","v":176},{"$f":"+J75+M75","v":144},null,null,{"$f":"CONCATENATE($U$17,X75,$U$16)","v":"=+IMPORTARDATOSDINAMICOS(\" BAS076\";TABLAS!$A$75)"},{"$f":"CONCATENATE($U$17,Y75,$U$16)","v":"=+IMPORTARDATOSDINAMICOS(\" BAS077\";TABLAS!$A$75)"},null,{"$f":"CONCATENATE($U$17,Z75,$U$16)","v":"=+IMPORTARDATOSDINAMICOS(\" BAS078\";TABLAS!$A$75)"},"=+IMPORTARDATOSDINAMICOS(\" BAS079\";TABLAS!$A$75)",{"$f":"IF(AB75<10,CONCATENATE(\"00\",AB75),IF(AND(AB75<100,AB75>9),CONCATENATE(\"0\",AB75),AB75))","v":"076"},{"$f":"IF(AC75<10,CONCATENATE(\"00\",AC75),IF(AND(AC75<100,AC75>9),CONCATENATE(\"0\",AC75),AC75))","v":"077"},"078","079",{"$f":"+Y57+1","v":76},{"$f":"+AB75+1","v":77},78,79,null,"Total"]
[null,null,null,null,null,"Paquete Completo",null,{"$f":"SUM(I76:J76)","v":324},{"$f":"+GETPIVOTDATA(\" BAS080\",TABLAS!$A$75)","v":168},{"$f":"+GETPIVOTDATA(\" BAS081\",TABLAS!$A$75)","v":156},12,{"$f":"+GETPIVOTDATA(\" BAS082\",TABLAS!$A$75)","v":9},{"$f":"+GETPIVOTDATA(\" BAS083\",TABLAS!$A$75)","v":3},{"$f":"SUM(O76:P76)","v":336},{"$f":"+I76+L76","v":177},{"$f":"+J76+M76","v":159},null,null,"=+IMPORTARDATOSDINAMICOS(\" BAS080\";TABLAS!$A$75)","=+IMPORTARDATOSDINAMICOS(\" BAS081\";TABLAS!$A$75)",null,"=+IMPORTARDATOSDINAMICOS(\" BAS082\";TABLAS!$A$75)","=+IMPORTARDATOSDINAMICOS(\" BAS083\";TABLAS!$A$75)",{"$f":"IF(AB76<10,CONCATENATE(\"00\",AB76),IF(AND(AB76<100,AB76>9),CONCATENATE(\"0\",AB76),AB76))","v":"080"},{"$f":"IF(AC76<10,CONCATENATE(\"00\",AC76),IF(AND(AC76<100,AC76>9),CONCATENATE(\"0\",AC76),AC76))","v":"081"},{"$f":"IF(AD76<10,CONCATENATE(\"00\",AD76),IF(AND(AD76<100,AD76>9),CONCATENATE(\"0\",AD76),AD76))","v":"082"},{"$f":"IF(AE76<10,CONCATENATE(\"00\",AE76),IF(AND(AE76<100,AE76>9),CONCATENATE(\"0\",AE76),AE76))","v":"083"},{"$f":"+AE75+1","v":80},81,82,83,null,"DX 1= Z003/D +\nDX 2= 99384/ D + LAB= 1  +\n(DX 3= C8002 / D + 1º LAB=1  + \n                                 2º LAB = 1 si es paquete básico; 2 si es paquete completo; 3 si es paquete especializado + \n                                3º LAB = 1 si es en EE.SS; 2 si es en Institución Educativa.)"]
[null,null,null,null,null,"Paquete Especializado",null,0,{"$f":"+GETPIVOTDATA(\" BAS084\",TABLAS!$A$75)","v":0},{"$f":"+GETPIVOTDATA(\" BAS085\",TABLAS!$A$75)","v":0},0,{"$f":"+GETPIVOTDATA(\" BAS086\",TABLAS!$A$75)","v":0},{"$f":"+GETPIVOTDATA(\" BAS087\",TABLAS!$A$75)","v":0},0,0,0,null,null,"=+IMPORTARDATOSDINAMICOS(\" BAS084\";TABLAS!$A$75)","=+IMPORTARDATOSDINAMICOS(\" BAS085\";TABLAS!$A$75)",null,"=+IMPORTARDATOSDINAMICOS(\" BAS086\";TABLAS!$A$75)","=+IMPORTARDATOSDINAMICOS(\" BAS087\";TABLAS!$A$75)","084","085","086","087",{"$f":"+AE76+1","v":84},85,86,87]
[null,null,null,null,"Concluido","Paquete Basico",null,10,{"$f":"+GETPIVOTDATA(\" BAS088\",TABLAS!$A$75)","v":8},{"$f":"+GETPIVOTDATA(\" BAS089\",TABLAS!$A$75)","v":2},0,{"$f":"+GETPIVOTDATA(\" BAS090\",TABLAS!$A$75)","v":0},{"$f":"+GETPIVOTDATA(\" BAS091\",TABLAS!$A$75)","v":0},10,8,2,null,null,"=+IMPORTARDATOSDINAMICOS(\" BAS088\";TABLAS!$A$75)","=+IMPORTARDATOSDINAMICOS(\" BAS089\";TABLAS!$A$75)",null,"=+IMPORTARDATOSDINAMICOS(\" BAS090\";TABLAS!$A$75)","=+IMPORTARDATOSDINAMICOS(\" BAS091\";TABLAS!$A$75)","088","089","090","091",88,89,90,91]
[null,null,null,null,null,"Paquete Completo",null,4,{"$f":"+GETPIVOTDATA(\" BAS092\",TABLAS!$A$75)","v":2},{"$f":"+GETPIVOTDATA(\" BAS093\",TABLAS!$A$75)","v":2},0,{"$f":"+GETPIVOTDATA(\" BAS094\",TABLAS!$A$75)","v":0},{"$f":"+GETPIVOTDATA(\" BAS095\",TABLAS!$A$75)","v":0},4,2,2,null,null,"=+IMPORTARDATOSDINAMICOS(\" BAS092\";TABLAS!$A$75)","=+IMPORTARDATOSDINAMICOS(\" BAS093\";TABLAS!$A$75)",null,"=+IMPORTARDATOSDINAMICOS(\" BAS094\";TABLAS!$A$75)","=+IMPORTARDATOSDINAMICOS(\" BAS095\";TABLAS!$A$75)","092","093","094","095",92,93,94,95,null,"DX 1= Z003/D +\nDX 2= 99384 / D + LAB= TA +\n(DX 3= C8002 / D + 1º LAB=TA  + 2º LAB = 1 si es paquete básico; 2 si es paquete completo; 3 si es paquete especializado + 3º LAB = 1 si es en EE.SS; 2 si es en Institución Educativa.)"]
[null,null,null,null,null,"Paquete Especializado",null,0,{"$f":"+GETPIVOTDATA(\" BAS096\",TABLAS!$A$75)","v":0},{"$f":"+GETPIVOTDATA(\" BAS097\",TABLAS!$A$75)","v":0},0,{"$f":"+GETPIVOTDATA(\" BAS098\",TABLAS!$A$75)","v":0},{"$f":"+GETPIVOTDATA(\" BAS099\",TABLAS!$A$75)","v":0},0,0,0,null,null,"=+IMPORTARDATOSDINAMICOS(\" BAS096\";TABLAS!$A$75)","=+IMPORTARDATOSDINAMICOS(\" BAS097\";TABLAS!$A$75)",null,"=+IMPORTARDATOSDINAMICOS(\" BAS098\";TABLAS!$A$75)","=+IMPORTARDATOSDINAMICOS(\" BAS099\";TABLAS!$A$75)","096","097","098","099",96,97,98,99]
[null,"Z003","Examen del estado de desarrollo del adolescente",null,null,null,null,989,{"$f":"+GETPIVOTDATA(\" BAS100\",TABLAS!$A$75)","v":523},{"$f":"+GETPIVOTDATA(\" BAS101\",TABLAS!$A$75)","v":466},null,null,null,null,null,null,null,null,"=+IMPORTARDATOSDINAMICOS(\" BAS100\";TABLAS!$A$75)","=+IMPORTARDATOSDINAMICOS(\" BAS101\";TABLAS!$A$75)",null,"=+IMPORTARDATOSDINAMICOS(\" BAS\";TABLAS!$A$75)","=+IMPORTARDATOSDINAMICOS(\" BAS\";TABLAS!$A$75)",100,101,null,null,100,101]
[null,99384,"Evaluación Integral del Adolescente \n\n",null,"1º Control","Paquete Basico",null,318,{"$f":"+GETPIVOTDATA(\" BAS102\",TABLAS!$A$75)","v":174},{"$f":"+GETPIVOTDATA(\" BAS103\",TABLAS!$A$75)","v":144},{"$f":"SUM(L82:M82)","v":2},{"$f":"+GETPIVOTDATA(\" BAS104\",TABLAS!$A$75)","v":2},{"$f":"+GETPIVOTDATA(\" BAS105\",TABLAS!$A$75)","v":0},{"$f":"SUM(O82:P82)","v":320},{"$f":"+I82+L82","v":176},{"$f":"+J82+M82","v":144},null,null,"=+IMPORTARDATOSDINAMICOS(\" BAS102\";TABLAS!$A$75)","=+IMPORTARDATOSDINAMICOS(\" BAS103\";TABLAS!$A$75)",null,"=+IMPORTARDATOSDINAMICOS(\" BAS104\";TABLAS!$A$75)","=+IMPORTARDATOSDINAMICOS(\" BAS105\";TABLAS!$A$75)",102,103,104,105,{"$f":"+AC81+1","v":102},103,104,105,null,"DX 1= Z003/ D "]
[null,null,null,null,null,"Paquete Completo",null,324,{"$f":"+GETPIVOTDATA(\" BAS106\",TABLAS!$A$75)","v":168},{"$f":"+GETPIVOTDATA(\" BAS107\",TABLAS!$A$75)","v":156},12,{"$f":"+GETPIVOTDATA(\" BAS108\",TABLAS!$A$75)","v":9},{"$f":"+GETPIVOTDATA(\" BAS109\",TABLAS!$A$75)","v":3},336,177,159,null,null,"=+IMPORTARDATOSDINAMICOS(\" BAS106\";TABLAS!$A$75)","=+IMPORTARDATOSDINAMICOS(\" BAS107\";TABLAS!$A$75)",null,"=+IMPORTARDATOSDINAMICOS(\" BAS108\";TABLAS!$A$75)","=+IMPORTARDATOSDINAMICOS(\" BAS109\";TABLAS!$A$75)",106,107,108,109,106,107,108,109,null,"DX 1= Z003/D +\nDX 2= 99384/ D + LAB= 1 +\n(DX3= C8002 / D + 1º LAB=1  + 2º LAB = 1 si es paquete básico; 2 si es paquete completo; 3 si es paquete especializado + 3º LAB = 1 si es en EE.SS; 2 si es en Institución Educativa)"]
[null,null,null,null,null,"Paquete Especializado",null,0,{"$f":"+GETPIVOTDATA(\" BAS110\",TABLAS!$A$75)","v":0},{"$f":"+GETPIVOTDATA(\" BAS111\",TABLAS!$A$75)","v":0},0,{"$f":"+GETPIVOTDATA(\" BAS112\",TABLAS!$A$75)","v":0},{"$f":"+GETPIVOTDATA(\" BAS113\",TABLAS!$A$75)","v":0},0,0,0,null,null,"=+IMPORTARDATOSDINAMICOS(\" BAS110\";TABLAS!$A$75)","=+IMPORTARDATOSDINAMICOS(\" BAS111\";TABLAS!$A$75)",null,"=+IMPORTARDATOSDINAMICOS(\" BAS112\";TABLAS!$A$75)","=+IMPORTARDATOSDINAMICOS(\" BAS113\";TABLAS!$A$75)",110,111,112,113,110,111,112,113]
[null,null,null,null,"2º Control",null,null,103,{"$f":"+GETPIVOTDATA(\" BAS114\",TABLAS!$A$75)","v":57},{"$f":"+GETPIVOTDATA(\" BAS115\",TABLAS!$A$75)","v":46},null,null,null,null,null,null,null,null,"=+IMPORTARDATOSDINAMICOS(\" BAS114\";TABLAS!$A$75)","=+IMPORTARDATOSDINAMICOS(\" BAS115\";TABLAS!$A$75)",null,"=+IMPORTARDATOSDINAMICOS(\" BAS\";TABLAS!$A$75)","=+IMPORTARDATOSDINAMICOS(\" BAS\";TABLAS!$A$75)",114,115,null,null,114,115]
[null,null,null,null,"3º Control",null,null,15,{"$f":"+GETPIVOTDATA(\" BAS116\",TABLAS!$A$75)","v":10},{"$f":"+GETPIVOTDATA(\" BAS117\",TABLAS!$A$75)","v":5},null,null,null,null,null,null,null,null,"=+IMPORTARDATOSDINAMICOS(\" BAS116\";TABLAS!$A$75)","=+IMPORTARDATOSDINAMICOS(\" BAS117\";TABLAS!$A$75)",null,"=+IMPORTARDATOSDINAMICOS(\" BAS\";TABLAS!$A$75)","=+IMPORTARDATOSDINAMICOS(\" BAS\";TABLAS!$A$75)",116,117,null,null,{"$f":"+AC85+1","v":116},117,null,null,null,"DX 1= Z003/D +\nDX 2= 99384 / D+ LAB= 2\nDX 3 = otras prestaciones 1 ó 2 ó 3…..."]
[null,null,null,null,"4º Control",null,null,1,{"$f":"+GETPIVOTDATA(\" BAS118\",TABLAS!$A$75)","v":1},{"$f":"+GETPIVOTDATA(\" BAS119\",TABLAS!$A$75)","v":0},null,null,null,null,null,null,null,null,"=+IMPORTARDATOSDINAMICOS(\" BAS118\";TABLAS!$A$75)","=+IMPORTARDATOSDINAMICOS(\" BAS119\";TABLAS!$A$75)",null,"=+IMPORTARDATOSDINAMICOS(\" BAS\";TABLAS!$A$75)","=+IMPORTARDATOSDINAMICOS(\" BAS\";TABLAS!$A$75)",118,119,null,null,{"$f":"+AC86+1","v":118},119,null,null,null,"DX 1= Z003/D +\nDX 2= 99384 / D+ LAB= 3\nDX 3 = otras prestaciones 1 ó 2 ó 3……"]
[null,null,null,null,"5º Control",null,null,0,{"$f":"+GETPIVOTDATA(\" BAS120\",TABLAS!$A$75)","v":0},{"$f":"+GETPIVOTDATA(\" BAS121\",TABLAS!$A$75)","v":0},null,null,null,null,null,null,null,null,"=+IMPORTARDATOSDINAMICOS(\" BAS120\";TABLAS!$A$75)","=+IMPORTARDATOSDINAMICOS(\" BAS121\";TABLAS!$A$75)",null,"=+IMPORTARDATOSDINAMICOS(\" BAS\";TABLAS!$A$75)","=+IMPORTARDATOSDINAMICOS(\" BAS\";TABLAS!$A$75)",120,121,null,null,{"$f":"+AC87+1","v":120},121,null,null,null,"DX 1= Z003/D +\nDX 2= 99384 / D + LAB= 4\nDX 3 = otras prestaciones 1 ó 2 ó 3……"]
[null,null,null,null,"6º Control a + controles",null,null,0,{"$f":"+GETPIVOTDATA(\" BAS122\",TABLAS!$A$75)","v":0},{"$f":"+GETPIVOTDATA(\" BAS123\",TABLAS!$A$75)","v":0},null,null,null,null,null,null,null,null,"=+IMPORTARDATOSDINAMICOS(\" BAS122\";TABLAS!$A$75)","=+IMPORTARDATOSDINAMICOS(\" BAS123\";TABLAS!$A$75)",null,"=+IMPORTARDATOSDINAMICOS(\" BAS\";TABLAS!$A$75)","=+IMPORTARDATOSDINAMICOS(\" BAS\";TABLAS!$A$75)",122,123,null,null,{"$f":"+AC88+1","v":122},123,null,null,null,"DX 1= Z003/D +\nDX 2=  99384 / D + LAB= 5\nDX 3 = otras prestaciones 1 ó 2 ó 3……"]
[null,null,null,null,"Ultimo Control ","Paquete Basico",null,0,{"$f":"+GETPIVOTDATA(\" BAS124\",TABLAS!$A$75)","v":0},{"$f":"+GETPIVOTDATA(\" BAS125\",TABLAS!$A$75)","v":0},{"$f":"SUM(L90:M90)","v":0},{"$f":"+GETPIVOTDATA(\" BAS126\",TABLAS!$A$75)","v":0},{"$f":"+GETPIVOTDATA(\" BAS127\",TABLAS!$A$75)","v":0},{"$f":"SUM(O90:P90)","v":0},{"$f":"+I90+L90","v":0},{"$f":"+J90+M90","v":0},null,null,"=+IMPORTARDATOSDINAMICOS(\" BAS124\";TABLAS!$A$75)","=+IMPORTARDATOSDINAMICOS(\" BAS125\";TABLAS!$A$75)",null,"=+IMPORTARDATOSDINAMICOS(\" BAS126\";TABLAS!$A$75)","=+IMPORTARDATOSDINAMICOS(\" BAS127\";TABLAS!$A$75)",124,125,126,127,{"$f":"+AC89+1","v":124},125,126,127,null,"DX 1= Z003/D +\nDX 2= 99384 / D + LAB= >6\nDX 3 = otras prestaciones 1 ó 2 ó 3……"]
[null,null,null,null,null,"Paquete Completo",null,0,{"$f":"+GETPIVOTDATA(\" BAS128\",TABLAS!$A$75)","v":0},{"$f":"+GETPIVOTDATA(\" BAS129\",TABLAS!$A$75)","v":0},0,{"$f":"+GETPIVOTDATA(\" BAS130\",TABLAS!$A$75)","v":0},{"$f":"+GETPIVOTDATA(\" BAS131\",TABLAS!$A$75)","v":0},0,0,0,null,null,"=+IMPORTARDATOSDINAMICOS(\" BAS128\";TABLAS!$A$75)","=+IMPORTARDATOSDINAMICOS(\" BAS129\";TABLAS!$A$75)",null,{"$f":"CONCATENATE($U$17,Z91,$U$16)","v":"=+IMPORTARDATOSDINAMICOS(\" BAS130\";TABLAS!$A$75)"},"=+IMPORTARDATOSDINAMICOS(\" BAS131\";TABLAS!$A$75)",128,129,130,131,128,{"$f":"+AB91+1","v":129},130,131,null,"DX 1 = Z003 / D +\nDX 2= 99384 / D + LAB= TA +\n(DX 3=C8002 / D + 1º LAB= TA  + 2º LAB = 1 si es paquete básico; 2 si es paquete completo; 3 si es paquete especializado + 3º LAB = 1 si es en EE.SS; 2 si es en Institución Educativa.)"]
[null,null,null,null,null,"Paquete Especializado",null,0,{"$f":"+GETPIVOTDATA(\" BAS132\",TABLAS!$A$75)","v":0},{"$f":"+GETPIVOTDATA(\" BAS133\",TABLAS!$A$75)","v":0},0,{"$f":"+GETPIVOTDATA(\" BAS134\",TABLAS!$A$75)","v":0},{"$f":"+GETPIVOTDATA(\" BAS135\",TABLAS!$A$75)","v":0},0,0,0,null,null,"=+IMPORTARDATOSDINAMICOS(\" BAS132\";TABLAS!$A$75)","=+IMPORTARDATOSDINAMICOS(\" BAS133\";TABLAS!$A$75)",null,"=+IMPORTARDATOSDINAMICOS(\" BAS134\";TABLAS!$A$75)","=+IMPORTARDATOSDINAMICOS(\" BAS135\";TABLAS!$A$75)",132,133,134,135,132,133,134,135]
[]
[null,"usp_TRAMA_BASE_ADOLESCENTE_2020_RPT_03_VISITA"]
[null,"VISITA DOMICILIARIA",null,null,null,null,null,"Total","12a - 14a","15a-17a",null,null,null,null,null,null,null,null,null,null,null,null,null,null,null,null,null,null,"usp_TRAMA_BASE_ADOLESCENTE_2020_RPT_03_VISITA"]
[null,"C0011","Visita Domiciliaria",null,null,"1º visita",null,{"$f":"SUM(I96:J96)","v":170},{"$f":"+GETPIVOTDATA(\" BAS136\",TABLAS!$A$75)","v":50},{"$f":"+GETPIVOTDATA(\" BAS137\",TABLAS!$A$75)","v":120},null,null,null,null,null,null,null,null,null,{"$f":"CONCATENATE($U$17,V96,$U$16)","v":"=+IMPORTARDATOSDINAMICOS(\" BAS136\";TABLAS!$A$75)"},{"$f":"CONCATENATE($U$17,W96,$U$16)","v":"=+IMPORTARDATOSDINAMICOS(\" BAS137\";TABLAS!$A$75)"},{"$f":"IF(X96<10,CONCATENATE(\"00\",X96),IF(AND(X96<100,X96>9),CONCATENATE(\"0\",X96),X96))","v":136},{"$f":"IF(Y96<10,CONCATENATE(\"00\",Y96),IF(AND(Y96<100,Y96>9),CONCATENATE(\"0\",Y96),Y96))","v":137},{"$f":"+AE92+1","v":136},{"$f":"+X96+1","v":137},null,null,null,"Total"]
[null,null,null,null,null,"2º visita",null,{"$f":"SUM(I97:J97)","v":62},{"$f":"+GETPIVOTDATA(\" BAS138\",TABLAS!$A$75)","v":13},{"$f":"+GETPIVOTDATA(\" BAS139\",TABLAS!$A$75)","v":49},null,null,null,null,null,null,null,null,null,"=+IMPORTARDATOSDINAMICOS(\" BAS138\";TABLAS!$A$75)","=+IMPORTARDATOSDINAMICOS(\" BAS139\";TABLAS!$A$75)",{"$f":"IF(X97<10,CONCATENATE(\"00\",X97),IF(AND(X97<100,X97>9),CONCATENATE(\"0\",X97),X97))","v":138},{"$f":"IF(Y97<10,CONCATENATE(\"00\",Y97),IF(AND(Y97<100,Y97>9),CONCATENATE(\"0\",Y97),Y97))","v":139},{"$f":"+Y96+1","v":138},139,null,null,null,"C0011 / D + LAB=1 + EDAD >=12 Y <=17"]
[null,null,null,null,null,"Con 3 a + visitas",null,170,{"$f":"+GETPIVOTDATA(\" BAS140\",TABLAS!$A$75)","v":47},{"$f":"+GETPIVOTDATA(\" BAS141\",TABLAS!$A$75)","v":123},null,null,null,null,null,null,null,null,null,"=+IMPORTARDATOSDINAMICOS(\" BAS140\";TABLAS!$A$75)","=+IMPORTARDATOSDINAMICOS(\" BAS141\";TABLAS!$A$75)",140,141,{"$f":"+Y97+1","v":140},141,null,null,null,"C0011 / D + LAB=2 + EDAD >=12 Y <=17"]
[null,99509,"Visita domiciliaria para la ayuda con actividades de la vida diaria y del cuidado personal",null,null,"1º visita",null,0,{"$f":"+GETPIVOTDATA(\" BAS142\",TABLAS!$A$75)","v":0},{"$f":"+GETPIVOTDATA(\" BAS143\",TABLAS!$A$75)","v":0},null,null,null,null,null,null,null,null,null,"=+IMPORTARDATOSDINAMICOS(\" BAS142\";TABLAS!$A$75)","=+IMPORTARDATOSDINAMICOS(\" BAS143\";TABLAS!$A$75)",142,143,{"$f":"+Y98+1","v":142},143,null,null,null,"C0011 / D + LAB= > ó = 3 + EDAD >=12 Y <=17"]
[null,null,null,null,null,"2º visita",null,0,{"$f":"+GETPIVOTDATA(\" BAS144\",TABLAS!$A$75)","v":0},{"$f":"+GETPIVOTDATA(\" BAS145\",TABLAS!$A$75)","v":0},null,null,null,null,null,null,null,null,null,"=+IMPORTARDATOSDINAMICOS(\" BAS144\";TABLAS!$A$75)","=+IMPORTARDATOSDINAMICOS(\" BAS145\";TABLAS!$A$75)",144,145,{"$f":"+Y99+1","v":144},145,null,null,null,"99509 / D + LAB=1 + EDAD >=12 Y <=17"]
[null,null,null,null,null,"Con 3 a + visitas",null,0,{"$f":"+GETPIVOTDATA(\" BAS146\",TABLAS!$A$75)","v":0},{"$f":"+GETPIVOTDATA(\" BAS147\",TABLAS!$A$75)","v":0},null,null,null,null,null,null,null,null,null,"=+IMPORTARDATOSDINAMICOS(\" BAS146\";TABLAS!$A$75)","=+IMPORTARDATOSDINAMICOS(\" BAS147\";TABLAS!$A$75)",146,147,{"$f":"+Y100+1","v":146},147,null,null,null,"99509 / D + LAB=2 + EDAD >=12 Y <=17"]
[]
[null,null,null,null,null,null,null,"usp_TRAMA_BASE_ADOLESCENTE_2020_RPT_04_EVALUACION"]
[null,"EVALUACIÓN FÍSICA NUTRICIONAL ",null,null,null,null,null,null,null,null,"Total","12a - 14a","15a-17a",null,null,null,null,null,null,null,null,null,null,null,null,null,null,null,"usp_TRAMA_BASE_ADOLESCENTE_2020_RPT_04_EVALUACION"]
[1,"Z000","Examen médico general",null,null,null,null,null,null,null,{"$f":"SUM(L105:M105)","v":72},{"$f":"+GETPIVOTDATA(\" BAS148\",TABLAS!$A$75)","v":30},{"$f":"+GETPIVOTDATA(\" BAS149\",TABLAS!$A$75)","v":42},null,null,null,null,null,null,{"$f":"CONCATENATE($U$17,V105,$U$16)","v":"=+IMPORTARDATOSDINAMICOS(\" BAS148\";TABLAS!$A$75)"},{"$f":"CONCATENATE($U$17,W105,$U$16)","v":"=+IMPORTARDATOSDINAMICOS(\" BAS149\";TABLAS!$A$75)"},148,149,{"$f":"+Y101+1","v":148},149,null,null,null,"Total"]
[2,"Z019","Valoración de Factores de Riesgo (DNT)",null,null,null,null,null,null,null,{"$f":"SUM(L106:M106)","v":317},{"$f":"+GETPIVOTDATA(\" BAS150\",TABLAS!$A$75)","v":166},{"$f":"+GETPIVOTDATA(\" BAS151\",TABLAS!$A$75)","v":151},null,null,null,null,null,null,"=+IMPORTARDATOSDINAMICOS(\" BAS150\";TABLAS!$A$75)","=+IMPORTARDATOSDINAMICOS(\" BAS151\";TABLAS!$A$75)",150,151,{"$f":"+Y105+1","v":150},151,null,null,null,"Z000 / D + EDAD >=12 Y <=17"]
[3,99209.04,"Evaluación Nutricional Antropometrica (PAB)",null,null,"RSM= Riesgo Bajo",null,null,null,null,406,{"$f":"+GETPIVOTDATA(\" BAS152\",TABLAS!$A$75)","v":222},{"$f":"+GETPIVOTDATA(\" BAS153\",TABLAS!$A$75)","v":184},null,null,null,null,null,null,"=+IMPORTARDATOSDINAMICOS(\" BAS152\";TABLAS!$A$75)","=+IMPORTARDATOSDINAMICOS(\" BAS153\";TABLAS!$A$75)",152,153,{"$f":"+Y106+1","v":152},153,null,null,null,"Z019 /D + EDAD >=12 Y <=17"]
[4,null,null,null,null,"RSA= Riesgo Alto",null,null,null,null,40,{"$f":"+GETPIVOTDATA(\" BAS154\",TABLAS!$A$75)","v":20},{"$f":"+GETPIVOTDATA(\" BAS155\",TABLAS!$A$75)","v":20},null,null,null,null,null,null,"=+IMPORTARDATOSDINAMICOS(\" BAS154\";TABLAS!$A$75)","=+IMPORTARDATOSDINAMICOS(\" BAS155\";TABLAS!$A$75)",154,155,154,155,null,null,null,"99209.04/ D + LAB= RSM + EDAD >=12 Y <=17"]
[5,null,null,null,null,"RMA= Riesgo Muy Alto",null,null,null,null,5,{"$f":"+GETPIVOTDATA(\" BAS156\",TABLAS!$A$75)","v":1},{"$f":"+GETPIVOTDATA(\" BAS157\",TABLAS!$A$75)","v":4},null,null,null,null,null,null,"=+IMPORTARDATOSDINAMICOS(\" BAS156\";TABLAS!$A$75)","=+IMPORTARDATOSDINAMICOS(\" BAS157\";TABLAS!$A$75)",156,157,156,157,null,null,null,"99209.04/ D + LAB= RSA + EDAD >=12 Y <=17"]
[6,"E660","Índice de Masa Corporal (IMC)",null,"Obesidad debido a exceso de caloría (Sobrepeso)",null,null,null,null,null,0,{"$f":"+GETPIVOTDATA(\" BAS158\",TABLAS!$A$75)","v":0},{"$f":"+GETPIVOTDATA(\" BAS159\",TABLAS!$A$75)","v":0},null,null,null,null,null,null,"=+IMPORTARDATOSDINAMICOS(\" BAS158\";TABLAS!$A$75)","=+IMPORTARDATOSDINAMICOS(\" BAS159\";TABLAS!$A$75)",158,159,158,159,null,null,null,"99209.04 / D + LAB=RMA + EDAD >=12 Y <=17"]
[7,"E669",null,null,"Obesidad no especificada (Obesidad)",null,null,null,null,null,21,{"$f":"+GETPIVOTDATA(\" BAS160\",TABLAS!$A$75)","v":5},{"$f":"+GETPIVOTDATA(\" BAS161\",TABLAS!$A$75)","v":16},null,null,null,null,null,null,"=+IMPORTARDATOSDINAMICOS(\" BAS160\";TABLAS!$A$75)","=+IMPORTARDATOSDINAMICOS(\" BAS161\";TABLAS!$A$75)",160,161,160,161,null,null,null,"E660 / D + LAB=IMC + EDAD >=12 Y <=17"]
[8,"Z006",null,null,"Peso Normal",null,null,null,null,null,250,{"$f":"+GETPIVOTDATA(\" BAS162\",TABLAS!$A$75)","v":113},{"$f":"+GETPIVOTDATA(\" BAS163\",TABLAS!$A$75)","v":137},null,null,null,null,null,null,"=+IMPORTARDATOSDINAMICOS(\" BAS162\";TABLAS!$A$75)","=+IMPORTARDATOSDINAMICOS(\" BAS163\";TABLAS!$A$75)",162,163,162,163,null,null,null,"E669 /D + EDAD >=12 Y <=17"]
[9,"E440",null,null," Desnutrición Proteico Calórica Moderada(Desnutrición Aguda)",null,null,null,null,null,10,{"$f":"+GETPIVOTDATA(\" BAS164\",TABLAS!$A$75)","v":9},{"$f":"+GETPIVOTDATA(\" BAS165\",TABLAS!$A$75)","v":1},null,null,null,null,null,null,"=+IMPORTARDATOSDINAMICOS(\" BAS164\";TABLAS!$A$75)","=+IMPORTARDATOSDINAMICOS(\" BAS165\";TABLAS!$A$75)",164,165,164,165,null,null,null,"Z006 /D +  EDAD >=12 Y <=17"]
[10,"E43X",null,null," Desnutrición Proteico Calórica Severa No Especificada",null,null,null,null,null,0,{"$f":"+GETPIVOTDATA(\" BAS166\",TABLAS!$A$75)","v":0},{"$f":"+GETPIVOTDATA(\" BAS167\",TABLAS!$A$75)","v":0},null,null,null,null,null,null,"=+IMPORTARDATOSDINAMICOS(\" BAS166\";TABLAS!$A$75)","=+IMPORTARDATOSDINAMICOS(\" BAS167\";TABLAS!$A$75)",166,167,166,167,null,null,null,"E440 /D +  EDAD >=12 Y <=17"]
[11,"E344","Talla/Edad",null," Estatura Alta Constitucional (Talla Alta)",null,null,null,null,null,0,{"$f":"+GETPIVOTDATA(\" BAS168\",TABLAS!$A$75)","v":0},{"$f":"+GETPIVOTDATA(\" BAS169\",TABLAS!$A$75)","v":0},null,null,null,null,null,null,"=+IMPORTARDATOSDINAMICOS(\" BAS168\";TABLAS!$A$75)","=+IMPORTARDATOSDINAMICOS(\" BAS169\";TABLAS!$A$75)",168,169,168,169,null,null,null,"E43X /D + EDAD >=12 Y <=17"]
[12,"Z006",null,null,"Talla Normal",null,null,null,null,null,52,{"$f":"+GETPIVOTDATA(\" BAS170\",TABLAS!$A$75)","v":26},{"$f":"+GETPIVOTDATA(\" BAS171\",TABLAS!$A$75)","v":26},null,null,null,null,null,null,"=+IMPORTARDATOSDINAMICOS(\" BAS170\";TABLAS!$A$75)","=+IMPORTARDATOSDINAMICOS(\" BAS171\";TABLAS!$A$75)",170,171,170,171,null,null,null,"E344X /D + EDAD >=12 Y <=17"]
[13,"E45X",null,null," Desnutrición Crónica T/E (Talla Baja)",null,null,null,null,null,16,{"$f":"+GETPIVOTDATA(\" BAS172\",TABLAS!$A$75)","v":9},{"$f":"+GETPIVOTDATA(\" BAS173\",TABLAS!$A$75)","v":7},null,null,null,null,null,null,"=+IMPORTARDATOSDINAMICOS(\" BAS172\";TABLAS!$A$75)","=+IMPORTARDATOSDINAMICOS(\" BAS173\";TABLAS!$A$75)",172,173,172,173,null,null,null,"Z006 /D +  EDAD >=12 Y <=17"]
[14,"E785","Hiperlipidemia No Especificada (Dislipidemia)",null,null,null,null,null,null,null,2,{"$f":"+GETPIVOTDATA(\" BAS174\",TABLAS!$A$75)","v":1},{"$f":"+GETPIVOTDATA(\" BAS175\",TABLAS!$A$75)","v":1},null,null,null,null,null,null,"=+IMPORTARDATOSDINAMICOS(\" BAS174\";TABLAS!$A$75)","=+IMPORTARDATOSDINAMICOS(\" BAS175\";TABLAS!$A$75)",174,175,174,175,null,null,null,"E45X /D + EDAD >=12 Y <=17"]
[15,"E65X","Adiposidad Localizada",null,null,null,null,null,null,null,2,{"$f":"+GETPIVOTDATA(\" BAS176\",TABLAS!$A$75)","v":0},{"$f":"+GETPIVOTDATA(\" BAS177\",TABLAS!$A$75)","v":2},null,null,null,null,null,null,"=+IMPORTARDATOSDINAMICOS(\" BAS176\";TABLAS!$A$75)","=+IMPORTARDATOSDINAMICOS(\" BAS177\";TABLAS!$A$75)",176,177,176,177,null,null,null,"E785 / D + EDAD >=12 Y <=17"]
[16,"Z728","Otros Problemas relacionados al Estilo de Vida",null,null,null,null,null,null,null,5,{"$f":"+GETPIVOTDATA(\" BAS178\",TABLAS!$A$75)","v":3},{"$f":"+GETPIVOTDATA(\" BAS179\",TABLAS!$A$75)","v":2},null,null,null,null,null,null,"=+IMPORTARDATOSDINAMICOS(\" BAS178\";TABLAS!$A$75)","=+IMPORTARDATOSDINAMICOS(\" BAS179\";TABLAS!$A$75)",178,179,178,179,null,null,null,"E65X /D + EDAD >=12 Y <=17"]
[17,85018,"Dosaje de Hemoglobina",null,null,null,null,null,null,null,593,{"$f":"+GETPIVOTDATA(\" BAS180\",TABLAS!$A$75)","v":283},{"$f":"+GETPIVOTDATA(\" BAS181\",TABLAS!$A$75)","v":310},null,null,null,null,null,null,"=+IMPORTARDATOSDINAMICOS(\" BAS180\";TABLAS!$A$75)","=+IMPORTARDATOSDINAMICOS(\" BAS181\";TABLAS!$A$75)",180,181,180,181,null,null,null,"Z728 /D + EDAD >=12 Y <=17"]
[18,99199.26,"Suplementación de sulfato ferroso y ácido fólico",null,null,null,null,null,null,null,439,{"$f":"+GETPIVOTDATA(\" BAS182\",TABLAS!$A$75)","v":198},{"$f":"+GETPIVOTDATA(\" BAS183\",TABLAS!$A$75)","v":241},null,null,null,null,null,null,{"$f":"CONCATENATE($U$17,V122,$U$16)","v":"=+IMPORTARDATOSDINAMICOS(\" BAS182\";TABLAS!$A$75)"},{"$f":"CONCATENATE($U$17,W122,$U$16)","v":"=+IMPORTARDATOSDINAMICOS(\" BAS183\";TABLAS!$A$75)"},{"$f":"IF(X122<10,CONCATENATE(\"00\",X122),IF(AND(X122<100,X122>9),CONCATENATE(\"0\",X122),X122))","v":182},{"$f":"IF(Y122<10,CONCATENATE(\"00\",Y122),IF(AND(Y122<100,Y122>9),CONCATENATE(\"0\",Y122),Y122))","v":183},{"$f":"+Y121+1","v":182},{"$f":"+X122+1","v":183},null,null,null,"85018 /D + LAB= 1 + EDAD >=12 Y <=17"]
[]
[null,"usp_TRAMA_BASE_ADOLESCENTE_2020_RPT_05_VISUAL"]
[null,"EVALUACIÓN DE LA AGUDEZA VISUAL",null,null,null,null,null,null,"Total","12a - 14a","15a-17a",null,null,null,null,null,null,null,null,null,null,null,null,null,null,null,null,null,"usp_TRAMA_BASE_ADOLESCENTE_2020_RPT_05_VISUAL"]
[null,"Z006","Normal",null,null,null,null,null,{"$f":"SUM(J126:K126)","v":3},{"$f":"+GETPIVOTDATA(\" BAS184\",TABLAS!$A$75)","v":2},{"$f":"+GETPIVOTDATA(\" BAS185\",TABLAS!$A$75)","v":1},null,null,null,null,null,null,null,null,{"$f":"CONCATENATE($U$17,V126,$U$16)","v":"=+IMPORTARDATOSDINAMICOS(\" BAS184\";TABLAS!$A$75)"},{"$f":"CONCATENATE($U$17,W126,$U$16)","v":"=+IMPORTARDATOSDINAMICOS(\" BAS185\";TABLAS!$A$75)"},184,185,{"$f":"+Y122+1","v":184},185,null,null,null,"Total"]
[null,"H547","Disminución de la Agudeza Visual sin especificación",null,null,null,null,null,{"$f":"SUM(J127:K127)","v":0},{"$f":"+GETPIVOTDATA(\" BAS186\",TABLAS!$A$75)","v":0},{"$f":"+GETPIVOTDATA(\" BAS187\",TABLAS!$A$75)","v":0},null,null,null,null,null,null,null,null,"=+IMPORTARDATOSDINAMICOS(\" BAS186\";TABLAS!$A$75)","=+IMPORTARDATOSDINAMICOS(\" BAS187\";TABLAS!$A$75)",186,187,186,187,null,null,null,"Z006 / D + LAB= SO + EDAD >=12 Y <=17"]
[null,99173," Prueba  de la Agudeza Visual cuantitativa bilateral",null,null,null,null,null,527,{"$f":"+GETPIVOTDATA(\" BAS188\",TABLAS!$A$75)","v":292},{"$f":"+GETPIVOTDATA(\" BAS189\",TABLAS!$A$75)","v":235},null,null,null,null,null,null,null,null,"=+IMPORTARDATOSDINAMICOS(\" BAS188\";TABLAS!$A$75)","=+IMPORTARDATOSDINAMICOS(\" BAS189\";TABLAS!$A$75)",188,189,188,189,null,null,null,"H547 / D + LAB= SO + EDAD >=12 Y <=17"]
[null,"Z010 ","Examen de Ojos y de la Visión (Normal)",null,null,null,null,null,407,{"$f":"+GETPIVOTDATA(\" BAS190\",TABLAS!$A$75)","v":223},{"$f":"+GETPIVOTDATA(\" BAS191\",TABLAS!$A$75)","v":184},null,null,null,null,null,null,null,null,"=+IMPORTARDATOSDINAMICOS(\" BAS190\";TABLAS!$A$75)","=+IMPORTARDATOSDINAMICOS(\" BAS191\";TABLAS!$A$75)",190,191,190,191,null,null,null,"99173 /D + LAB= resultado de la evaluación + EDAD >=12 Y <=17"]
[null,null,"Examen de Ojos y de la Visión (Anormal)",null,null,null,null,null,21,{"$f":"+GETPIVOTDATA(\" BAS192\",TABLAS!$A$75)","v":16},{"$f":"+GETPIVOTDATA(\" BAS193\",TABLAS!$A$75)","v":5},null,null,null,null,null,null,null,null,"=+IMPORTARDATOSDINAMICOS(\" BAS192\";TABLAS!$A$75)","=+IMPORTARDATOSDINAMICOS(\" BAS193\";TABLAS!$A$75)",192,193,192,193,null,null,null,"Z010 /D + LAB=N + EDAD >=12 Y <=17"]
[null,99401.16,"Consejería ocular",null,null,null,null,null,332,{"$f":"+GETPIVOTDATA(\" BAS194\",TABLAS!$A$75)","v":183},{"$f":"+GETPIVOTDATA(\" BAS195\",TABLAS!$A$75)","v":149},null,null,null,null,null,null,null,null,"=+IMPORTARDATOSDINAMICOS(\" BAS194\";TABLAS!$A$75)","=+IMPORTARDATOSDINAMICOS(\" BAS195\";TABLAS!$A$75)",194,195,194,195,null,null,null,"Z010 /D + LAB = A + EDAD >=12 Y <=17"]
[]
[null,"usp_TRAMA_BASE_ADOLESCENTE_2020_RPT_06_AUDITIVA"]
[null,"EVALUACIÓN DE LA AGUDEZA AUDITIVA",null,null,null,null,null,"Total","12a - 14a","15a-17a",null,null,null,null,null,null,null,null,null,null,null,null,null,null,null,null,null,null,"usp_TRAMA_BASE_ADOLESCENTE_2020_RPT_06_AUDITIVA"]
[null,"H919"," Disminución de la Agudeza Auditiva sin Especificación",null,null,null,null,{"$f":"SUM(I135:J135)","v":0},{"$f":"+GETPIVOTDATA(\" BAS196\",TABLAS!$A$75)","v":0},{"$f":"+GETPIVOTDATA(\" BAS197\",TABLAS!$A$75)","v":0},null,null,null,null,null,null,null,null,null,"=+IMPORTARDATOSDINAMICOS(\" BAS196\";TABLAS!$A$75)","=+IMPORTARDATOSDINAMICOS(\" BAS197\";TABLAS!$A$75)",{"$f":"IF(X135<10,CONCATENATE(\"00\",X135),IF(AND(X135<100,X135>9),CONCATENATE(\"0\",X135),X135))","v":196},{"$f":"IF(Y135<10,CONCATENATE(\"00\",Y135),IF(AND(Y135<100,Y135>9),CONCATENATE(\"0\",Y135),Y135))","v":197},{"$f":"+Y131+1","v":196},197,null,null,null,"Total"]
[null,"Z011"," Examen de Oídos y de la Audición",null,null,"Normal",null,{"$f":"SUM(I136:J136)","v":382},{"$f":"+GETPIVOTDATA(\" BAS198\",TABLAS!$A$75)","v":210},{"$f":"+GETPIVOTDATA(\" BAS199\",TABLAS!$A$75)","v":172},null,null,null,null,null,null,null,null,null,"=+IMPORTARDATOSDINAMICOS(\" BAS198\";TABLAS!$A$75)","=+IMPORTARDATOSDINAMICOS(\" BAS199\";TABLAS!$A$75)",198,199,198,199,null,null,null,"H919/ D + EDAD >=12 Y <=17"]
[null,null,null,null,null,"Anormal",null,0,{"$f":"+GETPIVOTDATA(\" BAS200\",TABLAS!$A$75)","v":0},{"$f":"+GETPIVOTDATA(\" BAS201\",TABLAS!$A$75)","v":0},null,null,null,null,null,null,null,null,null,{"$f":"CONCATENATE($U$17,V137,$U$16)","v":"=+IMPORTARDATOSDINAMICOS(\" BAS200\";TABLAS!$A$75)"},{"$f":"CONCATENATE($U$17,W137,$U$16)","v":"=+IMPORTARDATOSDINAMICOS(\" BAS201\";TABLAS!$A$75)"},{"$f":"IF(X137<10,CONCATENATE(\"00\",X137),IF(AND(X137<100,X137>9),CONCATENATE(\"0\",X137),X137))","v":200},{"$f":"IF(Y137<10,CONCATENATE(\"00\",Y137),IF(AND(Y137<100,Y137>9),CONCATENATE(\"0\",Y137),Y137))","v":201},{"$f":"+Y136+1","v":200},{"$f":"+X137+1","v":201}]
[]
[null,"usp_TRAMA_BASE_ADOLESCENTE_2020_RPT_07_ODONTOLOGICA"]
[null,"ATENCIÓN ODONTOLÓGICA",null,null,null,null,null,null,null,"Total","12a - 14a","15a-17a",null,null,null,null,null,null,null,null,null,null,null,null,null,null,null,null,"usp_TRAMA_BASE_ADOLESCENTE_2020_RPT_07_ODONTOLOGICA"]
[null,"D1310","Asesoría Nutricional para el Control de Enfermedades Dentales",null,null,null,null,null,null,{"$f":"SUM(K141:L141)","v":684},{"$f":"+GETPIVOTDATA(\" BAS202\",TABLAS!$A$75)","v":317},{"$f":"+GETPIVOTDATA(\" BAS203\",TABLAS!$A$75)","v":367},null,null,null,null,null,null,null,{"$f":"CONCATENATE($U$17,V141,$U$16)","v":"=+IMPORTARDATOSDINAMICOS(\" BAS202\";TABLAS!$A$75)"},{"$f":"CONCATENATE($U$17,W141,$U$16)","v":"=+IMPORTARDATOSDINAMICOS(\" BAS203\";TABLAS!$A$75)"},202,203,{"$f":"+Y137+1","v":202},203,null,null,null,"Total"]
[null,"D1330","Instrucción de Higiene Oral",null,null,null,null,null,null,{"$f":"SUM(K142:L142)","v":685},{"$f":"+GETPIVOTDATA(\" BAS204\",TABLAS!$A$75)","v":316},{"$f":"+GETPIVOTDATA(\" BAS205\",TABLAS!$A$75)","v":369},null,null,null,null,null,null,null,"=+IMPORTARDATOSDINAMICOS(\" BAS204\";TABLAS!$A$75)","=+IMPORTARDATOSDINAMICOS(\" BAS205\";TABLAS!$A$75)",204,205,204,205,null,null,null,"D1310 /D + EDAD >=12 Y <=17"]
[null,"D0120","Examen Estomatológico",null,null,null,null,null,null,20,{"$f":"+GETPIVOTDATA(\" BAS206\",TABLAS!$A$75)","v":10},{"$f":"+GETPIVOTDATA(\" BAS207\",TABLAS!$A$75)","v":10},null,null,null,null,null,null,null,"=+IMPORTARDATOSDINAMICOS(\" BAS206\";TABLAS!$A$75)","=+IMPORTARDATOSDINAMICOS(\" BAS207\";TABLAS!$A$75)",206,207,206,207,null,null,null,"D1330 /D + EDAD >=12 Y <=17"]
[null,"D1110","Profilaxis Dental",null,null,null,null,null,null,670,{"$f":"+GETPIVOTDATA(\" BAS208\",TABLAS!$A$75)","v":318},{"$f":"+GETPIVOTDATA(\" BAS209\",TABLAS!$A$75)","v":352},null,null,null,null,null,null,null,"=+IMPORTARDATOSDINAMICOS(\" BAS208\";TABLAS!$A$75)","=+IMPORTARDATOSDINAMICOS(\" BAS209\";TABLAS!$A$75)",208,209,208,209,null,null,null,"D0120 /D + EDAD >=12 Y <=17"]
[null,"U510","Alta Básica Odontológica",null,null,null,null,null,null,33,{"$f":"+GETPIVOTDATA(\" BAS210\",TABLAS!$A$75)","v":17},{"$f":"+GETPIVOTDATA(\" BAS211\",TABLAS!$A$75)","v":16},null,null,null,null,null,null,null,"=+IMPORTARDATOSDINAMICOS(\" BAS210\";TABLAS!$A$75)","=+IMPORTARDATOSDINAMICOS(\" BAS211\";TABLAS!$A$75)",210,211,210,211,null,null,null,"D1110 /D + EDAD >=12 Y <=17"]
[]
[null,"usp_TRAMA_BASE_ADOLESCENTE_2020_RPT_08_FISICO",null,null,null,null,null,null,null,null,null,null,null,null,null,null,null,null,null,null,"\";TABLAS!$A$111)"]
[null,"EVALUACIÓN FÍSICO POSTURAL",null,null,null,null,null,"Total","12a - 14a","15a-17a",null,null,null,null,null,null,null,null,null,null,"=+IMPORTARDATOSDINAMICOS(\" BAS",null,null,null,null,null,null,null,"usp_TRAMA_BASE_ADOLESCENTE_2020_RPT_08_FISICO"]
[null,96008,"Análisis Postural Estático ( NORMAL)",null,null,null,null,{"$f":"SUM(I149:J149)","v":36},{"$f":"+GETPIVOTDATA(\" BAS001\",TABLAS!$A$111)","v":21},{"$f":"+GETPIVOTDATA(\" BAS002\",TABLAS!$A$111)","v":15},null,null,null,null,null,null,null,null,null,{"$f":"CONCATENATE($U$148,V149,$U$147)","v":"=+IMPORTARDATOSDINAMICOS(\" BAS001\";TABLAS!$A$111)"},{"$f":"CONCATENATE($U$148,W149,$U$147)","v":"=+IMPORTARDATOSDINAMICOS(\" BAS002\";TABLAS!$A$111)"},"001","002",1,2,null,null,null,"Total"]
[null,"M400","Cifosis postural",null,null,null,null,{"$f":"SUM(I150:J150)","v":0},{"$f":"+GETPIVOTDATA(\" BAS003\",TABLAS!$A$111)","v":0},{"$f":"+GETPIVOTDATA(\" BAS004\",TABLAS!$A$111)","v":0},null,null,null,null,null,null,null,null,null,{"$f":"CONCATENATE($U$148,V150,$U$147)","v":"=+IMPORTARDATOSDINAMICOS(\" BAS003\";TABLAS!$A$111)"},{"$f":"CONCATENATE($U$148,W150,$U$147)","v":"=+IMPORTARDATOSDINAMICOS(\" BAS004\";TABLAS!$A$111)"},"003","004",3,4,null,null,null,"96008/D + EDAD >=12 Y <=17"]
[null,"M402 ","Otras cifosis y las no especificadas",null,null,null,null,0,{"$f":"+GETPIVOTDATA(\" BAS005\",TABLAS!$A$111)","v":0},{"$f":"+GETPIVOTDATA(\" BAS006\",TABLAS!$A$111)","v":0},null,null,null,null,null,null,null,null,null,"=+IMPORTARDATOSDINAMICOS(\" BAS005\";TABLAS!$A$111)","=+IMPORTARDATOSDINAMICOS(\" BAS006\";TABLAS!$A$111)","005","006",5,6,null,null,null,"M400/D + EDAD >=12 Y <=17"]
[null,"M403","Síndrome de espalda plana",null,null,null,null,0,{"$f":"+GETPIVOTDATA(\" BAS007\",TABLAS!$A$111)","v":0},{"$f":"+GETPIVOTDATA(\" BAS008\",TABLAS!$A$111)","v":0},null,null,null,null,null,null,null,null,null,"=+IMPORTARDATOSDINAMICOS(\" BAS007\";TABLAS!$A$111)","=+IMPORTARDATOSDINAMICOS(\" BAS008\";TABLAS!$A$111)","007","008",7,8,null,null,null,"M402/D + EDAD >=12 Y <=17"]
[null,"M405","Lordosis no especifica",null,null,null,null,0,{"$f":"+GETPIVOTDATA(\" BAS009\",TABLAS!$A$111)","v":0},{"$f":"+GETPIVOTDATA(\" BAS010\",TABLAS!$A$111)","v":0},null,null,null,null,null,null,null,null,null,"=+IMPORTARDATOSDINAMICOS(\" BAS009\";TABLAS!$A$111)","=+IMPORTARDATOSDINAMICOS(\" BAS010\";TABLAS!$A$111)","009","010",9,10,null,null,null,"M403/D + EDAD >=12 Y <=17"]
[null,"M419","Escoliosis, no especificada",null,null,null,null,3,{"$f":"+GETPIVOTDATA(\" BAS011\",TABLAS!$A$111)","v":3},{"$f":"+GETPIVOTDATA(\" BAS012\",TABLAS!$A$111)","v":0},null,null,null,null,null,null,null,null,null,"=+IMPORTARDATOSDINAMICOS(\" BAS011\";TABLAS!$A$111)","=+IMPORTARDATOSDINAMICOS(\" BAS012\";TABLAS!$A$111)","011","012",11,{"$f":"+X154+1","v":12},null,null,null,"M405/D + EDAD >=12 Y <=17"]
[]
[null,"usp_TRAMA_BASE_ADOLESCENTE_2020_RPT_09_INMUNIZACIONES"]
[null,"INMUNIZACIONES",null,null,null,null,null,null,null,null,"Total","12a - 14a","15a-17a",null,null,null,null,null,null,null,null,null,null,null,null,null,null,null,"usp_TRAMA_BASE_ADOLESCENTE_2020_RPT_09_INMUNIZACIONES"]
[null,90746," Vacunación Antihepatitis Viral B (HvB) ======> DOSIS 1",null,null,null,null,null,null,null,{"$f":"SUM(L158:M158)","v":25},{"$f":"+GETPIVOTDATA(\" BAS013\",TABLAS!$A$111)","v":0},{"$f":"+GETPIVOTDATA(\" BAS014\",TABLAS!$A$111)","v":25},null,null,null,null,null,null,{"$f":"CONCATENATE($U$148,V158,$U$147)","v":"=+IMPORTARDATOSDINAMICOS(\" BAS013\";TABLAS!$A$111)"},{"$f":"CONCATENATE($U$148,W158,$U$147)","v":"=+IMPORTARDATOSDINAMICOS(\" BAS014\";TABLAS!$A$111)"},"013","014",{"$f":"+Y154+1","v":13},14,null,null,null,"Total"]
[null,null," Vacunación Antihepatitis Viral B (HvB) ======> DOSIS 2",null,null,null,null,null,null,null,{"$f":"SUM(L159:M159)","v":5},{"$f":"+GETPIVOTDATA(\" BAS015\",TABLAS!$A$111)","v":0},{"$f":"+GETPIVOTDATA(\" BAS016\",TABLAS!$A$111)","v":5},null,null,null,null,null,null,"=+IMPORTARDATOSDINAMICOS(\" BAS015\";TABLAS!$A$111)","=+IMPORTARDATOSDINAMICOS(\" BAS016\";TABLAS!$A$111)","015","016",15,16,null,null,null,"90746 /D + LAB= 1"]
[null,null," Vacunación Antihepatitis Viral B (HvB) ======> DOSIS 3",null,null,null,null,null,null,null,3,{"$f":"+GETPIVOTDATA(\" BAS017\",TABLAS!$A$111)","v":0},{"$f":"+GETPIVOTDATA(\" BAS018\",TABLAS!$A$111)","v":3},null,null,null,null,null,null,"=+IMPORTARDATOSDINAMICOS(\" BAS017\";TABLAS!$A$111)","=+IMPORTARDATOSDINAMICOS(\" BAS018\";TABLAS!$A$111)","017","018",17,18,null,null,null,"90746 / D + LAB= 2"]
[null,90658,"Vacuna contra la Influenza  (Estacional)",null,null,null,null,null,null,null,0,{"$f":"+GETPIVOTDATA(\" BAS019\",TABLAS!$A$111)","v":0},{"$f":"+GETPIVOTDATA(\" BAS020\",TABLAS!$A$111)","v":0},null,null,null,null,null,null,"=+IMPORTARDATOSDINAMICOS(\" BAS019\";TABLAS!$A$111)","=+IMPORTARDATOSDINAMICOS(\" BAS020\";TABLAS!$A$111)","019","020",19,20,null,null,null,"90746 / D+ LAB= 3"]
[null,90714,"Vacunación Diftotetánica (dT) (Incluye varones y gestantes) ======> DOSIS 1",null,null,null,null,null,null,null,65,{"$f":"+GETPIVOTDATA(\" BAS021\",TABLAS!$A$111)","v":25},{"$f":"+GETPIVOTDATA(\" BAS022\",TABLAS!$A$111)","v":40},null,null,null,null,null,null,"=+IMPORTARDATOSDINAMICOS(\" BAS021\";TABLAS!$A$111)","=+IMPORTARDATOSDINAMICOS(\" BAS022\";TABLAS!$A$111)","021","022",21,22,null,null,null,"90658 / D"]
[null,null,"Vacunación Diftotetánica (dT) (Incluye varones y gestantes) ======>DOSIS 2",null,null,null,null,null,null,null,15,{"$f":"+GETPIVOTDATA(\" BAS023\",TABLAS!$A$111)","v":11},{"$f":"+GETPIVOTDATA(\" BAS024\",TABLAS!$A$111)","v":4},null,null,null,null,null,null,"=+IMPORTARDATOSDINAMICOS(\" BAS023\";TABLAS!$A$111)","=+IMPORTARDATOSDINAMICOS(\" BAS024\";TABLAS!$A$111)","023","024",23,24,null,null,null,"90714 / D + LAB= 1"]
[null,null,"Vacunación Diftotetánica (dT) (Incluye varones y gestantes) ======>DOSIS 3",null,null,null,null,null,null,null,10,{"$f":"+GETPIVOTDATA(\" BAS025\",TABLAS!$A$111)","v":6},{"$f":"+GETPIVOTDATA(\" BAS026\",TABLAS!$A$111)","v":4},null,null,null,null,null,null,"=+IMPORTARDATOSDINAMICOS(\" BAS025\";TABLAS!$A$111)","=+IMPORTARDATOSDINAMICOS(\" BAS026\";TABLAS!$A$111)","025","026",25,26,null,null,null,"90714 / D + LAB= 2"]
[null,90649," Vacuna contra Virus de Papiloma Humano  ======> DOSIS 1",null,null,null,null,null,null,null,0,{"$f":"+GETPIVOTDATA(\" BAS027\",TABLAS!$A$111)","v":0},{"$f":"+GETPIVOTDATA(\" BAS028\",TABLAS!$A$111)","v":0},null,null,null,null,null,null,"=+IMPORTARDATOSDINAMICOS(\" BAS027\";TABLAS!$A$111)","=+IMPORTARDATOSDINAMICOS(\" BAS028\";TABLAS!$A$111)","027","028",27,28,null,null,null,"90714 / D+ LAB= 3"]
[null,null," Vacuna contra Virus de Papiloma Humano  ======> DOSIS 2",null,null,null,null,null,null,null,0,{"$f":"+GETPIVOTDATA(\" BAS029\",TABLAS!$A$111)","v":0},{"$f":"+GETPIVOTDATA(\" BAS030\",TABLAS!$A$111)","v":0},null,null,null,null,null,null,"=+IMPORTARDATOSDINAMICOS(\" BAS029\";TABLAS!$A$111)","=+IMPORTARDATOSDINAMICOS(\" BAS030\";TABLAS!$A$111)","029","030",{"$f":"+Y165+1","v":29},30,null,null,null,"90649 / D + LAB= 1"]
[null,90717,"Vacuna Antiamarilica",null,null,null,null,null,null,null,52,{"$f":"+GETPIVOTDATA(\" BAS031\",TABLAS!$A$111)","v":9},{"$f":"+GETPIVOTDATA(\" BAS032\",TABLAS!$A$111)","v":43},null,null,null,null,null,null,"=+IMPORTARDATOSDINAMICOS(\" BAS031\";TABLAS!$A$111)","=+IMPORTARDATOSDINAMICOS(\" BAS032\";TABLAS!$A$111)","031","032",31,32,null,null,null,"90649 / D+ LAB= 2"]
[]
[null,"usp_TRAMA_BASE_ADOLESCENTE_2020_RPT_10_PLANIFICACION"]
[null,"EVALUACIÓN DEL DESARROLLO SEXUAL/ PLANIFICACIÓN FAMILIAR",null,null,null,null,null,null,null,"Total","12a - 14a","15a-17a",null,null,null,null,null,null,null,null,null,null,null,null,null,null,null,null,"usp_TRAMA_BASE_ADOLESCENTE_2020_RPT_10_PLANIFICACION"]
[1,99384.02,"Evaluación del desarrollo sexual según Tanner.",null,null,null,null,null,null,{"$f":"SUM(K171:L171)","v":329},{"$f":"+GETPIVOTDATA(\" BAS033\",TABLAS!$A$111)","v":166},{"$f":"+GETPIVOTDATA(\" BAS034\",TABLAS!$A$111)","v":163},null,null,null,null,null,null,null,{"$f":"CONCATENATE($U$148,V171,$U$147)","v":"=+IMPORTARDATOSDINAMICOS(\" BAS033\";TABLAS!$A$111)"},{"$f":"CONCATENATE($U$148,W171,$U$147)","v":"=+IMPORTARDATOSDINAMICOS(\" BAS034\";TABLAS!$A$111)"},"033","034",{"$f":"+Y167+1","v":33},34,null,null,null,"Total"]
[2,"99208"," Atención en Planificación Familiar y SSR",null,null,null,null,null,null,{"$f":"SUM(K172:L172)","v":449},{"$f":"+GETPIVOTDATA(\" BAS035\",TABLAS!$A$111)","v":108},{"$f":"+GETPIVOTDATA(\" BAS036\",TABLAS!$A$111)","v":341},null,null,null,null,null,null,null,"=+IMPORTARDATOSDINAMICOS(\" BAS035\";TABLAS!$A$111)","=+IMPORTARDATOSDINAMICOS(\" BAS036\";TABLAS!$A$111)","035","036",35,36,null,null,null,"99384.02 / D"]
[null,null,"Entrega de Métodos Anticonceptivos, en caso de que el/la Adolescente lo requiera",null,null,null,null,null,null,null,null,null,null,null,null,null,null,null,null,null,null,null,null,null,null,null,null,null,"99208 / D"]
[null,58300,"DIU",null,null,null,null,null,null,0,{"$f":"+GETPIVOTDATA(\" BAS037\",TABLAS!$A$111)","v":0},{"$f":"+GETPIVOTDATA(\" BAS038\",TABLAS!$A$111)","v":0},null,null,null,null,null,null,null,{"$f":"CONCATENATE($U$148,V174,$U$147)","v":"=+IMPORTARDATOSDINAMICOS(\" BAS037\";TABLAS!$A$111)"},{"$f":"CONCATENATE($U$148,W174,$U$147)","v":"=+IMPORTARDATOSDINAMICOS(\" BAS038\";TABLAS!$A$111)"},"037","038",{"$f":"+Y172+1","v":37},38,null,null,null,"De acuerdo al MAC elegido"]
[null,"99208.13","HORMONAL",null,"ORAL COMBINADO",null,null,null,null,18,{"$f":"+GETPIVOTDATA(\" BAS039\",TABLAS!$A$111)","v":2},{"$f":"+GETPIVOTDATA(\" BAS040\",TABLAS!$A$111)","v":16},null,null,null,null,null,null,null,"=+IMPORTARDATOSDINAMICOS(\" BAS039\";TABLAS!$A$111)","=+IMPORTARDATOSDINAMICOS(\" BAS040\";TABLAS!$A$111)","039","040",39,40,null,null,null,"58300/D"]
[null,"99208.05/D",null,null,"INYECTABLE TRIMESTRAL",null,null,null,null,78,{"$f":"+GETPIVOTDATA(\" BAS041\",TABLAS!$A$111)","v":9},{"$f":"+GETPIVOTDATA(\" BAS042\",TABLAS!$A$111)","v":69},null,null,null,null,null,null,null,"=+IMPORTARDATOSDINAMICOS(\" BAS041\";TABLAS!$A$111)","=+IMPORTARDATOSDINAMICOS(\" BAS042\";TABLAS!$A$111)","041","042",41,42,null,null,null,"99208.13/D"]
[null,"99208.04/D",null,null,"INYECTABLE MENSUAL",null,null,null,null,30,{"$f":"+GETPIVOTDATA(\" BAS043\",TABLAS!$A$111)","v":15},{"$f":"+GETPIVOTDATA(\" BAS044\",TABLAS!$A$111)","v":15},null,null,null,null,null,null,null,"=+IMPORTARDATOSDINAMICOS(\" BAS043\";TABLAS!$A$111)","=+IMPORTARDATOSDINAMICOS(\" BAS044\";TABLAS!$A$111)","043","044",43,44,null,null,null,"99208.05/D"]
[null,"11975/D",null,null,"IMPLANTE",null,null,null,null,28,{"$f":"+GETPIVOTDATA(\" BAS045\",TABLAS!$A$111)","v":6},{"$f":"+GETPIVOTDATA(\" BAS046\",TABLAS!$A$111)","v":22},null,null,null,null,null,null,null,"=+IMPORTARDATOSDINAMICOS(\" BAS045\";TABLAS!$A$111)","=+IMPORTARDATOSDINAMICOS(\" BAS046\";TABLAS!$A$111)","045","046",45,46,null,null,null,"99208.04/D"]
[null,"99208.02/D","BARRERA",null,"CONDON MASCULINO",null,null,null,null,18,{"$f":"+GETPIVOTDATA(\" BAS047\",TABLAS!$A$111)","v":1},{"$f":"+GETPIVOTDATA(\" BAS048\",TABLAS!$A$111)","v":17},null,null,null,null,null,null,null,"=+IMPORTARDATOSDINAMICOS(\" BAS047\";TABLAS!$A$111)","=+IMPORTARDATOSDINAMICOS(\" BAS048\";TABLAS!$A$111)","047","048",47,48,null,null,null,"11975/D"]
[null,"99208.06/D",null,null,"CONDON FEMENINO",null,null,null,null,0,{"$f":"+GETPIVOTDATA(\" BAS049\",TABLAS!$A$111)","v":0},{"$f":"+GETPIVOTDATA(\" BAS050\",TABLAS!$A$111)","v":0},null,null,null,null,null,null,null,"=+IMPORTARDATOSDINAMICOS(\" BAS049\";TABLAS!$A$111)","=+IMPORTARDATOSDINAMICOS(\" BAS050\";TABLAS!$A$111)","049","050",49,50,null,null,null,"99208.02/D"]
[null,"99208.07/D","MELA",null,null,null,null,null,null,0,{"$f":"+GETPIVOTDATA(\" BAS051\",TABLAS!$A$111)","v":0},{"$f":"+GETPIVOTDATA(\" BAS052\",TABLAS!$A$111)","v":0},null,null,null,null,null,null,null,"=+IMPORTARDATOSDINAMICOS(\" BAS051\";TABLAS!$A$111)","=+IMPORTARDATOSDINAMICOS(\" BAS052\";TABLAS!$A$111)","051","052",51,52,null,null,null,"99208.06/D"]
[null,"99208.09/D","ABSTINECIA PERIODICA",null,"BILLINGS",null,null,null,null,2,{"$f":"+GETPIVOTDATA(\" BAS053\",TABLAS!$A$111)","v":1},{"$f":"+GETPIVOTDATA(\" BAS054\",TABLAS!$A$111)","v":1},null,null,null,null,null,null,null,"=+IMPORTARDATOSDINAMICOS(\" BAS053\";TABLAS!$A$111)","=+IMPORTARDATOSDINAMICOS(\" BAS054\";TABLAS!$A$111)","053","054",53,54,null,null,null,"99208.07/D"]
[null,"99208.08/D",null,null,"RITMO ",null,null,null,null,5,{"$f":"+GETPIVOTDATA(\" BAS055\",TABLAS!$A$111)","v":3},{"$f":"+GETPIVOTDATA(\" BAS056\",TABLAS!$A$111)","v":2},null,null,null,null,null,null,null,"=+IMPORTARDATOSDINAMICOS(\" BAS055\";TABLAS!$A$111)","=+IMPORTARDATOSDINAMICOS(\" BAS056\";TABLAS!$A$111)","055","056",55,56,null,null,null,"99208.09/D"]
[null,"99208.10/D",null,null,"DIAS FIJO",null,null,null,null,0,{"$f":"+GETPIVOTDATA(\" BAS057\",TABLAS!$A$111)","v":0},{"$f":"+GETPIVOTDATA(\" BAS058\",TABLAS!$A$111)","v":0},null,null,null,null,null,null,null,"=+IMPORTARDATOSDINAMICOS(\" BAS057\";TABLAS!$A$111)","=+IMPORTARDATOSDINAMICOS(\" BAS058\";TABLAS!$A$111)","057","058",57,58,null,null,null,"99208.08/D"]
[null,"99208.11/D","ADM AOE/ YUSPE",null,"Adm y uso de anticonceptivo AOE/YUZPE",null,null,null,null,0,{"$f":"+GETPIVOTDATA(\" BAS059\",TABLAS!$A$111)","v":0},{"$f":"+GETPIVOTDATA(\" BAS060\",TABLAS!$A$111)","v":0},null,null,null,null,null,null,null,"=+IMPORTARDATOSDINAMICOS(\" BAS059\";TABLAS!$A$111)","=+IMPORTARDATOSDINAMICOS(\" BAS060\";TABLAS!$A$111)","059","060",59,60,null,null,null,"99208.10/D"]
[]
[null,"usp_TRAMA_BASE_ADOLESCENTE_2020_RPT_11_CLINICA"]
[null,"EVALUACIÓN CLÍNICA",null,null,null,null,null,null,null,"Total","12a - 14a","15a-17a",null,null,null,null,null,null,null,null,null,null,null,null,null,null,null,null,"usp_TRAMA_BASE_ADOLESCENTE_2020_RPT_11_CLINICA"]
[null,"L709 ","Acné no especificado",null,null,null,null,null,null,{"$f":"SUM(K189:L189)","v":1},{"$f":"+GETPIVOTDATA(\" BAS061\",TABLAS!$A$111)","v":0},{"$f":"+GETPIVOTDATA(\" BAS062\",TABLAS!$A$111)","v":1},null,null,null,null,null,null,null,{"$f":"CONCATENATE($U$148,V189,$U$147)","v":"=+IMPORTARDATOSDINAMICOS(\" BAS061\";TABLAS!$A$111)"},{"$f":"CONCATENATE($U$148,W189,$U$147)","v":"=+IMPORTARDATOSDINAMICOS(\" BAS062\";TABLAS!$A$111)"},"061","062",{"$f":"+Y185+1","v":61},62,null,null,null,"Total"]
[null,"D509"," Anemia por Deficiencia de Hierro sin Especificación",null,null,null,null,null,null,{"$f":"SUM(K190:L190)","v":41},{"$f":"+GETPIVOTDATA(\" BAS063\",TABLAS!$A$111)","v":15},{"$f":"+GETPIVOTDATA(\" BAS064\",TABLAS!$A$111)","v":26},null,null,null,null,null,null,null,"=+IMPORTARDATOSDINAMICOS(\" BAS063\";TABLAS!$A$111)","=+IMPORTARDATOSDINAMICOS(\" BAS064\";TABLAS!$A$111)","063","064",63,64,null,null,null,"L709 /D + EDAD >=12 Y <=17"]
[null,"O990"," Anemia que afecta al Embarazo, Parto o Puerperio",null,null,null,null,null,null,14,{"$f":"+GETPIVOTDATA(\" BAS065\",TABLAS!$A$111)","v":2},{"$f":"+GETPIVOTDATA(\" BAS066\",TABLAS!$A$111)","v":12},null,null,null,null,null,null,null,"=+IMPORTARDATOSDINAMICOS(\" BAS065\";TABLAS!$A$111)","=+IMPORTARDATOSDINAMICOS(\" BAS066\";TABLAS!$A$111)","065","066",65,66,null,null,null,"D509 /D + EDAD >=12 Y <=17"]
[null,"U310"," Administración de Tratamiento (Anemia)",null,null,null,null,null,null,40,{"$f":"+GETPIVOTDATA(\" BAS067\",TABLAS!$A$111)","v":27},{"$f":"+GETPIVOTDATA(\" BAS068\",TABLAS!$A$111)","v":13},null,null,null,null,null,null,null,"=+IMPORTARDATOSDINAMICOS(\" BAS067\";TABLAS!$A$111)","=+IMPORTARDATOSDINAMICOS(\" BAS068\";TABLAS!$A$111)","067","068",67,68,null,null,null,"O990/D + EDAD >=12 Y <=17"]
[null,"J459"," Asma No Especificada",null,null,null,null,null,null,0,{"$f":"+GETPIVOTDATA(\" BAS069\",TABLAS!$A$111)","v":0},{"$f":"+GETPIVOTDATA(\" BAS070\",TABLAS!$A$111)","v":0},null,null,null,null,null,null,null,"=+IMPORTARDATOSDINAMICOS(\" BAS069\";TABLAS!$A$111)","=+IMPORTARDATOSDINAMICOS(\" BAS070\";TABLAS!$A$111)","069","070",69,70,null,null,null,"U310/D + EDAD >=12 Y <=17"]
[null,"I10X ","Hipertensión Esencial Primaria (Hipertensión Arterial)",null,null,null,null,null,null,0,{"$f":"+GETPIVOTDATA(\" BAS071\",TABLAS!$A$111)","v":0},{"$f":"+GETPIVOTDATA(\" BAS072\",TABLAS!$A$111)","v":0},null,null,null,null,null,null,null,"=+IMPORTARDATOSDINAMICOS(\" BAS071\";TABLAS!$A$111)","=+IMPORTARDATOSDINAMICOS(\" BAS072\";TABLAS!$A$111)","071","072",71,72,null,null,null,"J459/D + EDAD >=12 Y <=17"]
[null,"R51X"," Cefalea",null,null,null,null,null,null,37,{"$f":"+GETPIVOTDATA(\" BAS073\",TABLAS!$A$111)","v":15},{"$f":"+GETPIVOTDATA(\" BAS074\",TABLAS!$A$111)","v":22},null,null,null,null,null,null,null,"=+IMPORTARDATOSDINAMICOS(\" BAS073\";TABLAS!$A$111)","=+IMPORTARDATOSDINAMICOS(\" BAS074\";TABLAS!$A$111)","073","074",73,74,null,null,null,"I10X /D + EDAD >=12 Y <=17"]
[null,"B829"," Parasitosis Intestinal, sin otra Especificación",null,null,null,null,null,null,74,{"$f":"+GETPIVOTDATA(\" BAS075\",TABLAS!$A$111)","v":47},{"$f":"+GETPIVOTDATA(\" BAS076\",TABLAS!$A$111)","v":27},null,null,null,null,null,null,null,"=+IMPORTARDATOSDINAMICOS(\" BAS075\";TABLAS!$A$111)","=+IMPORTARDATOSDINAMICOS(\" BAS076\";TABLAS!$A$111)","075","076",75,76,null,null,null,"R51X/D + EDAD >=12 Y <=17"]
[null,"N63X"," Masa No Especificada en la Mama",null,null,null,null,null,null,3,{"$f":"+GETPIVOTDATA(\" BAS077\",TABLAS!$A$111)","v":2},{"$f":"+GETPIVOTDATA(\" BAS078\",TABLAS!$A$111)","v":1},null,null,null,null,null,null,null,"=+IMPORTARDATOSDINAMICOS(\" BAS077\";TABLAS!$A$111)","=+IMPORTARDATOSDINAMICOS(\" BAS078\";TABLAS!$A$111)",{"$f":"IF(X197<10,CONCATENATE(\"00\",X197),IF(AND(X197<100,X197>9),CONCATENATE(\"0\",X197),X197))","v":"077"},{"$f":"IF(Y197<10,CONCATENATE(\"00\",Y197),IF(AND(Y197<100,Y197>9),CONCATENATE(\"0\",Y197),Y197))","v":"078"},77,78,null,null,null,"B829/D + EDAD >=12 Y <=17"]
[null,"A084"," Infección Intestinal Viral, Sin Otra Especificación",null,null,null,null,null,null,4,{"$f":"+GETPIVOTDATA(\" BAS079\",TABLAS!$A$111)","v":2},{"$f":"+GETPIVOTDATA(\" BAS080\",TABLAS!$A$111)","v":2},null,null,null,null,null,null,null,"=+IMPORTARDATOSDINAMICOS(\" BAS079\";TABLAS!$A$111)","=+IMPORTARDATOSDINAMICOS(\" BAS080\";TABLAS!$A$111)","079","080",79,80,null,null,null,"N63X/D + EDAD >=12 Y <=17"]
[null,"B373"," Candidiasis de la Vulva y de la Vagina (Candidiasis Vaginal) ",null,null,null,null,null,null,2,{"$f":"+GETPIVOTDATA(\" BAS081\",TABLAS!$A$111)","v":2},{"$f":"+GETPIVOTDATA(\" BAS082\",TABLAS!$A$111)","v":0},null,null,null,null,null,null,null,"=+IMPORTARDATOSDINAMICOS(\" BAS081\";TABLAS!$A$111)","=+IMPORTARDATOSDINAMICOS(\" BAS082\";TABLAS!$A$111)","081","082",81,82,null,null,null,"A084/D + EDAD >=12 Y <=17"]
[null,"B853"," Pediculosis del Pubis ",null,null,null,null,null,null,1,{"$f":"+GETPIVOTDATA(\" BAS083\",TABLAS!$A$111)","v":1},{"$f":"+GETPIVOTDATA(\" BAS084\",TABLAS!$A$111)","v":0},null,null,null,null,null,null,null,"=+IMPORTARDATOSDINAMICOS(\" BAS083\";TABLAS!$A$111)","=+IMPORTARDATOSDINAMICOS(\" BAS084\";TABLAS!$A$111)","083","084",83,84,null,null,null,"B373/D + EDAD >=12 Y <=17"]
[null,"B968"," Vaginosis Bacteriana",null,null,null,null,null,null,0,{"$f":"+GETPIVOTDATA(\" BAS085\",TABLAS!$A$111)","v":0},{"$f":"+GETPIVOTDATA(\" BAS086\",TABLAS!$A$111)","v":0},null,null,null,null,null,null,null,"=+IMPORTARDATOSDINAMICOS(\" BAS085\";TABLAS!$A$111)","=+IMPORTARDATOSDINAMICOS(\" BAS086\";TABLAS!$A$111)","085","086",85,86,null,null,null,"B853/D + EDAD >=12 Y <=17"]
[null,"A64X9"," Síndrome de Flujo Vaginal",null,null,null,null,null,null,10,{"$f":"+GETPIVOTDATA(\" BAS087\",TABLAS!$A$111)","v":4},{"$f":"+GETPIVOTDATA(\" BAS088\",TABLAS!$A$111)","v":6},null,null,null,null,null,null,null,"=+IMPORTARDATOSDINAMICOS(\" BAS087\";TABLAS!$A$111)","=+IMPORTARDATOSDINAMICOS(\" BAS088\";TABLAS!$A$111)","087","088",87,88,null,null,null,"B968/D + EDAD >=12 Y <=17"]
[null,"A64X5"," Síndrome de Dolor Abdominal Bajo",null,null,null,null,null,null,2,{"$f":"+GETPIVOTDATA(\" BAS089\",TABLAS!$A$111)","v":1},{"$f":"+GETPIVOTDATA(\" BAS090\",TABLAS!$A$111)","v":1},null,null,null,null,null,null,null,"=+IMPORTARDATOSDINAMICOS(\" BAS089\";TABLAS!$A$111)","=+IMPORTARDATOSDINAMICOS(\" BAS090\";TABLAS!$A$111)","089","090",89,90,null,null,null,"A64X9/D + EDAD >=12 Y <=17"]
[null,"A64X6"," Síndrome de Secreción Uretral",null,null,null,null,null,null,1,{"$f":"+GETPIVOTDATA(\" BAS091\",TABLAS!$A$111)","v":0},{"$f":"+GETPIVOTDATA(\" BAS092\",TABLAS!$A$111)","v":1},null,null,null,null,null,null,null,"=+IMPORTARDATOSDINAMICOS(\" BAS091\";TABLAS!$A$111)","=+IMPORTARDATOSDINAMICOS(\" BAS092\";TABLAS!$A$111)","091","092",91,92,null,null,null,"A64X5/D + EDAD >=12 Y <=17"]
[null,99199.11," Administración de Tratamiento (ITS)",null,null,null,null,null,null,43,{"$f":"+GETPIVOTDATA(\" BAS093\",TABLAS!$A$111)","v":8},{"$f":"+GETPIVOTDATA(\" BAS094\",TABLAS!$A$111)","v":35},null,null,null,null,null,null,null,"=+IMPORTARDATOSDINAMICOS(\" BAS093\";TABLAS!$A$111)","=+IMPORTARDATOSDINAMICOS(\" BAS094\";TABLAS!$A$111)","093","094",93,94,null,null,null,"A64X6/D + EDAD >=12 Y <=17"]
[null,null,null,null,null,null,null,null,null,null,null,null,null,null,null,null,null,null,null,null,null,"00","00"]
[null,"usp_TRAMA_BASE_ADOLESCENTE_2020_RPT_12_CONSEJERIAS",null,null,null,null,null,null,null,null,null,null,null,null,null,null,null,null,null,null,null,"00","00"]
[null,"CONSEJERÍAS",null,null,null,null,null,null,null,"Total","12a - 14a","15a-17a",null,null,null,null,null,null,null,null,null,"00","00",null,null,null,null,null,"usp_TRAMA_BASE_ADOLESCENTE_2020_RPT_12_CONSEJERIAS"]
[null,"99401"," Consejería Integral",null,null,null,null,null,null,{"$f":"SUM(K209:L209)","v":158},{"$f":"+GETPIVOTDATA(\" BAS095\",TABLAS!$A$111)","v":69},{"$f":"+GETPIVOTDATA(\" BAS096\",TABLAS!$A$111)","v":89},null,null,null,null,null,null,null,{"$f":"CONCATENATE($U$148,V209,$U$147)","v":"=+IMPORTARDATOSDINAMICOS(\" BAS095\";TABLAS!$A$111)"},{"$f":"CONCATENATE($U$148,W209,$U$147)","v":"=+IMPORTARDATOSDINAMICOS(\" BAS096\";TABLAS!$A$111)"},"095","096",{"$f":"+Y205+1","v":95},96,null,null,null,"Total"]
[null,99402.03,"Consejería/Orientación en Salud Sexual y Reproductiva",null,null,null,null,null,null,{"$f":"SUM(K210:L210)","v":428},{"$f":"+GETPIVOTDATA(\" BAS097\",TABLAS!$A$111)","v":196},{"$f":"+GETPIVOTDATA(\" BAS098\",TABLAS!$A$111)","v":232},null,null,null,null,null,null,null,"=+IMPORTARDATOSDINAMICOS(\" BAS097\";TABLAS!$A$111)","=+IMPORTARDATOSDINAMICOS(\" BAS098\";TABLAS!$A$111)","097","098",97,98,null,null,null,"99401/D + EDAD >=12 Y <=17"]
[null,"99402.04"," Orientación/Consejería en Planificación Familiar",null,null,null,null,null,null,719,{"$f":"+GETPIVOTDATA(\" BAS099\",TABLAS!$A$111)","v":259},{"$f":"+GETPIVOTDATA(\" BAS100\",TABLAS!$A$111)","v":460},null,null,null,null,null,null,null,"=+IMPORTARDATOSDINAMICOS(\" BAS099\";TABLAS!$A$111)","=+IMPORTARDATOSDINAMICOS(\" BAS100\";TABLAS!$A$111)","099",100,99,100,null,null,null,"99402.03/D + EDAD >=12 Y <=17"]
[null,99402.09," Consejería de Prevención en Riesgos de Salud Mental",null,null,null,null,null,null,911,{"$f":"+GETPIVOTDATA(\" BAS101\",TABLAS!$A$111)","v":361},{"$f":"+GETPIVOTDATA(\" BAS102\",TABLAS!$A$111)","v":550},null,null,null,null,null,null,null,"=+IMPORTARDATOSDINAMICOS(\" BAS101\";TABLAS!$A$111)","=+IMPORTARDATOSDINAMICOS(\" BAS102\";TABLAS!$A$111)",101,102,101,{"$f":"+X212+1","v":102},null,null,null,"99402.04/D + EDAD >=12 Y <=17"]
[null,"99401.31"," Consejería en Prevención de Enfermedades No transmisibles (Salud Física)",null,null,null,null,null,null,1,{"$f":"+GETPIVOTDATA(\" BAS103\",TABLAS!$A$111)","v":0},{"$f":"+GETPIVOTDATA(\" BAS104\",TABLAS!$A$111)","v":1},null,null,null,null,null,null,null,"=+IMPORTARDATOSDINAMICOS(\" BAS103\";TABLAS!$A$111)","=+IMPORTARDATOSDINAMICOS(\" BAS104\";TABLAS!$A$111)",103,104,103,104,null,null,null,"99402.09/D + EDAD >=12 Y <=17"]
[null,99403," Consejería Nutricional",null,null,null,null,null,null,12,{"$f":"+GETPIVOTDATA(\" BAS105\",TABLAS!$A$111)","v":0},{"$f":"+GETPIVOTDATA(\" BAS106\",TABLAS!$A$111)","v":12},null,null,null,null,null,null,null,"=+IMPORTARDATOSDINAMICOS(\" BAS105\";TABLAS!$A$111)","=+IMPORTARDATOSDINAMICOS(\" BAS106\";TABLAS!$A$111)",105,106,105,106,null,null,null,"99401.31/D + EDAD >=12 Y <=17"]
[null,"99403.01"," Consejería Nutricional: Alimentación Saludable",null,null,null,null,null,null,1190,{"$f":"+GETPIVOTDATA(\" BAS107\",TABLAS!$A$111)","v":522},{"$f":"+GETPIVOTDATA(\" BAS108\",TABLAS!$A$111)","v":668},null,null,null,null,null,null,null,"=+IMPORTARDATOSDINAMICOS(\" BAS107\";TABLAS!$A$111)","=+IMPORTARDATOSDINAMICOS(\" BAS108\";TABLAS!$A$111)",107,108,107,108,null,null,null,"99403/D + EDAD >=12 Y <=17"]
[null,99401.33,"Consejería Pre Test para VIH",null,null,null,null,null,null,798,{"$f":"+GETPIVOTDATA(\" BAS109\",TABLAS!$A$111)","v":181},{"$f":"+GETPIVOTDATA(\" BAS110\",TABLAS!$A$111)","v":617},null,null,null,null,null,null,null,"=+IMPORTARDATOSDINAMICOS(\" BAS109\";TABLAS!$A$111)","=+IMPORTARDATOSDINAMICOS(\" BAS110\";TABLAS!$A$111)",109,110,109,110,null,null,null,"99403.01/D + EDAD >=12 Y <=17"]
[null,99401.34,"Consejería Post Test para VIH - Resultado No Reactivo",null,null,null,null,null,null,822,{"$f":"+GETPIVOTDATA(\" BAS111\",TABLAS!$A$111)","v":191},{"$f":"+GETPIVOTDATA(\" BAS112\",TABLAS!$A$111)","v":631},null,null,null,null,null,null,null,"=+IMPORTARDATOSDINAMICOS(\" BAS111\";TABLAS!$A$111)","=+IMPORTARDATOSDINAMICOS(\" BAS112\";TABLAS!$A$111)",111,112,111,112,null,null,null,"99401.33/D + EDAD >=12 Y <=17"]
[null,99403.03,"Consejería Post Test para VIH - Resultado Reactivo",null,null,null,null,null,null,1,{"$f":"+GETPIVOTDATA(\" BAS113\",TABLAS!$A$111)","v":0},{"$f":"+GETPIVOTDATA(\" BAS114\",TABLAS!$A$111)","v":1},null,null,null,null,null,null,null,"=+IMPORTARDATOSDINAMICOS(\" BAS113\";TABLAS!$A$111)","=+IMPORTARDATOSDINAMICOS(\" BAS114\";TABLAS!$A$111)",113,114,113,114,null,null,null,"99401.34/D + EDAD >=12 Y <=17"]
[null,"99402.05"," Consejería/Orientación en Prevención de ITS, VIH, Hepatitis",null,null,null,null,null,null,865,{"$f":"+GETPIVOTDATA(\" BAS115\",TABLAS!$A$111)","v":219},{"$f":"+GETPIVOTDATA(\" BAS116\",TABLAS!$A$111)","v":646},null,null,null,null,null,null,null,"=+IMPORTARDATOSDINAMICOS(\" BAS115\";TABLAS!$A$111)","=+IMPORTARDATOSDINAMICOS(\" BAS116\";TABLAS!$A$111)",115,116,115,116,null,null,null,"99403.03/D + EDAD >=12 Y <=17"]
[null,99401.24,"Consejerìa higiene de manos ",null,null,null,null,null,null,17,{"$f":"+GETPIVOTDATA(\" BAS117\",TABLAS!$A$111)","v":10},{"$f":"+GETPIVOTDATA(\" BAS118\",TABLAS!$A$111)","v":7},null,null,null,null,null,null,null,"=+IMPORTARDATOSDINAMICOS(\" BAS117\";TABLAS!$A$111)","=+IMPORTARDATOSDINAMICOS(\" BAS118\";TABLAS!$A$111)",117,118,117,118,null,null,null,"99402.05/D + EDAD >=12 Y <=17"]
[null,99401.19,"Consejerìa para el autocuidado",null,null,null,null,null,null,18,{"$f":"+GETPIVOTDATA(\" BAS119\",TABLAS!$A$111)","v":7},{"$f":"+GETPIVOTDATA(\" BAS120\",TABLAS!$A$111)","v":11},null,null,null,null,null,null,null,"=+IMPORTARDATOSDINAMICOS(\" BAS119\";TABLAS!$A$111)","=+IMPORTARDATOSDINAMICOS(\" BAS120\";TABLAS!$A$111)",119,120,119,120,null,null,null,"99401.24/D + EDAD >=12 Y <=17"]
[]
[null,"usp_TRAMA_BASE_ADOLESCENTE_2020_RPT_13_PRUEBAS"]
[null,"TOMA DE PRUEBA RÁPIDA (en caso lo requiera) \nPARA LA DETECCIÓN DE",null,null,null,null,null,null,null,"Total","12a - 14a","15a-17a",null,null,null,null,null,null,null,null,null,null,null,null,null,null,null,null,"usp_TRAMA_BASE_ADOLESCENTE_2020_RPT_13_PRUEBAS"]
[null,86703,"Anticuerpos; HIV-1 y HIV-2, análisis único (Tamizaje de VIH por Prueba Rápida)",null,null,null,null,null,null,{"$f":"SUM(K225:L225)","v":1},{"$f":"+GETPIVOTDATA(\" BAS121\",TABLAS!$A$111)","v":0},{"$f":"+GETPIVOTDATA(\" BAS122\",TABLAS!$A$111)","v":1},null,null,null,null,null,null,null,{"$f":"CONCATENATE($U$148,V225,$U$147)","v":"=+IMPORTARDATOSDINAMICOS(\" BAS121\";TABLAS!$A$111)"},{"$f":"CONCATENATE($U$148,W225,$U$147)","v":"=+IMPORTARDATOSDINAMICOS(\" BAS122\";TABLAS!$A$111)"},121,122,{"$f":"+Y221+1","v":121},122,null,null,null,"Total"]
[null,86780,"Anticuerpo: Treponema Pallidum(Tamizaje de Sífilis por Prueba Rápida)",null,null,null,null,null,null,0,{"$f":"+GETPIVOTDATA(\" BAS123\",TABLAS!$A$111)","v":0},{"$f":"+GETPIVOTDATA(\" BAS124\",TABLAS!$A$111)","v":0},null,null,null,null,null,null,null,"=+IMPORTARDATOSDINAMICOS(\" BAS123\";TABLAS!$A$111)","=+IMPORTARDATOSDINAMICOS(\" BAS124\";TABLAS!$A$111)",123,124,{"$f":"+Y225+1","v":123},124,null,null,null,"86703/D + EDAD >=12 Y <=17"]
[null,86593,"Prueba de Sífilis; anticuerpo no treponémico cuantitativa ()",null,null,null,null,null,null,1,{"$f":"+GETPIVOTDATA(\" BAS125\",TABLAS!$A$111)","v":0},{"$f":"+GETPIVOTDATA(\" BAS126\",TABLAS!$A$111)","v":1},null,null,null,null,null,null,null,"=+IMPORTARDATOSDINAMICOS(\" BAS125\";TABLAS!$A$111)","=+IMPORTARDATOSDINAMICOS(\" BAS126\";TABLAS!$A$111)",125,126,125,126,null,null,null,"86780/D + EDAD >=12 Y <=17"]
[null,87342,"Tamizaje de Hepatitis B por Prueba Rápida",null,null,null,null,null,null,738,{"$f":"+GETPIVOTDATA(\" BAS127\",TABLAS!$A$111)","v":159},{"$f":"+GETPIVOTDATA(\" BAS128\",TABLAS!$A$111)","v":579},null,null,null,null,null,null,null,"=+IMPORTARDATOSDINAMICOS(\" BAS127\";TABLAS!$A$111)","=+IMPORTARDATOSDINAMICOS(\" BAS128\";TABLAS!$A$111)",127,128,127,128,null,null,null,"86593/D + EDAD >=12 Y <=17"]
[null,"Z320","Embarazo No Confirmado: toma de pruebas para el descarte de embarazo en caso la adolescente lo requiera. (examen de orina)",null,null,null,null,null,null,348,{"$f":"+GETPIVOTDATA(\" BAS129\",TABLAS!$A$111)","v":119},{"$f":"+GETPIVOTDATA(\" BAS130\",TABLAS!$A$111)","v":229},null,null,null,null,null,null,null,"=+IMPORTARDATOSDINAMICOS(\" BAS129\";TABLAS!$A$111)","=+IMPORTARDATOSDINAMICOS(\" BAS130\";TABLAS!$A$111)",129,130,129,130,null,null,null,"87342/D + EDAD >=12 Y <=17"]
[null,null,null,null,null,null,null,null,null,null,null,null,null,null,null,null,null,null,null,null,null,null,null,null,null,null,null,null,"Z320/D + EDAD >=12 Y <=17"]
[]
[null,"usp_TRAMA_BASE_ADOLESCENTE_2020_RPT_14_MENTAL"]
[null,"SALUD MENTAL",null,null,null,null,null,null,null,null,null,null,"Total","12a - 14a","15a-17a",null,null,null,null,null,null,null,null,null,null,null,null,null,"usp_TRAMA_BASE_ADOLESCENTE_2020_RPT_14_MENTAL"]
[null,96150,"Entrevista de Tamizaje",null,null,null,null,null,null,null,null,null,{"$f":"SUM(N234:O234)","v":72},{"$f":"+GETPIVOTDATA(\" BAS131\",TABLAS!$A$111)","v":42},{"$f":"+GETPIVOTDATA(\" BAS132\",TABLAS!$A$111)","v":30},null,null,null,null,{"$f":"CONCATENATE($U$148,V234,$U$147)","v":"=+IMPORTARDATOSDINAMICOS(\" BAS131\";TABLAS!$A$111)"},{"$f":"CONCATENATE($U$148,W234,$U$147)","v":"=+IMPORTARDATOSDINAMICOS(\" BAS132\";TABLAS!$A$111)"},131,132,{"$f":"+Y229+1","v":131},132,null,null,null,"Total"]
[null,"U100"," Aplicación de Cuestionario de Habilidades Sociales",null,null,null,null,null,null,null,null,null,10,{"$f":"+GETPIVOTDATA(\" BAS133\",TABLAS!$A$111)","v":2},{"$f":"+GETPIVOTDATA(\" BAS134\",TABLAS!$A$111)","v":8},null,null,null,null,"=+IMPORTARDATOSDINAMICOS(\" BAS133\";TABLAS!$A$111)","=+IMPORTARDATOSDINAMICOS(\" BAS134\";TABLAS!$A$111)",133,134,133,134,null,null,null,"96150/D + EDAD >=12 Y <=17"]
[null,"F419"," Trastorno de ansiedad, no Especificado",null,null,null,null,null,null,null,null,null,6,{"$f":"+GETPIVOTDATA(\" BAS135\",TABLAS!$A$111)","v":2},{"$f":"+GETPIVOTDATA(\" BAS136\",TABLAS!$A$111)","v":4},null,null,null,null,"=+IMPORTARDATOSDINAMICOS(\" BAS135\";TABLAS!$A$111)","=+IMPORTARDATOSDINAMICOS(\" BAS136\";TABLAS!$A$111)",135,136,135,136,null,null,null,"U100/D + EDAD >=12 Y <=17"]
[null,"Z553"," Problemas Relacionados con el Bajo Rendimiento Escolar",null,null,null,null,null,null,null,null,null,4,{"$f":"+GETPIVOTDATA(\" BAS137\",TABLAS!$A$111)","v":3},{"$f":"+GETPIVOTDATA(\" BAS138\",TABLAS!$A$111)","v":1},null,null,null,null,"=+IMPORTARDATOSDINAMICOS(\" BAS137\";TABLAS!$A$111)","=+IMPORTARDATOSDINAMICOS(\" BAS138\";TABLAS!$A$111)",137,138,137,138,null,null,null,"F419/D + EDAD >=12 Y <=17"]
[null,"Z7281"," Riesgos de Lesiones o Accidentes",null,null,null,null,null,null,null,null,null,0,{"$f":"+GETPIVOTDATA(\" BAS139\",TABLAS!$A$111)","v":0},{"$f":"+GETPIVOTDATA(\" BAS140\",TABLAS!$A$111)","v":0},null,null,null,null,"=+IMPORTARDATOSDINAMICOS(\" BAS139\";TABLAS!$A$111)","=+IMPORTARDATOSDINAMICOS(\" BAS140\";TABLAS!$A$111)",139,140,139,140,null,null,null,"Z553/D + EDAD >=12 Y <=17"]
[null,96150.01,"Entrevista de Tamizaje",null,96150.01,"Tamizaje de Salud Mental en Violencia",null,null,null,null,null,null,577,{"$f":"+GETPIVOTDATA(\" BAS141\",TABLAS!$A$111)","v":220},{"$f":"+GETPIVOTDATA(\" BAS142\",TABLAS!$A$111)","v":357},null,null,null,null,"=+IMPORTARDATOSDINAMICOS(\" BAS141\";TABLAS!$A$111)","=+IMPORTARDATOSDINAMICOS(\" BAS142\";TABLAS!$A$111)",141,142,141,142,null,null,null,"Z7281/D + EDAD >=12 Y <=17"]
[null,96150.02,null,null,96150.02,"Tamizaje de Salud Mental en Alcohol y Drogas",null,null,null,null,null,null,96,{"$f":"+GETPIVOTDATA(\" BAS143\",TABLAS!$A$111)","v":50},{"$f":"+GETPIVOTDATA(\" BAS144\",TABLAS!$A$111)","v":46},null,null,null,null,"=+IMPORTARDATOSDINAMICOS(\" BAS143\";TABLAS!$A$111)","=+IMPORTARDATOSDINAMICOS(\" BAS144\";TABLAS!$A$111)",143,144,143,144,null,null,null,"96150.01 / D + EDAD >=12 Y <=17"]
[null,96150.03,null,null,96150.03,"Tamizaje de Salud Mental en Trastornos Depresivos",null,null,null,null,null,null,124,{"$f":"+GETPIVOTDATA(\" BAS145\",TABLAS!$A$111)","v":66},{"$f":"+GETPIVOTDATA(\" BAS146\",TABLAS!$A$111)","v":58},null,null,null,null,"=+IMPORTARDATOSDINAMICOS(\" BAS145\";TABLAS!$A$111)","=+IMPORTARDATOSDINAMICOS(\" BAS146\";TABLAS!$A$111)",145,146,145,146,null,null,null,"96150.02 / D + EDAD >=12 Y <=17"]
[null,96150.04,null,null,96150.04,"Tamizaje de Salud Mental en Psicosis",null,null,null,null,null,null,60,{"$f":"+GETPIVOTDATA(\" BAS147\",TABLAS!$A$111)","v":39},{"$f":"+GETPIVOTDATA(\" BAS148\",TABLAS!$A$111)","v":21},null,null,null,null,"=+IMPORTARDATOSDINAMICOS(\" BAS147\";TABLAS!$A$111)","=+IMPORTARDATOSDINAMICOS(\" BAS148\";TABLAS!$A$111)",147,148,147,148,null,null,null,"96150.03 / D + EDAD >=12 Y <=17"]
[null,96150.05,null,null,96150.05,"Tamizaje de Salud Mental en Habilidades Sociales (Aplicación de cuestinario de habilidades sociales)",null,null,null,null,null,null,118,{"$f":"+GETPIVOTDATA(\" BAS149\",TABLAS!$A$111)","v":75},{"$f":"+GETPIVOTDATA(\" BAS150\",TABLAS!$A$111)","v":43},null,null,null,null,"=+IMPORTARDATOSDINAMICOS(\" BAS149\";TABLAS!$A$111)","=+IMPORTARDATOSDINAMICOS(\" BAS150\";TABLAS!$A$111)",149,150,149,150,null,null,null,"96150.04 / D + EDAD >=12 Y <=17"]
[]
[null,"usp_TRAMA_BASE_ADOLESCENTE_2020_RPT_15_TAMIZAJES"]
[null,"TAMIZAJES POSITIVOS ",null,null,null,null,null,null,null,null,null,"Total","12a - 14a","15a-17a",null,null,null,null,null,null,null,null,null,null,null,null,null,null,"usp_TRAMA_BASE_ADOLESCENTE_2020_RPT_15_TAMIZAJES"]
[null,"R456","Problemas relacionados con violencia",null,null,null,null,null,null,null,null,{"$f":"SUM(M247:N247)","v":36},{"$f":"+GETPIVOTDATA(\" BAS151\",TABLAS!$A$111)","v":19},{"$f":"+GETPIVOTDATA(\" BAS152\",TABLAS!$A$111)","v":17},null,null,null,null,null,{"$f":"CONCATENATE($U$148,V247,$U$147)","v":"=+IMPORTARDATOSDINAMICOS(\" BAS151\";TABLAS!$A$111)"},{"$f":"CONCATENATE($U$148,W247,$U$147)","v":"=+IMPORTARDATOSDINAMICOS(\" BAS152\";TABLAS!$A$111)"},151,152,{"$f":"+Y243+1","v":151},152,null,null,null,"Total"]
[null,"Z734 ","Problemas Relacionados con Habilidades Sociales Inadecuadas",null,null,null,null,null,null,null,null,14,{"$f":"+GETPIVOTDATA(\" BAS153\",TABLAS!$A$111)","v":5},{"$f":"+GETPIVOTDATA(\" BAS154\",TABLAS!$A$111)","v":9},null,null,null,null,null,"=+IMPORTARDATOSDINAMICOS(\" BAS153\";TABLAS!$A$111)","=+IMPORTARDATOSDINAMICOS(\" BAS154\";TABLAS!$A$111)",153,154,153,154,null,null,null,"R456/D  + EDAD >=12 Y <=17"]
[null,"Z720","Problemas Relacionados con el Uso de Tabaco",null,null,null,null,null,null,null,null,1,{"$f":"+GETPIVOTDATA(\" BAS155\",TABLAS!$A$111)","v":0},{"$f":"+GETPIVOTDATA(\" BAS156\",TABLAS!$A$111)","v":1},null,null,null,null,null,"=+IMPORTARDATOSDINAMICOS(\" BAS155\";TABLAS!$A$111)","=+IMPORTARDATOSDINAMICOS(\" BAS156\";TABLAS!$A$111)",155,156,155,156,null,null,null,"Z734 /D + EDAD >=12 Y <=17"]
[null,"Z721","Problemas Sociales Relacionados con el Uso de Alcohol",null,null,null,null,null,null,null,null,0,{"$f":"+GETPIVOTDATA(\" BAS157\",TABLAS!$A$111)","v":0},{"$f":"+GETPIVOTDATA(\" BAS158\",TABLAS!$A$111)","v":0},null,null,null,null,null,"=+IMPORTARDATOSDINAMICOS(\" BAS157\";TABLAS!$A$111)","=+IMPORTARDATOSDINAMICOS(\" BAS158\";TABLAS!$A$111)",157,158,157,158,null,null,null,"Z720/D + EDAD >=12 Y <=17"]
[null,"Z722","Problemas Sociales Relacionados con el Uso de drogas",null,null,null,null,null,null,null,null,1,{"$f":"+GETPIVOTDATA(\" BAS159\",TABLAS!$A$111)","v":0},{"$f":"+GETPIVOTDATA(\" BAS160\",TABLAS!$A$111)","v":1},null,null,null,null,null,"=+IMPORTARDATOSDINAMICOS(\" BAS159\";TABLAS!$A$111)","=+IMPORTARDATOSDINAMICOS(\" BAS160\";TABLAS!$A$111)",159,160,159,160,null,null,null,"Z721/D + EDAD >=12 Y <=17"]
[null,"Z726"," Problemas relacionados con el Juego y las apuestas",null,null,null,null,null,null,null,null,0,{"$f":"+GETPIVOTDATA(\" BAS161\",TABLAS!$A$111)","v":0},{"$f":"+GETPIVOTDATA(\" BAS162\",TABLAS!$A$111)","v":0},null,null,null,null,null,"=+IMPORTARDATOSDINAMICOS(\" BAS161\";TABLAS!$A$111)","=+IMPORTARDATOSDINAMICOS(\" BAS162\";TABLAS!$A$111)",161,162,161,162,null,null,null,"Z722/D + EDAD >=12 Y <=17"]
[null,"Z619"," Problemas Relacionados con Experiencia Negativa no Especificada en la Infancia",null,null,null,null,null,null,null,null,0,{"$f":"+GETPIVOTDATA(\" BAS163\",TABLAS!$A$111)","v":0},{"$f":"+GETPIVOTDATA(\" BAS164\",TABLAS!$A$111)","v":0},null,null,null,null,null,"=+IMPORTARDATOSDINAMICOS(\" BAS163\";TABLAS!$A$111)","=+IMPORTARDATOSDINAMICOS(\" BAS164\";TABLAS!$A$111)",163,164,163,164,null,null,null,"Z726/D + EDAD >=12 Y <=17"]
[null,"Z639"," Otros Problemas Relacionados con el Grupo Primario de Apoyo, Inclusive  Circunstancias Familiares (Relaciones Familiares)",null,null,null,null,null,null,null,null,0,{"$f":"+GETPIVOTDATA(\" BAS165\",TABLAS!$A$111)","v":0},{"$f":"+GETPIVOTDATA(\" BAS166\",TABLAS!$A$111)","v":0},null,null,null,null,null,"=+IMPORTARDATOSDINAMICOS(\" BAS165\";TABLAS!$A$111)","=+IMPORTARDATOSDINAMICOS(\" BAS166\";TABLAS!$A$111)",165,166,165,166,null,null,null,"Z619/D + EDAD >=12 Y <=17"]
[]
[null,"usp_TRAMA_BASE_ADOLESCENTE_2020_RPT_16_1_ACTIVIDADES"]
[null,"ACTIVIDADES PREVENTIVAS PROMOCIONALES",null,null,null,null,null,null,null,null,null,"Total","12a - 14a","15a-17a",null,null,null,null,null,null,null,null,null,null,null,null,null,null,"usp_TRAMA_BASE_ADOLESCENTE_2020_RPT_16_1_ACTIVIDADES"]
[null,"C0009","Sesión Educativa",null,null,null,null,null,null,null,null,{"$f":"SUM(M258:N258)","v":333},{"$f":"+GETPIVOTDATA(\" BAS167\",TABLAS!$A$111)","v":80},{"$f":"+GETPIVOTDATA(\" BAS168\",TABLAS!$A$111)","v":253},null,null,null,null,null,{"$f":"CONCATENATE($U$148,V258,$U$147)","v":"=+IMPORTARDATOSDINAMICOS(\" BAS167\";TABLAS!$A$111)"},{"$f":"CONCATENATE($U$148,W258,$U$147)","v":"=+IMPORTARDATOSDINAMICOS(\" BAS168\";TABLAS!$A$111)"},167,168,{"$f":"+Y254+1","v":167},168,null,null,null,"Total"]
[null,"U1258 ","Sesión de entrenamiento en familias fuertes",null,null,null,null,null,null,null,null,0,{"$f":"+GETPIVOTDATA(\" BAS169\",TABLAS!$A$111)","v":0},{"$f":"+GETPIVOTDATA(\" BAS170\",TABLAS!$A$111)","v":0},null,null,null,null,null,"=+IMPORTARDATOSDINAMICOS(\" BAS169\";TABLAS!$A$111)","=+IMPORTARDATOSDINAMICOS(\" BAS170\";TABLAS!$A$111)",169,170,169,170,null,null,null,"C0009 / D + EDAD >=12 Y <=17"]
[null,"C2111.02","Taller en prevención de conducta de riesgo en adolescentes y sus familias - familias fuertes amor y límite",null,null,null,null,null,null,null,null,0,{"$f":"+GETPIVOTDATA(\" BAS171\",TABLAS!$A$111)","v":0},{"$f":"+GETPIVOTDATA(\" BAS172\",TABLAS!$A$111)","v":0},null,null,null,null,null,"=+IMPORTARDATOSDINAMICOS(\" BAS171\";TABLAS!$A$111)","=+IMPORTARDATOSDINAMICOS(\" BAS172\";TABLAS!$A$111)",171,172,171,172,null,null,null,"U1258 / D + EDAD >=12 Y <=17"]
[]
[null,"usp_TRAMA_BASE_ADOLESCENTE_2020_RPT_16_2_ACTIVIDADES"]
[null,"ACTIVIDADES PREVENTIVAS PROMOCIONALES",null,null,null,null,null,"Total",null,null,null,null,null,null,null,null,null,null,null,null,null,null,null,null,null,null,null,null,"usp_TRAMA_BASE_ADOLESCENTE_2020_RPT_16_2_ACTIVIDADES"]
[null,"APP 93   ","Actividad en colegios",null,null,null,null,{"$f":"+GETPIVOTDATA(\" BAS173\",TABLAS!$A$111)","v":252},null,null,null,null,null,null,null,null,null,null,null,{"$f":"CONCATENATE($U$148,V264,$U$147)","v":"=+IMPORTARDATOSDINAMICOS(\" BAS173\";TABLAS!$A$111)"},null,{"$f":"IF(X264<10,CONCATENATE(\"00\",X264),IF(AND(X264<100,X264>9),CONCATENATE(\"0\",X264),X264))","v":173},null,{"$f":"+Y260+1","v":173}]
[null,"APP100","Establecimiento de Salud",null,null,null,null,{"$f":"+GETPIVOTDATA(\" BAS174\",TABLAS!$A$111)","v":620},null,null,null,null,null,null,null,null,null,null,null,"=+IMPORTARDATOSDINAMICOS(\" BAS174\";TABLAS!$A$111)",null,174,null,{"$f":"+X264+1","v":174},null,null,null,null,"APP 93 / D"]
[null,"APP104 ","Municipalidades",null,null,null,null,{"$f":"+GETPIVOTDATA(\" BAS175\",TABLAS!$A$111)","v":146},null,null,null,null,null,null,null,null,null,null,null,"=+IMPORTARDATOSDINAMICOS(\" BAS175\";TABLAS!$A$111)",null,175,null,{"$f":"+X265+1","v":175},null,null,null,null,"APP100 / D"]
[null,"APP 136","Actividades con familia",null,null,null,null,{"$f":"+GETPIVOTDATA(\" BAS176\",TABLAS!$A$111)","v":2025},null,null,null,null,null,null,null,null,null,null,null,"=+IMPORTARDATOSDINAMICOS(\" BAS176\";TABLAS!$A$111)",null,176,null,176,null,null,null,null,"APP104 / D"]
[null,"APP141","Actividades con adolescentes",null,null,null,null,{"$f":"+GETPIVOTDATA(\" BAS177\",TABLAS!$A$111)","v":6},null,null,null,null,null,null,null,null,null,null,null,"=+IMPORTARDATOSDINAMICOS(\" BAS177\";TABLAS!$A$111)",null,177,null,177,null,null,null,null,"APP 136 / D"]
[null,"APP144 ","Actividades con docentes",null,null,null,null,{"$f":"+GETPIVOTDATA(\" BAS178\",TABLAS!$A$111)","v":150},null,null,null,null,null,null,null,null,null,null,null,"=+IMPORTARDATOSDINAMICOS(\" BAS178\";TABLAS!$A$111)",null,178,null,178,null,null,null,null,"APP141 / D"]
[null,"APP145","Actividades con alumnos",null,null,null,null,{"$f":"+GETPIVOTDATA(\" BAS179\",TABLAS!$A$111)","v":0},null,null,null,null,null,null,null,null,null,null,null,"=+IMPORTARDATOSDINAMICOS(\" BAS179\";TABLAS!$A$111)",null,179,null,179,null,null,null,null,"APP144 / D"]
[null,"APP146","Actividades con padres",null,null,null,null,{"$f":"+GETPIVOTDATA(\" BAS180\",TABLAS!$A$111)","v":741},null,null,null,null,null,null,null,null,null,null,null,"=+IMPORTARDATOSDINAMICOS(\" BAS180\";TABLAS!$A$111)",null,180,null,180,null,null,null,null,"APP145 / D"]
[null,"APP150","Actividades con autoridades",null,null,null,null,{"$f":"+GETPIVOTDATA(\" BAS181\",TABLAS!$A$111)","v":53},null,null,null,null,null,null,null,null,null,null,null,"=+IMPORTARDATOSDINAMICOS(\" BAS181\";TABLAS!$A$111)",null,181,null,181,null,null,null,null,"APP146 / D"]
[null,null,null,null,null,null,null,null,null,null,null,null,null,null,null,null,null,null,null,null,null,null,null,null,null,null,null,null,"APP150 / D"]
[null,"usp_TRAMA_BASE_ADOLESCENTE_2020_RPT_16_3_ACTIVIDADES"]
[null,"ACTIVIDADES PREVENTIVAS PROMOCIONALES",null,null,null,null,null,null,"Total",null,null,null,null,null,null,null,null,null,null,null,null,null,null,null,null,null,null,null,"usp_TRAMA_BASE_ADOLESCENTE_2020_RPT_16_3_ACTIVIDADES"]
[null,"C1021"," Organización de Charla para Abogacía y Políticas Públicas",null,null,null,null,null,{"$f":"+GETPIVOTDATA(\" BAS182\",TABLAS!$A$111)","v":0},null,null,null,null,null,null,null,null,null,null,{"$f":"CONCATENATE($U$148,V276,$U$147)","v":"=+IMPORTARDATOSDINAMICOS(\" BAS182\";TABLAS!$A$111)"},null,{"$f":"IF(X276<10,CONCATENATE(\"00\",X276),IF(AND(X276<100,X276>9),CONCATENATE(\"0\",X276),X276))","v":182},null,{"$f":"+X272+1","v":182}]
[null,"C0007 ","Taller para la  familia  ",null,null,null,null,null,{"$f":"+GETPIVOTDATA(\" BAS183\",TABLAS!$A$111)","v":14},null,null,null,null,null,null,null,null,null,null,"=+IMPORTARDATOSDINAMICOS(\" BAS183\";TABLAS!$A$111)",null,183,null,{"$f":"+X276+1","v":183},null,null,null,null,"C1021 / D"]
[null,"C0010","Sesión Demostrativa",null,null,null,null,null,{"$f":"+GETPIVOTDATA(\" BAS184\",TABLAS!$A$111)","v":25315},null,null,null,null,null,null,null,null,null,null,"=+IMPORTARDATOSDINAMICOS(\" BAS184\";TABLAS!$A$111)",null,184,null,{"$f":"+X277+1","v":184},null,null,null,null,"C0007 / D"]
[null,90872,"Taller de habilidades sociales",null,null,null,null,null,{"$f":"+GETPIVOTDATA(\" BAS185\",TABLAS!$A$111)","v":20},null,null,null,null,null,null,null,null,null,null,"=+IMPORTARDATOSDINAMICOS(\" BAS185\";TABLAS!$A$111)",null,185,null,185,null,null,null,null,"C0010 / D"]
[null,"C0008","Taller para personal de salud",null,null,null,null,null,{"$f":"+GETPIVOTDATA(\" BAS186\",TABLAS!$A$111)","v":1},null,null,null,null,null,null,null,null,null,null,"=+IMPORTARDATOSDINAMICOS(\" BAS186\";TABLAS!$A$111)",null,186,null,186,null,null,null,null,"90872 / D"]
[null,"C2121.01","Animación Sociocultural ",null,null,null,null,null,{"$f":"+GETPIVOTDATA(\" BAS187\",TABLAS!$A$111)","v":0},null,null,null,null,null,null,null,null,null,null,"=+IMPORTARDATOSDINAMICOS(\" BAS187\";TABLAS!$A$111)",null,187,null,187,null,null,null,null,"C0008 / D"]
[null,"C2121 ","Teatros Populares ",null,null,null,null,null,{"$f":"+GETPIVOTDATA(\" BAS188\",TABLAS!$A$111)","v":0},null,null,null,null,null,null,null,null,null,null,"=+IMPORTARDATOSDINAMICOS(\" BAS188\";TABLAS!$A$111)",null,188,null,188,null,null,null,null,"C2121.01 / D"]
[null,"C3152","Formación de Educadores de Pares",null,null,null,null,null,{"$f":"+GETPIVOTDATA(\" BAS189\",TABLAS!$A$111)","v":0},null,null,null,null,null,null,null,null,null,null,"=+IMPORTARDATOSDINAMICOS(\" BAS189\";TABLAS!$A$111)",null,189,null,189,null,null,null,null,"C2121  / D"]
[null,"C7001 ","Monitoreo",null,null,null,null,null,{"$f":"+GETPIVOTDATA(\" BAS190\",TABLAS!$A$111)","v":21},null,null,null,null,null,null,null,null,null,null,"=+IMPORTARDATOSDINAMICOS(\" BAS190\";TABLAS!$A$111)",null,190,null,190,null,null,null,null,"C3152 / D"]
[null,"C7002 ","Supervisión",null,null,null,null,null,{"$f":"+GETPIVOTDATA(\" BAS191\",TABLAS!$A$111)","v":31},null,null,null,null,null,null,null,null,null,null,"=+IMPORTARDATOSDINAMICOS(\" BAS191\";TABLAS!$A$111)",null,191,null,191,null,null,null,null,"C7001 / D"]
[null,"C7003 ","Evaluación",null,null,null,null,null,{"$f":"+GETPIVOTDATA(\" BAS192\",TABLAS!$A$111)","v":4},null,null,null,null,null,null,null,null,null,null,"=+IMPORTARDATOSDINAMICOS(\" BAS192\";TABLAS!$A$111)",null,192,null,192,null,null,null,null,"C7002 / D"]
[null,"C7004    ","Asistencia Técnica",null,null,null,null,null,{"$f":"+GETPIVOTDATA(\" BAS193\",TABLAS!$A$111)","v":30},null,null,null,null,null,null,null,null,null,null,"=+IMPORTARDATOSDINAMICOS(\" BAS193\";TABLAS!$A$111)",null,193,null,193,null,null,null,null,"C7003 / D"]
[]
[null,"usp_TRAMA_BASE_ADOLESCENTE_2020_RPT_17_NUTRICIONAL",null,null,null,null,null,null,null,null,null,null,null,null,null,null,null,null,null,null,null,"\";TABLAS!$A$146)"]
[null,"C0009","SESIONES EDUCATIVAS",null,null,null,null,null,null,null,null,null,null,null,null,null,null,null,null,null,null,"=+IMPORTARDATOSDINAMICOS(\" BAS",null,null,null,null,null,null,"usp_TRAMA_BASE_ADOLESCENTE_2020_RPT_17_NUTRICIONAL"]
[null,"PSA","Salud Física Nutricional de 12 a 14 años",null,null,null,null,null,null,null,null,"12a - 14a"]
[null,1," Actividad Física ",null,null,null,null,null,null,null,null,{"$f":"+GETPIVOTDATA(\" BAS001\",TABLAS!$A$146)","v":0},null,null,null,null,null,null,null,{"$f":"CONCATENATE($V$290,V292,$V$289)","v":"=+IMPORTARDATOSDINAMICOS(\" BAS001\";TABLAS!$A$146)"},null,{"$f":"IF(X292<10,CONCATENATE(\"00\",X292),IF(AND(X292<100,X292>9),CONCATENATE(\"0\",X292),X292))","v":"001"},null,1,null,null,null,null,"Total"]
[null,2," Alimentación Saludable",null,null,null,null,null,null,null,null,{"$f":"+GETPIVOTDATA(\" BAS002\",TABLAS!$A$146)","v":0},null,null,null,null,null,null,null,{"$f":"CONCATENATE($V$290,V293,$V$289)","v":"=+IMPORTARDATOSDINAMICOS(\" BAS002\";TABLAS!$A$146)"},null,"002",null,{"$f":"+X292+1","v":2},null,null,null,null,"(C0009 / D + 1° LAB= 1 + 2° LAB = PSA)   (>=12 y <=14)"]
[null,3,"Higiene",null,null,null,null,null,null,null,null,{"$f":"+GETPIVOTDATA(\" BAS003\",TABLAS!$A$146)","v":0},null,null,null,null,null,null,null,"=+IMPORTARDATOSDINAMICOS(\" BAS003\";TABLAS!$A$146)",null,"003",null,3,null,null,null,null,"(C0009 / D + 1° LAB= 2 + 2° LAB = PSA)   (>=12 y <=14)"]
[null,4,"Protección solar",null,null,null,null,null,null,null,null,{"$f":"+GETPIVOTDATA(\" BAS004\",TABLAS!$A$146)","v":0},null,null,null,null,null,null,null,"=+IMPORTARDATOSDINAMICOS(\" BAS004\";TABLAS!$A$146)",null,"004",null,4,null,null,null,null,"(C0009 / D + 1° LAB= 3 + 2° LAB = PSA)   (>=12 y <=14)"]
[null,5,"Salud Bucal ",null,null,null,null,null,null,null,null,{"$f":"+GETPIVOTDATA(\" BAS005\",TABLAS!$A$146)","v":0},null,null,null,null,null,null,null,"=+IMPORTARDATOSDINAMICOS(\" BAS005\";TABLAS!$A$146)",null,"005",null,5,null,null,null,null,"(C0009 / D + 1° LAB= 4 + 2° LAB = PSA)   (>=12 y <=14)"]
[null,6,"Salud ocular",null,null,null,null,null,null,null,null,{"$f":"+GETPIVOTDATA(\" BAS006\",TABLAS!$A$146)","v":0},null,null,null,null,null,null,null,"=+IMPORTARDATOSDINAMICOS(\" BAS006\";TABLAS!$A$146)",null,"006",null,6,null,null,null,null,"(C0009 / D + 1° LAB= 5 + 2° LAB = PSA)   (>=12 y <=14)"]
[null,7,"Cuidado del medio ambiente",null,null,null,null,null,null,null,null,{"$f":"+GETPIVOTDATA(\" BAS007\",TABLAS!$A$146)","v":0},null,null,null,null,null,null,null,"=+IMPORTARDATOSDINAMICOS(\" BAS007\";TABLAS!$A$146)",null,"007",null,7,null,null,null,null,"(C0009 / D + 1° LAB= 6 + 2° LAB = PSA)   (>=12 y <=14)"]
[null,8,"Medidas de seguridad y prevención de accidentes. Primeros auxilios",null,null,null,null,null,null,null,null,{"$f":"+GETPIVOTDATA(\" BAS008\",TABLAS!$A$146)","v":0},null,null,null,null,null,null,null,"=+IMPORTARDATOSDINAMICOS(\" BAS008\";TABLAS!$A$146)",null,"008",null,8,null,null,null,null,"(C0009 / D + 1° LAB= 7 + 2° LAB = PSA)   (>=12 y <=14)"]
[null,9,"Salud respiratoria y tuberculosis: Higiene y salud bucal.",null,null,null,null,null,null,null,null,{"$f":"+GETPIVOTDATA(\" BAS009\",TABLAS!$A$146)","v":0},null,null,null,null,null,null,null,"=+IMPORTARDATOSDINAMICOS(\" BAS009\";TABLAS!$A$146)",null,"009",null,9,null,null,null,null,"(C0009 / D + 1° LAB= 8 + 2° LAB = PSA)   (>=12 y <=14)"]
[null,null,null,null,null,null,null,null,null,null,null,null,null,null,null,null,null,null,null,null,null,null,null,null,null,null,null,null,"(C0009 / D + 1° LAB= 9 + 2° LAB = PSA)   (>=12 y <=14)"]
[null,"usp_TRAMA_BASE_ADOLESCENTE_2020_RPT_18_NUTRICIONAL"]
[null,"PSA","Salud Física Nutricional de 15 a 17 años",null,null,null,null,null,null,null,null,"15a-17a",null,null,null,null,null,null,null,null,null,null,null,null,null,null,null,null,"usp_TRAMA_BASE_ADOLESCENTE_2020_RPT_18_NUTRICIONAL"]
[null,1," Actividad Física y deporte",null,null,null,null,null,null,null,null,{"$f":"+GETPIVOTDATA(\" BAS010\",TABLAS!$A$146)","v":0},null,null,null,null,null,null,null,{"$f":"CONCATENATE($V$290,V304,$V$289)","v":"=+IMPORTARDATOSDINAMICOS(\" BAS010\";TABLAS!$A$146)"},null,{"$f":"IF(X304<10,CONCATENATE(\"00\",X304),IF(AND(X304<100,X304>9),CONCATENATE(\"0\",X304),X304))","v":"010"},null,{"$f":"+X300+1","v":10}]
[null,2,"Alimentación Saludable",null,null,null,null,null,null,null,null,{"$f":"+GETPIVOTDATA(\" BAS011\",TABLAS!$A$146)","v":0},null,null,null,null,null,null,null,"=+IMPORTARDATOSDINAMICOS(\" BAS011\";TABLAS!$A$146)",null,"011",null,{"$f":"+X304+1","v":11},null,null,null,null,"(C0009 / D + 1° LAB= 1 + 2° LAB = PSA)    (>=15 y <=17)"]
[null,3,"Higiene",null,null,null,null,null,null,null,null,{"$f":"+GETPIVOTDATA(\" BAS012\",TABLAS!$A$146)","v":0},null,null,null,null,null,null,null,"=+IMPORTARDATOSDINAMICOS(\" BAS012\";TABLAS!$A$146)",null,"012",null,{"$f":"+X305+1","v":12},null,null,null,null,"(C0009 / D + 1° LAB= 2 + 2° LAB = PSA)    (>=15 y <=17)"]
[null,4,"Prvención de transtornos posturales ",null,null,null,null,null,null,null,null,{"$f":"+GETPIVOTDATA(\" BAS013\",TABLAS!$A$146)","v":0},null,null,null,null,null,null,null,"=+IMPORTARDATOSDINAMICOS(\" BAS013\";TABLAS!$A$146)",null,"013",null,13,null,null,null,null,"(C0009 / D + 1° LAB= 3 + 2° LAB = PSA)    (>=15 y <=17)"]
[null,5,"Protección solar",null,null,null,null,null,null,null,null,{"$f":"+GETPIVOTDATA(\" BAS014\",TABLAS!$A$146)","v":0},null,null,null,null,null,null,null,"=+IMPORTARDATOSDINAMICOS(\" BAS014\";TABLAS!$A$146)",null,"014",null,14,null,null,null,null,"(C0009 / D + 1° LAB= 4 + 2° LAB = PSA)    (>=15 y <=17)"]
[null,6,"Salud Bucal ",null,null,null,null,null,null,null,null,{"$f":"+GETPIVOTDATA(\" BAS015\",TABLAS!$A$146)","v":0},null,null,null,null,null,null,null,"=+IMPORTARDATOSDINAMICOS(\" BAS015\";TABLAS!$A$146)",null,"015",null,15,null,null,null,null,"(C0009 / D + 1° LAB= 5 + 2° LAB = PSA)    (>=15 y <=17)"]
[null,7,"Salud ocular",null,null,null,null,null,null,null,null,{"$f":"+GETPIVOTDATA(\" BAS016\",TABLAS!$A$146)","v":0},null,null,null,null,null,null,null,"=+IMPORTARDATOSDINAMICOS(\" BAS016\";TABLAS!$A$146)",null,"016",null,16,null,null,null,null,"(C0009 / D + 1° LAB= 6 + 2° LAB = PSA)    (>=15 y <=17)"]
[null,8,"Salud respiratoria y tuberculosis: Higiene y salud bucal.",null,null,null,null,null,null,null,null,{"$f":"+GETPIVOTDATA(\" BAS017\",TABLAS!$A$146)","v":0},null,null,null,null,null,null,null,"=+IMPORTARDATOSDINAMICOS(\" BAS017\";TABLAS!$A$146)",null,"017",null,17,null,null,null,null,"(C0009 / D + 1° LAB= 7 + 2° LAB = PSA)    (>=15 y <=17)"]
[null,9,"Cuidado del medio ambiente",null,null,null,null,null,null,null,null,{"$f":"+GETPIVOTDATA(\" BAS018\",TABLAS!$A$146)","v":0},null,null,null,null,null,null,null,"=+IMPORTARDATOSDINAMICOS(\" BAS018\";TABLAS!$A$146)",null,"018",null,18,null,null,null,null,"(C0009 / D + 1° LAB= 8 + 2° LAB = PSA)    (>=15 y <=17)"]
[null,10,"Prevención de enfermedades transmisibles prevalentes: Dengue, malaria, bartonellosis etc.",null,null,null,null,null,null,null,null,{"$f":"+GETPIVOTDATA(\" BAS019\",TABLAS!$A$146)","v":0},null,null,null,null,null,null,null,"=+IMPORTARDATOSDINAMICOS(\" BAS019\";TABLAS!$A$146)",null,"019",null,19,null,null,null,null,"(C0009 / D + 1° LAB= 9 + 2° LAB = PSA)    (>=15 y <=17)"]
[null,11,"Medidas de Seguridad y prevención de accidentes ",null,null,null,null,null,null,null,null,{"$f":"+GETPIVOTDATA(\" BAS020\",TABLAS!$A$146)","v":0},null,null,null,null,null,null,null,"=+IMPORTARDATOSDINAMICOS(\" BAS020\";TABLAS!$A$146)",null,"020",null,20,null,null,null,null,"(C0009 / D + 1° LAB= 10 + 2° LAB = PSA)    (>=15 y <=17)"]
[null,12,"Primeros auxilios. Resucitación cardiopulmonar",null,null,null,null,null,null,null,null,{"$f":"+GETPIVOTDATA(\" BAS021\",TABLAS!$A$146)","v":0},null,null,null,null,null,null,null,"=+IMPORTARDATOSDINAMICOS(\" BAS021\";TABLAS!$A$146)",null,"021",null,21,null,null,null,null,"(C0009 / D + 1° LAB= 11 + 2° LAB = PSA)    (>=15 y <=17)"]
[null,null,null,null,null,null,null,null,null,null,null,null,null,null,null,null,null,null,null,null,null,null,null,null,null,null,null,null,"(C0009 / D + 1° LAB= 12 + 2° LAB = PSA)    (>=15 y <=17)"]
[null,"usp_TRAMA_BASE_ADOLESCENTE_2020_RPT_19_SSR"]
[null,"SSI","Salud Sexual y Reproductiva de 12 a 14 años",null,null,null,null,null,null,null,null,"12a - 14a",null,null,null,null,null,null,null,null,null,null,null,null,null,null,null,null,"usp_TRAMA_BASE_ADOLESCENTE_2020_RPT_19_SSR"]
[null,1,"Derechos Sexuales y Reproductivos",null,null,null,null,null,null,null,null,{"$f":"+GETPIVOTDATA(\" BAS022\",TABLAS!$A$146)","v":0},null,null,null,null,null,null,null,{"$f":"CONCATENATE($V$290,V319,$V$289)","v":"=+IMPORTARDATOSDINAMICOS(\" BAS022\";TABLAS!$A$146)"},null,{"$f":"IF(X319<10,CONCATENATE(\"00\",X319),IF(AND(X319<100,X319>9),CONCATENATE(\"0\",X319),X319))","v":"022"},null,{"$f":"+X315+1","v":22}]
[null,2,"Sexualidad humana y afectividad",null,null,null,null,null,null,null,null,{"$f":"+GETPIVOTDATA(\" BAS023\",TABLAS!$A$146)","v":0},null,null,null,null,null,null,null,"=+IMPORTARDATOSDINAMICOS(\" BAS023\";TABLAS!$A$146)",null,"023",null,{"$f":"+X319+1","v":23},null,null,null,null,"(C0009 / D + 1° LAB= 1 + 2° LAB = SSI)    (>=12 y <=14)"]
[null,3,"Desarrollo sexual en la adolescencia ",null,null,null,null,null,null,null,null,{"$f":"+GETPIVOTDATA(\" BAS024\",TABLAS!$A$146)","v":0},null,null,null,null,null,null,null,"=+IMPORTARDATOSDINAMICOS(\" BAS024\";TABLAS!$A$146)",null,"024",null,{"$f":"+X320+1","v":24},null,null,null,null,"(C0009 / D + 1° LAB= 2 + 2° LAB = SSI)    (>=12 y <=14)"]
[null,4,"Prevención del embarazo no deseado, ITS y VIH-SIDA",null,null,null,null,null,null,null,null,{"$f":"+GETPIVOTDATA(\" BAS025\",TABLAS!$A$146)","v":0},null,null,null,null,null,null,null,"=+IMPORTARDATOSDINAMICOS(\" BAS025\";TABLAS!$A$146)",null,"025",null,{"$f":"+X321+1","v":25},null,null,null,null,"(C0009 / D + 1° LAB= 3 + 2° LAB = SSI)    (>=12 y <=14)"]
[null,5,"Diversidad sexual e identidad de género",null,null,null,null,null,null,null,null,{"$f":"+GETPIVOTDATA(\" BAS026\",TABLAS!$A$146)","v":0},null,null,null,null,null,null,null,"=+IMPORTARDATOSDINAMICOS(\" BAS026\";TABLAS!$A$146)",null,"026",null,{"$f":"+X322+1","v":26},null,null,null,null,"(C0009 / D + 1° LAB= 4 + 2° LAB = SSI)    (>=12 y <=14)"]
[null,null,null,null,null,null,null,null,null,null,null,null,null,null,null,null,null,null,null,null,null,null,null,null,null,null,null,null,"(C0009 / D + 1° LAB= 5 + 2° LAB = SSI)    (>=12 y <=14)"]
[null,"usp_TRAMA_BASE_ADOLESCENTE_2020_RPT_20_SSR"]
[null,"SSI","Salud Sexual y Reproductiva de 15 a 17 años",null,null,null,null,null,null,null,null,"15a-17a",null,null,null,null,null,null,null,null,null,null,null,null,null,null,null,null,"usp_TRAMA_BASE_ADOLESCENTE_2020_RPT_20_SSR"]
[null,1,"Derechos Sexuales y Reproductivos",null,null,null,null,null,null,null,null,{"$f":"+GETPIVOTDATA(\" BAS027\",TABLAS!$A$146)","v":0},null,null,null,null,null,null,null,{"$f":"CONCATENATE($V$290,V327,$V$289)","v":"=+IMPORTARDATOSDINAMICOS(\" BAS027\";TABLAS!$A$146)"},null,{"$f":"IF(X327<10,CONCATENATE(\"00\",X327),IF(AND(X327<100,X327>9),CONCATENATE(\"0\",X327),X327))","v":"027"},null,{"$f":"+X323+1","v":27}]
[null,2,"Sexualidad humana y afectividad",null,null,null,null,null,null,null,null,{"$f":"+GETPIVOTDATA(\" BAS028\",TABLAS!$A$146)","v":0},null,null,null,null,null,null,null,"=+IMPORTARDATOSDINAMICOS(\" BAS028\";TABLAS!$A$146)",null,"028",null,{"$f":"+X327+1","v":28},null,null,null,null,"(C0009 / D + 1° LAB= 1 + 2° LAB = SSI)     (>=15 y <=17)"]
[null,3,"Anticoncepción y paternidad saludable",null,null,null,null,null,null,null,null,{"$f":"+GETPIVOTDATA(\" BAS029\",TABLAS!$A$146)","v":0},null,null,null,null,null,null,null,"=+IMPORTARDATOSDINAMICOS(\" BAS029\";TABLAS!$A$146)",null,"029",null,29,null,null,null,null,"(C0009 / D + 1° LAB= 2 + 2° LAB = SSI)     (>=15 y <=17)"]
[null,4,"Prevención del embarazo no deseado,",null,null,null,null,null,null,null,null,{"$f":"+GETPIVOTDATA(\" BAS030\",TABLAS!$A$146)","v":0},null,null,null,null,null,null,null,"=+IMPORTARDATOSDINAMICOS(\" BAS030\";TABLAS!$A$146)",null,"030",null,30,null,null,null,null,"(C0009 / D + 1° LAB= 3 + 2° LAB = SSI)     (>=15 y <=17)"]
[null,5,"Relaciones sexuales, sexo seguro",null,null,null,null,null,null,null,null,{"$f":"+GETPIVOTDATA(\" BAS031\",TABLAS!$A$146)","v":0},null,null,null,null,null,null,null,"=+IMPORTARDATOSDINAMICOS(\" BAS031\";TABLAS!$A$146)",null,"031",null,31,null,null,null,null,"(C0009 / D + 1° LAB= 4 + 2° LAB = SSI)     (>=15 y <=17)"]
[null,6,"Infecciones de transmisión sexual, VIH-SIDA, Hepatitis B",null,null,null,null,null,null,null,null,{"$f":"+GETPIVOTDATA(\" BAS032\",TABLAS!$A$146)","v":0},null,null,null,null,null,null,null,"=+IMPORTARDATOSDINAMICOS(\" BAS032\";TABLAS!$A$146)",null,"032",null,32,null,null,null,null,"(C0009 / D + 1° LAB= 5 + 2° LAB = SSI)     (>=15 y <=17)"]
[null,7,"Diversidad sexual e identidad de género",null,null,null,null,null,null,null,null,{"$f":"+GETPIVOTDATA(\" BAS033\",TABLAS!$A$146)","v":0},null,null,null,null,null,null,null,"=+IMPORTARDATOSDINAMICOS(\" BAS033\";TABLAS!$A$146)",null,"033",null,33,null,null,null,null,"(C0009 / D + 1° LAB= 6 + 2° LAB = SSI)     (>=15 y <=17)"]
[]
[null,"usp_TRAMA_BASE_ADOLESCENTE_2020_RPT_21_PSICOSOCIAL"]
[null,"PSI","Salud Psicosocial de 12 a 14 años",null,null,null,null,null,null,null,null,"12a - 14a",null,null,null,null,null,null,null,null,null,null,null,null,null,null,null,null,"usp_TRAMA_BASE_ADOLESCENTE_2020_RPT_21_PSICOSOCIAL"]
[null,1,"Habilidades para la vida (autoestima, asertividad, toma de decisiones, comunicación); cognitivas y de control de emociones.",null,null,null,null,null,null,null,null,{"$f":"+GETPIVOTDATA(\" BAS034\",TABLAS!$A$146)","v":0},null,null,null,null,null,null,null,{"$f":"CONCATENATE($V$290,V337,$V$289)","v":"=+IMPORTARDATOSDINAMICOS(\" BAS034\";TABLAS!$A$146)"},null,{"$f":"IF(X337<10,CONCATENATE(\"00\",X337),IF(AND(X337<100,X337>9),CONCATENATE(\"0\",X337),X337))","v":"034"},null,{"$f":"+X333+1","v":34}]
[null,2,"Proyecto de vida",null,null,null,null,null,null,null,null,{"$f":"+GETPIVOTDATA(\" BAS035\",TABLAS!$A$146)","v":0},null,null,null,null,null,null,null,"=+IMPORTARDATOSDINAMICOS(\" BAS035\";TABLAS!$A$146)",null,"035",null,{"$f":"+X337+1","v":35},null,null,null,null,"(C0009 / D + 1° LAB= 1 + 2° LAB = PSI)   (>=12 y <=14)"]
[null,3,"Resilencia",null,null,null,null,null,null,null,null,{"$f":"+GETPIVOTDATA(\" BAS036\",TABLAS!$A$146)","v":0},null,null,null,null,null,null,null,"=+IMPORTARDATOSDINAMICOS(\" BAS036\";TABLAS!$A$146)",null,"036",null,{"$f":"+X338+1","v":36},null,null,null,null,"(C0009 / D + 1° LAB= 2 + 2° LAB = PSI)   (>=12 y <=14)"]
[null,4,"Rol del adolescente en la familia (derechos y responsabilidades)",null,null,null,null,null,null,null,null,{"$f":"+GETPIVOTDATA(\" BAS037\",TABLAS!$A$146)","v":0},null,null,null,null,null,null,null,"=+IMPORTARDATOSDINAMICOS(\" BAS037\";TABLAS!$A$146)",null,"037",null,37,null,null,null,null,"(C0009 / D + 1° LAB= 3 + 2° LAB = PSI)   (>=12 y <=14)"]
[null,5,"Derechos y responsabilidades en salud",null,null,null,null,null,null,null,null,{"$f":"+GETPIVOTDATA(\" BAS038\",TABLAS!$A$146)","v":0},null,null,null,null,null,null,null,"=+IMPORTARDATOSDINAMICOS(\" BAS038\";TABLAS!$A$146)",null,"038",null,38,null,null,null,null,"(C0009 / D + 1° LAB= 4 + 2° LAB = PSI)   (>=12 y <=14)"]
[null,6,"Equidad de género e interculturalidad",null,null,null,null,null,null,null,null,{"$f":"+GETPIVOTDATA(\" BAS039\",TABLAS!$A$146)","v":0},null,null,null,null,null,null,null,"=+IMPORTARDATOSDINAMICOS(\" BAS039\";TABLAS!$A$146)",null,"039",null,39,null,null,null,null,"(C0009 / D + 1° LAB= 5 + 2° LAB = PSI)   (>=12 y <=14)"]
[null,7,"Prevención de la Violencia Familiar (maltrato físico, psicológico, por negligencia), castigo físico y humillante, violencia sexual, violencia por explotación sexual y trata de personas, social (pandillaje, delincuencia, bullying).",null,null,null,null,null,null,null,null,{"$f":"+GETPIVOTDATA(\" BAS040\",TABLAS!$A$146)","v":0},null,null,null,null,null,null,null,"=+IMPORTARDATOSDINAMICOS(\" BAS040\";TABLAS!$A$146)",null,"040",null,40,null,null,null,null,"(C0009 / D + 1° LAB= 6 + 2° LAB = PSI)   (>=12 y <=14)"]
[null,8,"Identificación de Signos de Alarma de: depresión, intento de suicidio, ansiedad, adicciones, trastornos de conducta alimentaria (anorexia, bulimia).",null,null,null,null,null,null,null,null,{"$f":"+GETPIVOTDATA(\" BAS041\",TABLAS!$A$146)","v":0},null,null,null,null,null,null,null,"=+IMPORTARDATOSDINAMICOS(\" BAS041\";TABLAS!$A$146)",null,"041",null,41,null,null,null,null,"(C0009 / D + 1° LAB= 7 + 2° LAB = PSI)   (>=12 y <=14)"]
[null,9," Prevención de consumo de tabaco, alcohol, drogas ilícitas y nuevas adicciones (ludopatías, dependencia de las redes sociales, adicción tecnológica).",null,null,null,null,null,null,null,null,{"$f":"+GETPIVOTDATA(\" BAS042\",TABLAS!$A$146)","v":0},null,null,null,null,null,null,null,"=+IMPORTARDATOSDINAMICOS(\" BAS042\";TABLAS!$A$146)",null,"042",null,42,null,null,null,null,"(C0009 / D + 1° LAB= 8 + 2° LAB = PSI)   (>=12 y <=14)"]
[null,10,"Masculinidad",null,null,null,null,null,null,null,null,{"$f":"+GETPIVOTDATA(\" BAS043\",TABLAS!$A$146)","v":0},null,null,null,null,null,null,null,"=+IMPORTARDATOSDINAMICOS(\" BAS043\";TABLAS!$A$146)",null,"043",null,43,null,null,null,null,"(C0009 / D + 1° LAB= 9 + 2° LAB = PSI)   (>=12 y <=14)"]
[null,null,null,null,null,null,null,null,null,null,null,null,null,null,null,null,null,null,null,null,null,null,null,null,null,null,null,null,"(C0009 / D + 1° LAB= 10 + 2° LAB = PSI)   (>=12 y <=14)"]
[null,"usp_TRAMA_BASE_ADOLESCENTE_2020_RPT_22_PSICOSOCIAL"]
[null,"PSI","Salud Psicosocial de 15 a 17 años",null,null,null,null,null,null,null,null,"15a-17a",null,null,null,null,null,null,null,null,null,null,null,null,null,null,null,null,"usp_TRAMA_BASE_ADOLESCENTE_2020_RPT_22_PSICOSOCIAL"]
[null,1,"Habilidades para la vida (autoestima, asertividad, toma de decisiones, comunicación); cognitivas y de control de emociones.",null,null,null,null,null,null,null,null,{"$f":"+GETPIVOTDATA(\" BAS044\",TABLAS!$A$146)","v":0},null,null,null,null,null,null,null,{"$f":"CONCATENATE($V$290,V350,$V$289)","v":"=+IMPORTARDATOSDINAMICOS(\" BAS044\";TABLAS!$A$146)"},null,{"$f":"IF(X350<10,CONCATENATE(\"00\",X350),IF(AND(X350<100,X350>9),CONCATENATE(\"0\",X350),X350))","v":"044"},null,{"$f":"+X346+1","v":44}]
[null,2,"Resilencia",null,null,null,null,null,null,null,null,{"$f":"+GETPIVOTDATA(\" BAS045\",TABLAS!$A$146)","v":0},null,null,null,null,null,null,null,"=+IMPORTARDATOSDINAMICOS(\" BAS045\";TABLAS!$A$146)",null,"045",null,{"$f":"+X350+1","v":45},null,null,null,null,"(C0009 / D + 1° LAB= 1 + 2° LAB = PSI)  (>=15 y <=17)"]
[null,3,"Proyecto de vida y orientación vocacional",null,null,null,null,null,null,null,null,{"$f":"+GETPIVOTDATA(\" BAS046\",TABLAS!$A$146)","v":0},null,null,null,null,null,null,null,"=+IMPORTARDATOSDINAMICOS(\" BAS046\";TABLAS!$A$146)",null,"046",null,{"$f":"+X351+1","v":46},null,null,null,null,"(C0009 / D + 1° LAB= 2 + 2° LAB = PSI)  (>=15 y <=17)"]
[null,4,"Derechos y responsabilidades en salud",null,null,null,null,null,null,null,null,{"$f":"+GETPIVOTDATA(\" BAS047\",TABLAS!$A$146)","v":0},null,null,null,null,null,null,null,"=+IMPORTARDATOSDINAMICOS(\" BAS047\";TABLAS!$A$146)",null,"047",null,47,null,null,null,null,"(C0009 / D + 1° LAB= 3 + 2° LAB = PSI)  (>=15 y <=17)"]
[null,5,"Equidad de género e interculturalidad",null,null,null,null,null,null,null,null,{"$f":"+GETPIVOTDATA(\" BAS048\",TABLAS!$A$146)","v":0},null,null,null,null,null,null,null,"=+IMPORTARDATOSDINAMICOS(\" BAS048\";TABLAS!$A$146)",null,"048",null,48,null,null,null,null,"(C0009 / D + 1° LAB= 4 + 2° LAB = PSI)  (>=15 y <=17)"]
[null,6,"Empoderamiento. liderazgo. Participación ciudadana",null,null,null,null,null,null,null,null,{"$f":"+GETPIVOTDATA(\" BAS049\",TABLAS!$A$146)","v":0},null,null,null,null,null,null,null,"=+IMPORTARDATOSDINAMICOS(\" BAS049\";TABLAS!$A$146)",null,"049",null,49,null,null,null,null,"(C0009 / D + 1° LAB= 5 + 2° LAB = PSI)  (>=15 y <=17)"]
[null,7,"Viviendo en familia: Relaciones intergeneracionales, mejorando la comunicación",null,null,null,null,null,null,null,null,{"$f":"+GETPIVOTDATA(\" BAS050\",TABLAS!$A$146)","v":0},null,null,null,null,null,null,null,"=+IMPORTARDATOSDINAMICOS(\" BAS050\";TABLAS!$A$146)",null,"050",null,50,null,null,null,null,"(C0009 / D + 1° LAB= 6 + 2° LAB = PSI)  (>=15 y <=17)"]
[null,8,"Prevención de la Violencia Familiar (maltrato físico, psicológico, por negligencia), castigo físico y humillante, violencia sexual, violencia por explotación sexual y trata de personas, social (pandillaje, delincuencia, bullying).",null,null,null,null,null,null,null,null,{"$f":"+GETPIVOTDATA(\" BAS051\",TABLAS!$A$146)","v":0},null,null,null,null,null,null,null,"=+IMPORTARDATOSDINAMICOS(\" BAS051\";TABLAS!$A$146)",null,"051",null,51,null,null,null,null,"(C0009 / D + 1° LAB= 7 + 2° LAB = PSI)  (>=15 y <=17)"]
[null,9,"Identificación de Signos de Alarma de: depresión, intento de suicidio, ansiedad, adicciones, trastornos de conducta alimentaria (anorexia, bulimia).",null,null,null,null,null,null,null,null,{"$f":"+GETPIVOTDATA(\" BAS052\",TABLAS!$A$146)","v":0},null,null,null,null,null,null,null,"=+IMPORTARDATOSDINAMICOS(\" BAS052\";TABLAS!$A$146)",null,"052",null,52,null,null,null,null,"(C0009 / D + 1° LAB= 8 + 2° LAB = PSI)  (>=15 y <=17)"]
[null,10," Prevención de consumo de tabaco, alcohol, drogas ilícitas y nuevas adicciones (ludopatías, dependencia de las redes sociales, adicción tecnológica).",null,null,null,null,null,null,null,null,{"$f":"+GETPIVOTDATA(\" BAS053\",TABLAS!$A$146)","v":0},null,null,null,null,null,null,null,"=+IMPORTARDATOSDINAMICOS(\" BAS053\";TABLAS!$A$146)",null,"053",null,53,null,null,null,null,"(C0009 / D + 1° LAB= 9 + 2° LAB = PSI)  (>=15 y <=17)"]
[null,11,"Medios de Comunicación y sus Riesgos.",null,null,null,null,null,null,null,null,{"$f":"+GETPIVOTDATA(\" BAS054\",TABLAS!$A$146)","v":0},null,null,null,null,null,null,null,"=+IMPORTARDATOSDINAMICOS(\" BAS054\";TABLAS!$A$146)",null,"054",null,54,null,null,null,null,"(C0009 / D + 1° LAB= 10 + 2° LAB = PSI)  (>=15 y <=17)"]
[null,12,"Masculinidad",null,null,null,null,null,null,null,null,{"$f":"+GETPIVOTDATA(\" BAS055\",TABLAS!$A$146)","v":0},null,null,null,null,null,null,null,"=+IMPORTARDATOSDINAMICOS(\" BAS055\";TABLAS!$A$146)",null,"055",null,55,null,null,null,null,"(C0009 / D + 1° LAB= 11 + 2° LAB = PSI)  (>=15 y <=17)"]
[]
[null,"usp_TRAMA_BASE_ADOLESCENTE_2020_RPT_23_COVID19"]
[null,"COVID - 19",null,null,null,null,null,null,null,"Total","12a - 14a","15a-17a",null,null,null,null,null,null,null,null,null,null,null,null,null,null,null,null,"usp_TRAMA_BASE_ADOLESCENTE_2020_RPT_23_COVID19"]
[null,87635,"Prueba Molecular PCR",null,null,null,null,null,null,{"$f":"SUM(K365:L365)","v":0},{"$f":"+GETPIVOTDATA(\" BAS056\",TABLAS!$A$146)","v":0},{"$f":"+GETPIVOTDATA(\" BAS057\",TABLAS!$A$146)","v":0},null,null,null,null,null,null,null,{"$f":"CONCATENATE($V$290,V365,$V$289)","v":"=+IMPORTARDATOSDINAMICOS(\" BAS056\";TABLAS!$A$146)"},"=+IMPORTARDATOSDINAMICOS(\" BAS057\";TABLAS!$A$146)",{"$f":"IF(X365<10,CONCATENATE(\"00\",X365),IF(AND(X365<100,X365>9),CONCATENATE(\"0\",X365),X365))","v":"056"},"057",{"$f":"+X361+1","v":56},{"$f":"+X365+1","v":57},null,null,null,"Total"]
[null,87635.01,"Prueba Rápida Serológica",null,null,null,null,null,null,{"$f":"SUM(K366:L366)","v":0},{"$f":"+GETPIVOTDATA(\" BAS058\",TABLAS!$A$146)","v":0},{"$f":"+GETPIVOTDATA(\" BAS059\",TABLAS!$A$146)","v":0},null,null,null,null,null,null,null,"=+IMPORTARDATOSDINAMICOS(\" BAS058\";TABLAS!$A$146)","=+IMPORTARDATOSDINAMICOS(\" BAS059\";TABLAS!$A$146)","058","059",{"$f":"+Y365+1","v":58},59,null,null,null,"87635 /D + EDAD >=12 Y <=17"]
[null,"U07.1","Virus identificado",null,null,null,null,null,null,0,{"$f":"+GETPIVOTDATA(\" BAS060\",TABLAS!$A$146)","v":0},{"$f":"+GETPIVOTDATA(\" BAS061\",TABLAS!$A$146)","v":0},null,null,null,null,null,null,null,"=+IMPORTARDATOSDINAMICOS(\" BAS060\";TABLAS!$A$146)","=+IMPORTARDATOSDINAMICOS(\" BAS061\";TABLAS!$A$146)","060","061",60,61,null,null,null,"87635.01 /D + EDAD >=12 Y <=17"]
[null,"U07.2","Virus no identificado",null,null,null,null,null,null,0,{"$f":"+GETPIVOTDATA(\" BAS062\",TABLAS!$A$146)","v":0},{"$f":"+GETPIVOTDATA(\" BAS063\",TABLAS!$A$146)","v":0},null,null,null,null,null,null,null,"=+IMPORTARDATOSDINAMICOS(\" BAS062\";TABLAS!$A$146)","=+IMPORTARDATOSDINAMICOS(\" BAS063\";TABLAS!$A$146)","062","063",62,63,null,null,null,"U07.1 /D + EDAD >=12 Y <=17"]
[null,"R05    ","Tos",null,null,null,null,null,null,7,{"$f":"+GETPIVOTDATA(\" BAS064\",TABLAS!$A$146)","v":3},{"$f":"+GETPIVOTDATA(\" BAS065\",TABLAS!$A$146)","v":4},null,null,null,null,null,null,null,"=+IMPORTARDATOSDINAMICOS(\" BAS064\";TABLAS!$A$146)","=+IMPORTARDATOSDINAMICOS(\" BAS065\";TABLAS!$A$146)","064","065",64,65,null,null,null,"U07.2  /D + EDAD >=12 Y <=17"]
[null,"R06.0  ","Falta de aire / Disnea",null,null,null,null,null,null,0,{"$f":"+GETPIVOTDATA(\" BAS066\",TABLAS!$A$146)","v":0},{"$f":"+GETPIVOTDATA(\" BAS067\",TABLAS!$A$146)","v":0},null,null,null,null,null,null,null,"=+IMPORTARDATOSDINAMICOS(\" BAS066\";TABLAS!$A$146)","=+IMPORTARDATOSDINAMICOS(\" BAS067\";TABLAS!$A$146)","066","067",66,67,null,null,null,"R05 /D + EDAD >=12 Y <=17"]
[null,"    R07.0    ","Dolor de garganta",null,null,null,null,null,null,2,{"$f":"+GETPIVOTDATA(\" BAS068\",TABLAS!$A$146)","v":2},{"$f":"+GETPIVOTDATA(\" BAS069\",TABLAS!$A$146)","v":0},null,null,null,null,null,null,null,"=+IMPORTARDATOSDINAMICOS(\" BAS068\";TABLAS!$A$146)","=+IMPORTARDATOSDINAMICOS(\" BAS069\";TABLAS!$A$146)","068","069",68,69,null,null,null,"R06.0  /D + EDAD >=12 Y <=17"]
[null,"R50. 9  ","Fiebre, no especificada",null,null,null,null,null,null,6,{"$f":"+GETPIVOTDATA(\" BAS070\",TABLAS!$A$146)","v":4},{"$f":"+GETPIVOTDATA(\" BAS071\",TABLAS!$A$146)","v":2},null,null,null,null,null,null,null,"=+IMPORTARDATOSDINAMICOS(\" BAS070\";TABLAS!$A$146)","=+IMPORTARDATOSDINAMICOS(\" BAS071\";TABLAS!$A$146)","070","071",70,71,null,null,null,"R07.0 /D + EDAD >=12 Y <=17"]
[null,"Z20.8 ","Contacto con y exposición a otras enfermedades transmisibles",null,null,null,null,null,null,0,{"$f":"+GETPIVOTDATA(\" BAS072\",TABLAS!$A$146)","v":0},{"$f":"+GETPIVOTDATA(\" BAS073\",TABLAS!$A$146)","v":0},null,null,null,null,null,null,null,"=+IMPORTARDATOSDINAMICOS(\" BAS072\";TABLAS!$A$146)","=+IMPORTARDATOSDINAMICOS(\" BAS073\";TABLAS!$A$146)","072","073",72,73,null,null,null,"R50. 9  /D + EDAD >=12 Y <=17"]
[null,"Z03.8","Observación de otras enfermedades y afecciones sospechosas.",null,null,null,null,null,null,0,{"$f":"+GETPIVOTDATA(\" BAS074\",TABLAS!$A$146)","v":0},{"$f":"+GETPIVOTDATA(\" BAS075\",TABLAS!$A$146)","v":0},null,null,null,null,null,null,null,"=+IMPORTARDATOSDINAMICOS(\" BAS074\";TABLAS!$A$146)","=+IMPORTARDATOSDINAMICOS(\" BAS075\";TABLAS!$A$146)","074","075",74,75,null,null,null,"Z20.8 /D + EDAD >=12 Y <=17"]
[]
[null,"usp_TRAMA_BASE_ADOLESCENTE_2020_RPT_24_SEGUIMIENTO"]
[null,"Seguimiento de COVID -19 o cualquier otra Actividad o Enfermedad",null,null,null,null,null,null,null,"Total","12a - 14a","15a-17a",null,null,null,null,null,null,null,null,null,null,null,null,null,null,null,null,"usp_TRAMA_BASE_ADOLESCENTE_2020_RPT_24_SEGUIMIENTO"]
[null,98967,"Seguimiento telefónico",null,null,null,null,null,null,{"$f":"SUM(K378:L378)","v":75},{"$f":"+GETPIVOTDATA(\" BAS076\",TABLAS!$A$146)","v":19},{"$f":"+GETPIVOTDATA(\" BAS077\",TABLAS!$A$146)","v":56},null,null,null,null,null,null,null,{"$f":"CONCATENATE($V$290,V378,$V$289)","v":"=+IMPORTARDATOSDINAMICOS(\" BAS076\";TABLAS!$A$146)"},"=+IMPORTARDATOSDINAMICOS(\" BAS077\";TABLAS!$A$146)",{"$f":"IF(X378<10,CONCATENATE(\"00\",X378),IF(AND(X378<100,X378>9),CONCATENATE(\"0\",X378),X378))","v":"076"},"077",{"$f":"+Y374+1","v":76},77,null,null,null,"Total"]
[null,"C0011  ","Visita integral familiar",null,null,null,null,null,null,769,{"$f":"+GETPIVOTDATA(\" BAS078\",TABLAS!$A$146)","v":223},{"$f":"+GETPIVOTDATA(\" BAS079\",TABLAS!$A$146)","v":546},null,null,null,null,null,null,null,"=+IMPORTARDATOSDINAMICOS(\" BAS078\";TABLAS!$A$146)","=+IMPORTARDATOSDINAMICOS(\" BAS079\";TABLAS!$A$146)","078","079",78,79,null,null,null,"98967 /D + EDAD >=12 Y <=17"]
[null,99499.08," Teleorientación síncrona",null,null,null,null,null,null,1,{"$f":"+GETPIVOTDATA(\" BAS080\",TABLAS!$A$146)","v":0},{"$f":"+GETPIVOTDATA(\" BAS081\",TABLAS!$A$146)","v":1},null,null,null,null,null,null,null,"=+IMPORTARDATOSDINAMICOS(\" BAS080\";TABLAS!$A$146)","=+IMPORTARDATOSDINAMICOS(\" BAS081\";TABLAS!$A$146)","080","081",80,81,null,null,null,"C0011   /D + EDAD >=12 Y <=17"]
[null,99499.09," Teleorientación asíncrona",null,null,null,null,null,null,8,{"$f":"+GETPIVOTDATA(\" BAS082\",TABLAS!$A$146)","v":6},{"$f":"+GETPIVOTDATA(\" BAS083\",TABLAS!$A$146)","v":2},null,null,null,null,null,null,null,"=+IMPORTARDATOSDINAMICOS(\" BAS082\";TABLAS!$A$146)","=+IMPORTARDATOSDINAMICOS(\" BAS083\";TABLAS!$A$146)","082","083",82,83,null,null,null,"99499.08 /D + EDAD >=12 Y <=17"]
[null,"99499.10"," Telemonitoreo",null,null,null,null,null,null,256,{"$f":"+GETPIVOTDATA(\" BAS084\",TABLAS!$A$146)","v":101},{"$f":"+GETPIVOTDATA(\" BAS085\",TABLAS!$A$146)","v":155},null,null,null,null,null,null,null,"=+IMPORTARDATOSDINAMICOS(\" BAS084\";TABLAS!$A$146)","=+IMPORTARDATOSDINAMICOS(\" BAS085\";TABLAS!$A$146)","084","085",84,85,null,null,null,"99499.09 /D + EDAD >=12 Y <=17"]
[null,99499.11,"Teleinterconsulta síncrona ",null,null,null,null,null,null,2,{"$f":"+GETPIVOTDATA(\" BAS086\",TABLAS!$A$146)","v":2},{"$f":"+GETPIVOTDATA(\" BAS087\",TABLAS!$A$146)","v":0},null,null,null,null,null,null,null,"=+IMPORTARDATOSDINAMICOS(\" BAS086\";TABLAS!$A$146)","=+IMPORTARDATOSDINAMICOS(\" BAS087\";TABLAS!$A$146)","086","087",86,87,null,null,null,"99499.10 /D + EDAD >=12 Y <=17"]
[null,"99499.01","Teleconsulta en línea ",null,null,null,null,null,null,9,{"$f":"+GETPIVOTDATA(\" BAS088\",TABLAS!$A$146)","v":4},{"$f":"+GETPIVOTDATA(\" BAS089\",TABLAS!$A$146)","v":5},null,null,null,null,null,null,null,"=+IMPORTARDATOSDINAMICOS(\" BAS088\";TABLAS!$A$146)","=+IMPORTARDATOSDINAMICOS(\" BAS089\";TABLAS!$A$146)","088","089",88,89,null,null,null,"99499.11 /D + EDAD >=12 Y <=17"]
[null,null,null,null,null,null,null,null,null,null,null,null,null,null,null,null,null,null,null,null,null,null,null,null,null,null,null,null,"99499.01 / D+ EDAD >=12 Y <=17"]
[null,"usp_TRAMA_BASE_ADOLESCENTE_2020_RPT_25_ALTERNATIVA"]
[null,"Códigos para la atención en Medicina Alternativa y Complementaria",null,null,null,null,null,null,null,"Total","12a - 14a","15a-17a",null,null,null,null,null,null,null,null,null,null,null,null,null,null,null,null,"usp_TRAMA_BASE_ADOLESCENTE_2020_RPT_25_ALTERNATIVA"]
[null,"U0080"," Actividades de medicina alternativa y complementaria",null,null,null,null,null,null,{"$f":"SUM(K388:L388)","v":0},{"$f":"+GETPIVOTDATA(\" BAS090\",TABLAS!$A$146)","v":0},{"$f":"+GETPIVOTDATA(\" BAS091\",TABLAS!$A$146)","v":0},null,null,null,null,null,null,null,{"$f":"CONCATENATE($V$290,V388,$V$289)","v":"=+IMPORTARDATOSDINAMICOS(\" BAS090\";TABLAS!$A$146)"},"=+IMPORTARDATOSDINAMICOS(\" BAS091\";TABLAS!$A$146)",{"$f":"IF(X388<10,CONCATENATE(\"00\",X388),IF(AND(X388<100,X388>9),CONCATENATE(\"0\",X388),X388))","v":"090"},"091",{"$f":"+Y384+1","v":90},91,null,null,null,"Total"]
[null,99401.32," Consejería en medicina alternativa y complementaria",null,null,null,null,null,null,0,{"$f":"+GETPIVOTDATA(\" BAS092\",TABLAS!$A$146)","v":0},{"$f":"+GETPIVOTDATA(\" BAS093\",TABLAS!$A$146)","v":0},null,null,null,null,null,null,null,"=+IMPORTARDATOSDINAMICOS(\" BAS092\";TABLAS!$A$146)","=+IMPORTARDATOSDINAMICOS(\" BAS093\";TABLAS!$A$146)","092","093",92,93,null,null,null,"U0080 /D + EDAD >=12 Y <=17"]
[null,301903,"Medicina cuerpo mente.",null,null,null,null,null,null,0,{"$f":"+GETPIVOTDATA(\" BAS094\",TABLAS!$A$146)","v":0},{"$f":"+GETPIVOTDATA(\" BAS095\",TABLAS!$A$146)","v":0},null,null,null,null,null,null,null,"=+IMPORTARDATOSDINAMICOS(\" BAS094\";TABLAS!$A$146)","=+IMPORTARDATOSDINAMICOS(\" BAS095\";TABLAS!$A$146)","094","095",94,95,null,null,null,"99401.32 /D + EDAD >=12 Y <=17"]
[null,"C2081","Difusión a través de materiales impresos y magnéticos (volantes, tripticos, afiches, gigantografías)",null,null,null,null,null,null,0,{"$f":"+GETPIVOTDATA(\" BAS096\",TABLAS!$A$146)","v":0},{"$f":"+GETPIVOTDATA(\" BAS097\",TABLAS!$A$146)","v":0},null,null,null,null,null,null,null,"=+IMPORTARDATOSDINAMICOS(\" BAS096\";TABLAS!$A$146)","=+IMPORTARDATOSDINAMICOS(\" BAS097\";TABLAS!$A$146)","096","097",96,97,null,null,null,"301903 /D + EDAD >=12 Y <=17"]
[null,null,null,null,null,null,null,null,null,null,null,null,null,null,null,null,null,null,null,null,null,null,null,null,null,null,null,null,"C2081/D + EDAD >=12 Y <=17"]
[null,"Se corrigió observaciones del manual HIS en la sintaxis el día 11/09/2020 a horas 6:08 pm, de manera penultima"]

{"sheet":"Datos","index":3,"n_rows":454,"n_cols":32,"rows_kept":454,"cut":false,"hidden":true,"merged":[]}
[]
[]
[]
[]
[]
[]
[]
[]
[null,"ANO",null,"MESES",null,"COD_RED","DESC_RED","CONCATENAR",null,"COD_RED","COD_MIC","DESC_MICRO","CONCATENAR",null,"COD_ESTAB","DESC_ESTAB","COD_RED","COD_MIC","COD_PROV","COD_DIST","REDMIC","CONCATENAR",null,"COD_PROV","DESC_PROV","CONCATENAR",null,"COD_PROV","COD_DIST","DESC_DIST","PROVDIST","CONCATENAR"]
[null,2025,null,"01-Enero",null,"00","NO TIENE ASIGNADO NINGUNA RED",{"$f":"CONCATENATE(F10,\" - \",G10)","v":"00 - NO TIENE ASIGNADO NINGUNA RED"},null,"00","00","NO PERTENECE A NINGUNA MICRORED                                                                     ",{"$f":"CONCATENATE(J10,K10,\" - \",L10)","v":"0000 - NO PERTENECE A NINGUNA MICRORED                                                                     "},null,"000000000","(All)","00","00",null,null,{"$f":"CONCATENATE(Q10,R10)","v":"0000"},{"$f":"CONCATENATE(O10,\" - \",P10)","v":"000000000 - (All)"},null,"00","(All)",{"$f":"CONCATENATE(X10,\" - \",Y10)","v":"00 - (All)"},null,"01","00","(All)",{"$f":"CONCATENATE(AB10,AC10)","v":"0100"},{"$f":"CONCATENATE(AB10,AC10,\" - \",AD10)","v":"0100 - (All)"}]
[null,null,null,"02-Febrero",null,"01","CUSCO SUR",{"$f":"CONCATENATE(F11,\" - \",G11)","v":"01 - CUSCO SUR"},null,"00","99","(All)","0099 - (All)",1,"000002289","HOSPITAL DE APOYO DEPARTAMENTAL CUSCO","00","00","01","01",{"$f":"CONCATENATE(Q11,R11)","v":"0000"},{"$f":"CONCATENATE(O11,\" - \",P11)","v":"000002289 - HOSPITAL DE APOYO DEPARTAMENTAL CUSCO"},null,"01","CUSCO",{"$f":"CONCATENATE(X11,\" - \",Y11)","v":"01 - CUSCO"},null,"01","01","CUSCO",{"$f":"CONCATENATE(AB11,AC11)","v":"0101"},{"$f":"CONCATENATE(AB11,AC11,\" - \",AD11)","v":"0101 - CUSCO"}]
[null,null,null,"03-Marzo",null,"02","CUSCO NORTE","02 - CUSCO NORTE",null,"01","00","NO PERTENECE A NINGUNA MICRORED                                                                     ","0100 - NO PERTENECE A NINGUNA MICRORED                                                                     ",{"$f":"+N11+1","v":2},"000002305","ANTONIO LORENA DEL CUSCO","00","00","01","06","0000","000002305 - ANTONIO LORENA DEL CUSCO",null,"02","ACOMAYO",{"$f":"CONCATENATE(X12,\" - \",Y12)","v":"02 - ACOMAYO"},null,"01","02","CCORCA","0102","0102 - CCORCA"]
[null,null,null,"04-Abril",null,"03","LA CONVENCION","03 - LA CONVENCION",null,"01","16","CUSCO                                                                                               ","0116 - CUSCO                                                                                               ",{"$f":"+N12+1","v":3},"999999999","(All)","00","99",null,null,"0099","999999999 - (All)",null,"03","ANTA","03 - ANTA",null,"01","03","POROY","0103","0103 - POROY"]
[null,null,null,"05-Mayo",null,"04","CANAS-CANCHIS-ESPINAR","04 - CANAS-CANCHIS-ESPINAR",null,"01","03","PARURO                                                                                              ","0103 - PARURO                                                                                              ",null,"000025210","TUPAC AMARU","01","00","01","05","0100","000025210 - TUPAC AMARU",null,"04","CALCA","04 - CALCA",null,"01","04","SAN JERONIMO","0104","0104 - SAN JERONIMO"]
[null,null,null,"06-Junio",null,"05","KIMBIRI PICHARI","05 - KIMBIRI PICHARI",null,"01","06","PAUCARTAMBO                                                                                         ","0106 - PAUCARTAMBO                                                                                         ",{"$f":"+N13+1","v":4},"000000000","(All)","01","03",null,null,"0103","000000000 - (All)",null,"05","CANAS","05 - CANAS",null,"01","05","SAN SEBASTIAN","0105","0105 - SAN SEBASTIAN"]
[null,null,null,"07-Julio",null,"06","CHUMBIVILCAS","06 - CHUMBIVILCAS",null,"01","12","URCOS                                                                                               ","0112 - URCOS                                                                                               ",null,"000002499","PARURO","01","03","10","01","0103","000002499 - PARURO",null,"06","CANCHIS","06 - CANCHIS",null,"01","06","SANTIAGO","0106","0106 - SANTIAGO"]
[null,null,null,"08-Agosto",null,"99","(All)","99 - (All)",null,"01","13","ACOMAYO                                                                                             ","0113 - ACOMAYO                                                                                             ",{"$f":"+N15+1","v":5},"000002500","ACCHA","01","03","10","02","0103","000002500 - ACCHA",null,"07","CHUMBIVILCAS","07 - CHUMBIVILCAS",null,"01","07","SAYLLA","0107","0107 - SAYLLA"]
[null,null,null,"09-Setiembre",null,null,null,null,null,"01","15","OCONGATE                                                                                            ","0115 - OCONGATE                                                                                            ",6,"000002501","CCAPI","01","03","10","03","0103","000002501 - CCAPI",null,"08","ESPINAR","08 - ESPINAR",null,"01","08","WANCHAQ","0108","0108 - WANCHAQ"]
[null,null,null,"10-Octubre",null,null,null,null,null,"01","99","(All)","0199 - (All)",7,"000002502","CCOYABAMBA","01","03","10","03","0103","000002502 - CCOYABAMBA",null,"09","LA CONVENCION","09 - LA CONVENCION",null,"02","00","(All)","0200","0200 - (All)"]
[null,null,null,"11-Noviembre",null,"EJECUTORAS",null,null,null,"02","01","BELEMPAMPA                                                                                          ","0201 - BELEMPAMPA                                                                                          ",8,"000002503","COLCHA","01","03","10","04","0103","000002503 - COLCHA",null,"10","PARURO","10 - PARURO",null,"02","01","ACOMAYO","0201","0201 - ACOMAYO"]
[null,null,null,"12-Diciembre",null,"COD_RED","DESC_RED","CONCATENAR",null,"02","02","WANCHAQ                                                                                             ","0202 - WANCHAQ                                                                                             ",9,"000006978","CCOCHIRIHUAY","01","03","10","04","0103","000006978 - CCOCHIRIHUAY",null,"11","PAUCARTAMBO","11 - PAUCARTAMBO",null,"02","02","ACOPIA","0202","0202 - ACOPIA"]
[null,null,null,null,null,"01","HOSPITAL REGIONAL CUSCO",{"$f":"CONCATENATE(F22,\" - \",G22)","v":"01 - HOSPITAL REGIONAL CUSCO"},null,"02","03","ANTA                                                                                                ","0203 - ANTA                                                                                                ",10,"000002504","HUANOQUITE","01","03","10","05","0103","000002504 - HUANOQUITE",null,"12","QUISPICANCHI","12 - QUISPICANCHI",null,"02","03","ACOS","0203","0203 - ACOS"]
[null,null,null,null,null,"02","HOSPITAL ANTONIO LORENA",{"$f":"CONCATENATE(F23,\" - \",G23)","v":"02 - HOSPITAL ANTONIO LORENA"},null,"02","04","LIMATAMBO                                                                                           ","0204 - LIMATAMBO                                                                                           ",11,"000002505","OMACHA","01","03","10","06","0103","000002505 - OMACHA",null,"13","URUBAMBA","13 - URUBAMBA",null,"02","04","MOSOC LLACTA","0204","0204 - MOSOC LLACTA"]
[null,null,null,null,null,"03","CUSCO NORTE","03 - CUSCO NORTE",null,"02","05","PISAC                                                                                               ","0205 - PISAC                                                                                               ",12,"000002506","ANTAPALLPA","01","03","10","06","0103","000002506 - ANTAPALLPA",null,null,null,null,null,"02","05","POMACANCHI","0205","0205 - POMACANCHI"]
[null,null,null,null,null,"04","CUSCO SUR","04 - CUSCO SUR",null,"02","06","CALCA                                                                                               ","0206 - CALCA                                                                                               ",13,"000007147","PUESTO DE SALUD DE HUASQUILLAY","01","03","10","06","0103","000007147 - PUESTO DE SALUD DE HUASQUILLAY",null,null,null,null,null,"02","06","RONDOCAN","0206","0206 - RONDOCAN"]
[null,null,null,null,null,"05","LA CONVENCION","05 - LA CONVENCION",null,"02","07","URUBAMBA                                                                                            ","0207 - URUBAMBA                                                                                            ",14,"000012924","SAHUA SAHUA","01","03","10","06","0103","000012924 - SAHUA SAHUA",null,null,null,null,null,"02","07","SANGARARA","0207","0207 - SANGARARA"]
[null,null,null,null,null,"06","HOSPITAL QUILLABAMBA","06 - HOSPITAL QUILLABAMBA",null,"02","08","YANATILE                                                                                            ","0208 - YANATILE                                                                                            ",15,"000002507","PACCARECTAMBO","01","03","10","07","0103","000002507 - PACCARECTAMBO",null,null,null,null,null,"03","00","(All)","0300","0300 - (All)"]
[null,null,null,null,null,"07","CANAS CANCHIS ESPINAR","07 - CANAS CANCHIS ESPINAR",null,"02","09","SIETE CUARTONES                                                                                     ","0209 - SIETE CUARTONES                                                                                     ",16,"000002509","YAURISQUE","01","03","10","09","0103","000002509 - YAURISQUE",null,null,null,null,null,"03","01","ANTA","0301","0301 - ANTA"]
[null,null,null,null,null,"08","HOSPITAL SICUANI","08 - HOSPITAL SICUANI",null,"02","99","(All)","0299 - (All)",17,"000000000","(All)","01","06",null,null,"0106","000000000 - (All)",null,null,null,null,null,"03","02","ANCAHUASI","0302","0302 - ANCAHUASI"]
[null,null,null,null,null,"09","HOSPITAL ESPINAR","09 - HOSPITAL ESPINAR",null,"03","00","NO PERTENECE A NINGUNA MICRORED                                                                     ","0300 - NO PERTENECE A NINGUNA MICRORED                                                                     ",null,"000002520","HUANCARANI","01","06","11","05","0106","000002520 - HUANCARANI",null,null,null,null,null,"03","03","CACHIMAYO","0303","0303 - CACHIMAYO"]
[null,null,null,null,null,"10","KIMBIRI PICHARI","10 - KIMBIRI PICHARI",null,"03","01","SANTA ANA                                                                                           ","0301 - SANTA ANA                                                                                           ",{"$f":"+N29+1","v":18},"000002521","PILCOPATA","01","06","11","06","0106","000002521 - PILCOPATA",null,null,null,null,null,"03","04","CHINCHAYPUJIO","0304","0304 - CHINCHAYPUJIO"]
[null,null,null,null,null,"11","CHUMBIVILCAS","11 - CHUMBIVILCAS",null,"03","02","MARANURA                                                                                            ","0302 - MARANURA                                                                                            ",19,"000002522","PATRIA","01","06","11","06","0106","000002522 - PATRIA",null,null,null,null,null,"03","05","HUAROCONDO","0305","0305 - HUAROCONDO"]
[null,null,null,null,null,"99","(ALL)",{"$f":"CONCATENATE(F33,\" - \",G33)","v":"99 - (ALL)"},null,"03","03","QUELLOUNO                                                                                           ","0303 - QUELLOUNO                                                                                           ",20,"000002510","PAUCARTAMBO","01","06","11","01","0106","000002510 - PAUCARTAMBO",null,null,null,null,null,"03","06","LIMATAMBO","0306","0306 - LIMATAMBO"]
[null,null,null,null,null,null,null,null,null,"03","04","KITENI                                                                                              ","0304 - KITENI                                                                                              ",21,"000002511","MOLLOMARCA","01","06","11","01","0106","000002511 - MOLLOMARCA",null,null,null,null,null,"03","07","MOLLEPATA","0307","0307 - MOLLEPATA"]
[null,null,null,null,null,null,null,null,null,"03","05","KAMISEA                                                                                             ","0305 - KAMISEA                                                                                             ",22,"000010077","PAUCARTAMBO -ESSALUD","01","06","11","01","0106","000010077 - PAUCARTAMBO -ESSALUD",null,null,null,null,null,"03","08","PUCYURA","0308","0308 - PUCYURA"]
[null,null,null,null,null,"SECTORES",null,null,null,"03","06","PUCYURA                                                                                             ","0306 - PUCYURA                                                                                             ",23,"000033777","MENTAL COMUNITARIO VIRGEN DEL ROSARIO","01","06","11","01","0106","000033777 - MENTAL COMUNITARIO VIRGEN DEL ROSARIO",null,null,null,null,null,"03","09","ZURITE","0309","0309 - ZURITE"]
[null,null,null,null,null,"COD_SECTOR","DESC_RED","CONCATENAR",null,"03","07","PALMA REAL","0307 - PALMA REAL",24,"000002512","CAICAY","01","06","11","02","0106","000002512 - CAICAY",null,null,null,null,null,"04","00","(All)","0400","0400 - (All)"]
[null,null,null,null,null,"1","GORE",{"$f":"CONCATENATE(F38,\" - \",G38)","v":"1 - GORE"},null,"03","99","(All)","0399 - (All)",25,"000002513","HUASAC","01","06","11","02","0106","000002513 - HUASAC",null,null,null,null,null,"04","01","CALCA","0401","0401 - CALCA"]
[null,null,null,null,null,"2","ESSALUD",{"$f":"CONCATENATE(F39,\" - \",G39)","v":"2 - ESSALUD"},null,"04","00","NO PERTENECE A NINGUNA MICRORED                                                                     ","0400 - NO PERTENECE A NINGUNA MICRORED                                                                     ",26,"000002514","CHALLABAMBA","01","06","11","03","0106","000002514 - CHALLABAMBA",null,null,null,null,null,"04","02","COYA","0402","0402 - COYA"]
[null,null,null,null,null,"3","OTROS",{"$f":"CONCATENATE(F40,\" - \",G40)","v":"3 - OTROS"},null,"04","01","YANAOCA                                                                                             ","0401 - YANAOCA                                                                                             ",27,"000002516","COLQUEPATA","01","06","11","04","0106","000002516 - COLQUEPATA",null,null,null,null,null,"04","03","LAMAY","0403","0403 - LAMAY"]
[null,null,null,null,null,"99","(ALL)",{"$f":"CONCATENATE(F41,\" - \",G41)","v":"99 - (ALL)"},null,"04","02","EL DESCANSO                                                                                         ","0402 - EL DESCANSO                                                                                         ",28,"000002517","PICHIHUA COLQUEPATA","01","06","11","04","0106","000002517 - PICHIHUA COLQUEPATA",null,null,null,null,null,"04","04","LARES","0404","0404 - LARES"]
[null,null,null,null,null,null,null,null,null,"04","03","COMBAPATA                                                                                           ","0403 - COMBAPATA                                                                                           ",29,"000002518","VIZCOCHONI","01","06","11","04","0106","000002518 - VIZCOCHONI",null,null,null,null,null,"04","05","PISAC","0405","0405 - PISAC"]
[null,null,null,null,null,null,null,null,null,"04","04","TECHO OBRERO                                                                                        ","0404 - TECHO OBRERO                                                                                        ",30,"000002519","AYRE","01","06","11","04","0106","000002519 - AYRE",null,null,null,null,null,"04","06","SAN SALVADOR","0406","0406 - SAN SALVADOR"]
[null,null,null,null,null,null,null,null,null,"04","05","PAMPAPHALLA                                                                                         ","0405 - PAMPAPHALLA                                                                                         ",31,"000006979","TOCRA","01","06","11","04","0106","000006979 - TOCRA",null,null,null,null,null,"04","07","TARAY","0407","0407 - TARAY"]
[null,null,null,null,null,null,null,null,null,"04","06","YAURI                                                                                               ","0406 - YAURI                                                                                               ",32,"000000000","(All)","01","12",null,null,"0112","000000000 - (All)",null,null,null,null,null,"04","08","YANATILE","0408","0408 - YANATILE"]
[null,null,null,null,null,null,null,null,null,"04","99","(All)","0499 - (All)",null,"000002523","URCOS","01","12","12","01","0112","000002523 - URCOS",null,null,null,null,null,"05","00","(All)","0500","0500 - (All)"]
[null,null,null,null,null,null,null,null,null,"05","00","NO PERTENECE A NINGUNA MICRORED                                                                     ","0500 - NO PERTENECE A NINGUNA MICRORED                                                                     ",{"$f":"+N45+1","v":33},"000026385","ESSALUD-URCOS","01","12","12","01","0112","000026385 - ESSALUD-URCOS",null,null,null,null,null,"05","01","YANAOCA","0501","0501 - YANAOCA"]
[null,null,null,null,null,null,null,null,null,"05","01","KIMBIRI                                                                                             ","0501 - KIMBIRI                                                                                             ",34,"000002525","ANDAHUAYLILLAS","01","12","12","02","0112","000002525 - ANDAHUAYLILLAS",null,null,null,null,null,"05","02","CHECCA","0502","0502 - CHECCA"]
[null,null,null,null,null,null,null,null,null,"05","02","PICHARI                                                                                             ","0502 - PICHARI                                                                                             ",35,"000008911","HUARA HUARA","01","12","12","05","0112","000008911 - HUARA HUARA",null,null,null,null,null,"05","03","KUNTURKANKI","0503","0503 - KUNTURKANKI"]
[null,null,null,null,null,null,null,null,null,"05","99","(All)","0599 - (All)",36,"000002530","CUSIPATA","01","12","12","06","0112","000002530 - CUSIPATA",null,null,null,null,null,"05","04","LANGUI","0504","0504 - LANGUI"]
[null,null,null,null,null,null,null,null,null,"06","00","NO PERTENECE A NINGUNA MICRORED                                                                     ","0600 - NO PERTENECE A NINGUNA MICRORED                                                                     ",37,"000006980","CHILLIHUANI","01","12","12","06","0112","000006980 - CHILLIHUANI",null,null,null,null,null,"05","05","LAYO","0505","0505 - LAYO"]
[null,null,null,null,null,null,null,null,null,"06","09","SANTO TOMAS                                                                                         ","0609 - SANTO TOMAS                                                                                         ",38,"000002532","HUARO","01","12","12","07","0112","000002532 - HUARO",null,null,null,null,null,"05","06","PAMPAMARCA","0506","0506 - PAMPAMARCA"]
[null,null,null,null,null,null,null,null,null,"06","01","LIVITACA                                                                                            ","0601 - LIVITACA                                                                                            ",39,"000002533","URPAY","01","12","12","07","0112","000002533 - URPAY",null,null,null,null,null,"05","07","QUEHUE","0507","0507 - QUEHUE"]
[null,null,null,null,null,null,null,null,null,"06","99","(All)","0699 - (All)",40,"000011747","POSTA MEDICA POLICIAL PUCUTO","01","12","12","07","0112","000011747 - POSTA MEDICA POLICIAL PUCUTO",null,null,null,null,null,"05","08","TUPAC AMARU","0508","0508 - TUPAC AMARU"]
[null,null,null,null,null,null,null,null,null,"99","99","(All)","9999 - (All)",41,"000030708","MENTAL COMUNITARIO HUARO","01","12","12","07","0112","000030708 - MENTAL COMUNITARIO HUARO",null,null,null,null,null,"06","00","(All)","0600","0600 - (All)"]
[null,null,null,null,null,null,null,null,null,null,null,null,null,42,"000002534","LUCRE","01","12","12","08","0112","000002534 - LUCRE",null,null,null,null,null,"06","01","SICUANI","0601","0601 - SICUANI"]
[null,null,null,null,null,null,null,null,null,null,null,null,null,43,"000002537","OROPESA","01","12","12","11","0112","000002537 - OROPESA",null,null,null,null,null,"06","02","CHECACUPE","0602","0602 - CHECACUPE"]
[null,null,null,null,null,null,null,null,null,null,null,null,null,44,"000002538","QUIQUIJANA","01","12","12","12","0112","000002538 - QUIQUIJANA",null,null,null,null,null,"06","03","COMBAPATA","0603","0603 - COMBAPATA"]
[null,null,null,null,null,null,null,null,null,null,null,null,null,45,"000002539","CCOLCA","01","12","12","12","0112","000002539 - CCOLCA",null,null,null,null,null,"06","04","MARANGANI","0604","0604 - MARANGANI"]
[null,null,null,null,null,null,null,null,null,null,null,null,null,46,"000000000","(All)","01","13",null,null,"0113","000000000 - (All)",null,null,null,null,null,"06","05","PITUMARCA","0605","0605 - PITUMARCA"]
[null,null,null,null,null,null,null,null,null,null,null,null,null,null,"000002317","ACOMAYO","01","13","02","01","0113","000002317 - ACOMAYO",null,null,null,null,null,"06","06","SAN PABLO","0606","0606 - SAN PABLO"]
[null,null,null,null,null,null,null,null,null,null,null,null,null,{"$f":"+N60+1","v":47},"000010076","ACOMAYO - ESSALUD","01","13","02","01","0113","000010076 - ACOMAYO - ESSALUD",null,null,null,null,null,"06","07","SAN PEDRO","0607","0607 - SAN PEDRO"]
[null,null,null,null,null,null,null,null,null,null,null,null,null,48,"000002318","ACOPIA","01","13","02","02","0113","000002318 - ACOPIA",null,null,null,null,null,"06","08","TINTA","0608","0608 - TINTA"]
[null,null,null,null,null,null,null,null,null,null,null,null,null,49,"000002319","ACOS","01","13","02","03","0113","000002319 - ACOS",null,null,null,null,null,"07","00","(All)","0700","0700 - (All)"]
[null,null,null,null,null,null,null,null,null,null,null,null,null,50,"000002321","POMACANCHI","01","13","02","05","0113","000002321 - POMACANCHI",null,null,null,null,null,"07","01","SANTO TOMAS","0701","0701 - SANTO TOMAS"]
[null,null,null,null,null,null,null,null,null,null,null,null,null,51,"000002322","SAN JUAN DE POMACANCHI","01","13","02","05","0113","000002322 - SAN JUAN DE POMACANCHI",null,null,null,null,null,"07","02","CAPACMARCA","0702","0702 - CAPACMARCA"]
[null,null,null,null,null,null,null,null,null,null,null,null,null,52,"000012926","SANTA LUCIA","01","13","02","05","0113","000012926 - SANTA LUCIA",null,null,null,null,null,"07","03","CHAMACA","0703","0703 - CHAMACA"]
[null,null,null,null,null,null,null,null,null,null,null,null,null,53,"000002324","PUESTO DE SALUD SANGARARA","01","13","02","07","0113","000002324 - PUESTO DE SALUD SANGARARA",null,null,null,null,null,"07","04","COLQUEMARCA","0704","0704 - COLQUEMARCA"]
[null,null,null,null,null,null,null,null,null,null,null,null,null,54,"000002325","PUESTO DE SALUD MARCACONGA","01","13","02","07","0113","000002325 - PUESTO DE SALUD MARCACONGA",null,null,null,null,null,"07","05","LIVITACA","0705","0705 - LIVITACA"]
[null,null,null,null,null,null,null,null,null,null,null,null,null,55,"000002508","PILLPINTO","01","13","10","08","0113","000002508 - PILLPINTO",null,null,null,null,null,"07","06","LLUSCO","0706","0706 - LLUSCO"]
[null,null,null,null,null,null,null,null,null,null,null,null,null,56,"000000000","(All)","01","15",null,null,"0115","000000000 - (All)",null,null,null,null,null,"07","07","QUIÑOTA","0707","0707 - QUIÑOTA"]
[null,null,null,null,null,null,null,null,null,null,null,null,null,null,"000002526","QUINCE MIL","01","15","12","03","0115","000002526 - QUINCE MIL",null,null,null,null,null,"07","08","VELILLE","0708","0708 - VELILLE"]
[null,null,null,null,null,null,null,null,null,null,null,null,null,{"$f":"+N71+1","v":57},"000002527","CCARHUAYO","01","15","12","04","0115","000002527 - CCARHUAYO",null,null,null,null,null,"08","00","(All)","0800","0800 - (All)"]
[null,null,null,null,null,null,null,null,null,null,null,null,null,58,"000002524","PAMPACAMARA","01","15","12","05","0115","000002524 - PAMPACAMARA",null,null,null,null,null,"08","01","ESPINAR","0801","0801 - ESPINAR"]
[null,null,null,null,null,null,null,null,null,null,null,null,null,59,"000002528","CCATCCA","01","15","12","05","0115","000002528 - CCATCCA",null,null,null,null,null,"08","02","CONDOROMA",{"$f":"CONCATENATE(AB75,AC75)","v":"0802"},{"$f":"CONCATENATE(AB75,AC75,\" - \",AD75)","v":"0802 - CONDOROMA"}]
[null,null,null,null,null,null,null,null,null,null,null,null,null,60,"000002529","KCAURY","01","15","12","05","0115","000002529 - KCAURY",null,null,null,null,null,"08","03","COPORAQUE","0803","0803 - COPORAQUE"]
[null,null,null,null,null,null,null,null,null,null,null,null,null,{"$f":"+N76+1","v":61},"000012931","CHICHINA","01","15","12","05","0115","000012931 - CHICHINA",null,null,null,null,null,"08","04","OCORURO","0804","0804 - OCORURO"]
[null,null,null,null,null,null,null,null,null,null,null,null,null,62,"000016335","CCAPANA","01","15","12","05","0115","000016335 - CCAPANA",null,null,null,null,null,"08","05","PALLPATA","0805","0805 - PALLPATA"]
[null,null,null,null,null,null,null,null,null,null,null,null,null,63,"000002535","MARCAPATA","01","15","12","09","0115","000002535 - MARCAPATA",null,null,null,null,null,"08","06","PICHIGUA","0806","0806 - PICHIGUA"]
[null,null,null,null,null,null,null,null,null,null,null,null,null,64,"000007110","INCACANCHA","01","15","12","09",{"$f":"CONCATENATE(Q80,R80)","v":"0115"},{"$f":"CONCATENATE(O80,\" - \",P80)","v":"000007110 - INCACANCHA"},null,null,null,null,null,"08","07","SUYCKUTAMBO","0807","0807 - SUYCKUTAMBO"]
[null,null,null,null,null,null,null,null,null,null,null,null,null,65,"000002536","OCONGATE","01","15","12","10","0115","000002536 - OCONGATE",null,null,null,null,null,"08","08","ALTO PICHIGUA","0808","0808 - ALTO PICHIGUA"]
[null,null,null,null,null,null,null,null,null,null,null,null,null,66,"000006977","TINKI","01","15","12","10","0115","000006977 - TINKI",null,null,null,null,null,"09","00","(All)","0900","0900 - (All)"]
[null,null,null,null,null,null,null,null,null,null,null,null,null,67,"000000000","(All)","01","16",null,null,"0116","000000000 - (All)",null,null,null,null,null,"09","01","SANTA ANA","0901","0901 - SANTA ANA"]
[null,null,null,null,null,null,null,null,null,null,null,null,null,null,"000002300","SAN JERONIMO","01","16","01","04","0116","000002300 - SAN JERONIMO",null,null,null,null,null,"09","02","ECHARATE","0902","0902 - ECHARATE"]
[null,null,null,null,null,null,null,null,null,null,null,null,null,{"$f":"+N83+1","v":68},"000007699","CONCHACALLE","01","16","01","04","0116","000007699 - CONCHACALLE",null,null,null,null,null,"09","03","HUAYOPATA","0903","0903 - HUAYOPATA"]
[null,null,null,null,null,null,null,null,null,null,null,null,null,69,"000018926","ESTABLECIMIENTO PENITENCIARIO CUSCO VARONES","01","16","01","04","0116","000018926 - ESTABLECIMIENTO PENITENCIARIO CUSCO VARONES",null,null,null,null,null,"09","04","MARANURA","0904","0904 - MARANURA"]
[null,null,null,null,null,null,null,null,null,null,null,null,null,70,"000021187","ESTABLECIMIENTO PENITENCIARIO CUSCO MUJERES","01","16","01","04","0116","000021187 - ESTABLECIMIENTO PENITENCIARIO CUSCO MUJERES",null,null,null,null,null,"09","05","OCOBAMBA","0905","0905 - OCOBAMBA"]
[null,null,null,null,null,null,null,null,null,null,null,null,null,71,"000030727","PATRÓN SAN SEBASTIAN","01","16","01","04","0116","000030727 - PATRÓN SAN SEBASTIAN",null,null,null,null,null,"09","06","QUELLOUNO","0906","0906 - QUELLOUNO"]
[null,null,null,null,null,null,null,null,null,null,null,null,null,72,"000002301","SAN SEBASTIAN","01","16","01","05","0116","000002301 - SAN SEBASTIAN",null,null,null,null,null,"09","07","KIMBIRI","0907","0907 - KIMBIRI"]
[null,null,null,null,null,null,null,null,null,null,null,null,null,73,"000002303","SANTA ROSA","01","16","01","05","0116","000002303 - SANTA ROSA",null,null,null,null,null,"09","08","SANTA TERESA","0908","0908 - SANTA TERESA"]
[null,null,null,null,null,null,null,null,null,null,null,null,null,74,"000010065","SAN SEBASTIAN ESSALUD","01","16","01","05","0116","000010065 - SAN SEBASTIAN ESSALUD",null,null,null,null,null,"09","09","VILCABAMBA","0909","0909 - VILCABAMBA"]
[null,null,null,null,null,null,null,null,null,null,null,null,null,75,"000011743","POLICIAL \"SANTA ROSA\"  CUSCO","01","16","01","05","0116","000011743 - POLICIAL \"SANTA ROSA\"  CUSCO",null,null,null,null,null,"09","10","PICHARI","0910","0910 - PICHARI"]
[null,null,null,null,null,null,null,null,null,null,null,null,null,76,"000026181","MENTAL SAN SEBASTIAN","01","16","01","05","0116","000026181 - MENTAL SAN SEBASTIAN",null,null,null,null,null,"09","11","INKAWASI                                ","0911","0911 - INKAWASI                                "]
[null,null,null,null,null,null,null,null,null,null,null,null,null,77,"000002314","SAYLLA","01","16","01","07","0116","000002314 - SAYLLA",null,null,null,null,null,"09","12","VILLA VIRGEN","0912","0912 - VILLA VIRGEN"]
[null,null,null,null,null,null,null,null,null,null,null,null,null,78,"000002323","RONDOCAN","01","16","02","06","0116","000002323 - RONDOCAN",null,null,null,null,null,"09","13","VILLA KINTIARINA","0913","0913 - VILLA KINTIARINA"]
[null,null,null,null,null,null,null,null,null,null,null,null,null,79,"999999999","(All)","01","99",null,null,"0199","999999999 - (All)",null,null,null,null,null,"09","14","MEGANTONI","0914","0914 - MEGANTONI"]
[null,null,null,null,null,null,null,null,null,null,null,null,null,null,"000000000","(All)","02","01",null,null,"0201","000000000 - (All)",null,null,null,null,null,"09","15","KUMPIRUSHIATO","0915","0915 - KUMPIRUSHIATO"]
[null,null,null,null,null,null,null,null,null,null,null,null,null,null,"000002292","INDEPENDENCIA","02","01","01","01","0201","000002292 - INDEPENDENCIA",null,null,null,null,null,"09","16","CIELO PUNCO","0916","0916 - CIELO PUNCO"]
[null,null,null,null,null,null,null,null,null,null,null,null,null,{"$f":"+N96+1","v":80},"000002297","CCORCCA","02","01","01","02","0201","000002297 - CCORCCA",null,null,null,null,null,"09","17","MANITEA","0917","0917 - MANITEA"]
[null,null,null,null,null,null,null,null,null,null,null,null,null,81,"000002306","BELEMPAMPA","02","01","01","06","0201","000002306 - BELEMPAMPA",null,null,null,null,null,"09","18","UNION ASHANINKA","0918","0918 - UNION ASHANINKA"]
[null,null,null,null,null,null,null,null,null,null,null,null,null,82,"000002308","ZARZUELA ALTA","02","01","01","06","0201","000002308 - ZARZUELA ALTA",null,null,null,null,null,"09","00","(All)","0900","0900 - (All)"]
[null,null,null,null,null,null,null,null,null,null,null,null,null,83,"000002309","DIGNIDAD NACIONAL","02","01","01","06","0201","000002309 - DIGNIDAD NACIONAL",null,null,null,null,null,"10","01","PARURO","1001","1001 - PARURO"]
[null,null,null,null,null,null,null,null,null,null,null,null,null,84,"000002313","OCCOPATA","02","01","01","06","0201","000002313 - OCCOPATA",null,null,null,null,null,"10","02","ACCHA","1002","1002 - ACCHA"]
[null,null,null,null,null,null,null,null,null,null,null,null,null,85,"000010920","QUINTA BRIGADA DE MONTAÑA","02","01","01","06","0201","000010920 - QUINTA BRIGADA DE MONTAÑA",null,null,null,null,null,"10","03","CCAPI","1003","1003 - CCAPI"]
[null,null,null,null,null,null,null,null,null,null,null,null,null,86,"000026182","MENTAL SANTIAGO","02","01","01","06","0201","000026182 - MENTAL SANTIAGO",null,null,null,null,null,"10","04","COLCHA","1004","1004 - COLCHA"]
[null,null,null,null,null,null,null,null,null,null,null,null,null,87,"000034933","SANTIAGO ESSALUD","02","01","01","06","0201","000034933 - SANTIAGO ESSALUD",null,null,null,null,null,"10","05","HUANOQUITE","1005","1005 - HUANOQUITE"]
[null,null,null,null,null,null,null,null,null,null,null,null,null,88,"000023721","EJERCITO-PERUANO 5TA BM","02","01","01","06","0201","000023721 - EJERCITO-PERUANO 5TA BM",null,null,null,null,null,"10","06","OMACHA","1006","1006 - OMACHA"]
[null,null,null,null,null,null,null,null,null,null,null,null,null,null,"000000000","(All)","02","02",null,null,"0202","000000000 - (All)",null,null,null,null,null,"10","07","PACCARITAMBO","1007","1007 - PACCARITAMBO"]
[null,null,null,null,null,null,null,null,null,null,null,null,null,{"$f":"+N107+1","v":89},"000034419","MENTAL COMUNITARIO CUSCO","02","02","01","01","0202","000034419 - MENTAL COMUNITARIO CUSCO",null,null,null,null,null,"10","08","PILLPINTO","1008","1008 - PILLPINTO"]
[null,null,null,null,null,null,null,null,null,null,null,null,null,90,"000002302","CCORAO","02","02","01","05","0202","000002302 - CCORAO",null,null,null,null,null,"10","09","YAURISQUE","1009","1009 - YAURISQUE"]
[null,null,null,null,null,null,null,null,null,null,null,null,null,91,"000002307","MANCO CAPAC","02","02","01","06","0202","000002307 - MANCO CAPAC",null,null,null,null,null,"11","00","(All)","1100","1100 - (All)"]
[null,null,null,null,null,null,null,null,null,null,null,null,null,92,"000002310","CHOCCO","02","02","01","06","0202","000002310 - CHOCCO",null,null,null,null,null,"11","01","PAUCARTAMBO","1101","1101 - PAUCARTAMBO"]
[null,null,null,null,null,null,null,null,null,null,null,null,null,93,"000002315","WANCHAQ","02","02","01","08","0202","000002315 - WANCHAQ",null,null,null,null,null,"11","02","CAICAY","1102","1102 - CAICAY"]
[null,null,null,null,null,null,null,null,null,null,null,null,null,94,"000002316","TTIO","02","02","01","08","0202","000002316 - TTIO",null,null,null,null,null,"11","03","CHALLABAMBA","1103","1103 - CHALLABAMBA"]
[null,null,null,null,null,null,null,null,null,null,null,null,null,95,"000010041","ADOLFO GUEVARA VELASCO","02","02","01","08","0202","000010041 - ADOLFO GUEVARA VELASCO",null,null,null,null,null,"11","04","COLQUEPATA","1104","1104 - COLQUEPATA"]
[null,null,null,null,null,null,null,null,null,null,null,null,null,96,"000026183","METROPOLITANO","02","02","01","08","0202","000026183 - METROPOLITANO",null,null,null,null,null,"11","05","HUANCARANI","1105","1105 - HUANCARANI"]
[null,null,null,null,null,null,null,null,null,null,null,null,null,null,"000030730","PATRON SANTIAGO","02","02","01","08","0202","000030730 - PATRON SANTIAGO",null,null,null,null,null,"11","06","KOSÑIPATA","1106","1106 - KOSÑIPATA"]
[null,null,null,null,null,null,null,null,null,null,null,null,null,{"$f":"+N116+1","v":97},"000000000","(All)","02","03",null,null,"0203","000000000 - (All)",null,null,null,null,null,"12","00","(All)","1200","1200 - (All)"]
[null,null,null,null,null,null,null,null,null,null,null,null,null,98,"000002326","ANTA","02","03","03","01","0203","000002326 - ANTA",null,null,null,null,null,"12","01","URCOS","1201","1201 - URCOS"]
[null,null,null,null,null,null,null,null,null,null,null,null,null,99,"000002328","COMPONE","02","03","03","01","0203","000002328 - COMPONE",null,null,null,null,null,"12","02","ANDAHUAYLILLAS","1202","1202 - ANDAHUAYLILLAS"]
[null,null,null,null,null,null,null,null,null,null,null,null,null,100,"000002329","CONCHACALLA","02","03","03","01","0203","000002329 - CONCHACALLA",null,null,null,null,null,"12","03","CAMANTI","1203","1203 - CAMANTI"]
[null,null,null,null,null,null,null,null,null,null,null,null,null,101,"000027790","MENTAL COMUNITARIO ANTA","02","03","03","01","0203","000027790 - MENTAL COMUNITARIO ANTA",null,null,null,null,null,"12","04","CCARHUAYO","1204","1204 - CCARHUAYO"]
[null,null,null,null,null,null,null,null,null,null,null,null,null,102,"000029514","ESSALUD ANTA","02","03","03","01","0203","000029514 - ESSALUD ANTA",null,null,null,null,null,"12","05","CCATCA","1205","1205 - CCATCA"]
[null,null,null,null,null,null,null,null,null,null,null,null,null,103,"000002330","ANCAHUASI","02","03","03","02","0203","000002330 - ANCAHUASI",null,null,null,null,null,"12","06","CUSIPATA","1206","1206 - CUSIPATA"]
[null,null,null,null,null,null,null,null,null,null,null,null,null,104,"000002331","CACHIMAYO","02","03","03","03","0203","000002331 - CACHIMAYO",null,null,null,null,null,"12","07","HUARO","1207","1207 - HUARO"]
[null,null,null,null,null,null,null,null,null,null,null,null,null,105,"000006972","PANTIPATA","02","03","03","04","0203","000006972 - PANTIPATA",null,null,null,null,null,"12","08","LUCRE","1208","1208 - LUCRE"]
[null,null,null,null,null,null,null,null,null,null,null,null,null,106,"000036240","CHINCHAYPUJIO","02","03","03","04","0203","000036240 - CHINCHAYPUJIO",null,null,null,null,null,"12","09","MARCAPATA","1209","1209 - MARCAPATA"]
[null,null,null,null,null,null,null,null,null,null,null,null,null,107,"000035838","PARCCOTICA","02","03","03","04","0203","000035838 - PARCCOTICA",null,null,null,null,null,"12","10","OCONGATE","1210","1210 - OCONGATE"]
[null,null,null,null,null,null,null,null,null,null,null,null,null,108,"000002333","HUAROCONDO","02","03","03","05","0203","000002333 - HUAROCONDO",null,null,null,null,null,"12","11","OROPESA","1211","1211 - OROPESA"]
[null,null,null,null,null,null,null,null,null,null,null,null,null,109,"000002334","HUAYLLACOCHA","02","03","03","05","0203","000002334 - HUAYLLACOCHA",null,null,null,null,null,"12","12","QUIQUIJANA","1212","1212 - QUIQUIJANA"]
[null,null,null,null,null,null,null,null,null,null,null,null,null,110,"000002339","PUCYURA ANTA","02","03","03","08","0203","000002339 - PUCYURA ANTA",null,null,null,null,null,"13","00","(All)","1300","1300 - (All)"]
[null,null,null,null,null,null,null,null,null,null,null,null,null,null,"000002340","ZURITE","02","03","03","09","0203","000002340 - ZURITE",null,null,null,null,null,"13","01","URUBAMBA","1301","1301 - URUBAMBA"]
[null,null,null,null,null,null,null,null,null,null,null,null,null,{"$f":"+N131+1","v":111},"000002327","CHACAN","02","03","03","01","0203","000002327 - CHACAN",null,null,null,null,null,"13","02","CHINCHERO","1302","1302 - CHINCHERO"]
[null,null,null,null,null,null,null,null,null,null,null,null,null,112,"000000000","(All)","02","04",null,null,"0204","000000000 - (All)",null,null,null,null,null,"13","03","HUAYLLABAMBA","1303","1303 - HUAYLLABAMBA"]
[null,null,null,null,null,null,null,null,null,null,null,null,null,113,"000002336","LIMATAMBO","02","04","03","06","0204","000002336 - LIMATAMBO",null,null,null,null,null,"13","04","MACHUPICCHU","1304","1304 - MACHUPICCHU"]
[null,null,null,null,null,null,null,null,null,null,null,null,null,114,"000002337","PAMPACONGA","02","04","03","06","0204","000002337 - PAMPACONGA",null,null,null,null,null,"13","05","MARAS","1305","1305 - MARAS"]
[null,null,null,null,null,null,null,null,null,null,null,null,null,115,"000010761","URATARI","02","04","03","06","0204","000010761 - URATARI",null,null,null,null,null,"13","06","OLLANTAYTAMBO","1306","1306 - OLLANTAYTAMBO"]
[null,null,null,null,null,null,null,null,null,null,null,null,null,null,"000002338","MOLLEPATA","02","04","03","07","0204","000002338 - MOLLEPATA",null,null,null,null,null,"13","07","YUCAY",{"$f":"CONCATENATE(AB138,AC138)","v":"1307"},"1307 - YUCAY"]
[null,null,null,null,null,null,null,null,null,null,null,null,null,{"$f":"+N137+1","v":116},"000021061","HUAMANPATA","02","04","03","07","0204","000021061 - HUAMANPATA",null,null,null,null,null,"00","00","(All)",{"$f":"CONCATENATE(AB139,AC139)","v":"0000"},"0000 - (All)"]
[null,null,null,null,null,null,null,null,null,null,null,null,null,117,"000000000","(All)","02","05",null,null,"0205","000000000 - (All)"]
[null,null,null,null,null,null,null,null,null,null,null,null,null,{"$f":"+N140+1","v":118},"000002343","COYA","02","05","04","02","0205","000002343 - COYA"]
[null,null,null,null,null,null,null,null,null,null,null,null,null,119,"000002344","LAMAY","02","05","04","03","0205","000002344 - LAMAY"]
[null,null,null,null,null,null,null,null,null,null,null,null,null,120,"000006975","SAYLLAFAYA","02","05","04","03","0205","000006975 - SAYLLAFAYA"]
[null,null,null,null,null,null,null,null,null,null,null,null,null,121,"000007145","HUAMA","02","05","04","03","0205","000007145 - HUAMA"]
[null,null,null,null,null,null,null,null,null,null,null,null,null,122,"000007146","POQUES","02","05","04","03","0205","000007146 - POQUES"]
[null,null,null,null,null,null,null,null,null,null,null,null,null,123,"000036012","HUARQUI","02","05","04","03","0205","000036012 - HUARQUI"]
[null,null,null,null,null,null,null,null,null,null,null,null,null,124,"000002348","PISAC","02","05","04","05","0205","000002348 - PISAC"]
[null,null,null,null,null,null,null,null,null,null,null,null,null,125,"000002349","CUYO CHICO","02","05","04","05","0205","000002349 - CUYO CHICO"]
[null,null,null,null,null,null,null,null,null,null,null,null,null,126,"000002350","CUYO GRANDE","02","05","04","05","0205","000002350 - CUYO GRANDE"]
[null,null,null,null,null,null,null,null,null,null,null,null,null,127,"000002351","QUELLO QUELLO","02","05","04","05",{"$f":"CONCATENATE(Q150,R150)","v":"0205"},{"$f":"CONCATENATE(O150,\" - \",P150)","v":"000002351 - QUELLO QUELLO"}]
[null,null,null,null,null,null,null,null,null,null,null,null,null,128,"000002352","SAN SALVADOR","02","05","04","06","0205","000002352 - SAN SALVADOR"]
[null,null,null,null,null,null,null,null,null,null,null,null,null,129,"000036087","TIRACANCHA","02","05","04","06","0205","000036087 - TIRACANCHA"]
[null,null,null,null,null,null,null,null,null,null,null,null,null,null,"000002353","TARAY","02","05","04","07","0205","000002353 - TARAY"]
[null,null,null,null,null,null,null,null,null,null,null,null,null,{"$f":"+N152+1","v":130},"000002354","HUANCALLE","02","05","04","07","0205","000002354 - HUANCALLE"]
[null,null,null,null,null,null,null,null,null,null,null,null,null,131,"000000000","(All)","02","06",null,null,"0206","000000000 - (All)"]
[null,null,null,null,null,null,null,null,null,null,null,null,null,132,"000002341","CALCA","02","06","04","01","0206","000002341 - CALCA"]
[null,null,null,null,null,null,null,null,null,null,null,null,null,133,"000010069","ESSALUD CALCA","02","06","04","01","0206","000010069 - ESSALUD CALCA"]
[null,null,null,null,null,null,null,null,null,null,null,null,null,134,"000010759","HUARAN","02","06","04","01","0206","000010759 - HUARAN"]
[null,null,null,null,null,null,null,null,null,null,null,null,null,135,"000010762","ACCHA ALTA - PAMPALLACTA","02","06","04","01","0206","000010762 - ACCHA ALTA - PAMPALLACTA"]
[null,null,null,null,null,null,null,null,null,null,null,null,null,136,"000026273","MENTAL COMUNITARIO VIRGEN ASUNTA DE CALCA","02","06","04","01","0206","000026273 - MENTAL COMUNITARIO VIRGEN ASUNTA DE CALCA"]
[null,null,null,null,null,null,null,null,null,null,null,null,null,137,"000002342","AMPARAES","02","06","04","04","0206","000002342 - AMPARAES"]
[null,null,null,null,null,null,null,null,null,null,null,null,null,138,"000002345","CCACHIN","02","06","04","04","0206","000002345 - CCACHIN"]
[null,null,null,null,null,null,null,null,null,null,null,null,null,139,"000002346","CHOQUECANCHA","02","06","04","04","0206","000002346 - CHOQUECANCHA"]
[null,null,null,null,null,null,null,null,null,null,null,null,null,140,"000002347","LARES","02","06","04","04","0206","000002347 - LARES"]
[null,null,null,null,null,null,null,null,null,null,null,null,null,141,"000002361","SUYO","02","06","04","04","0206","000002361 - SUYO"]
[null,null,null,null,null,null,null,null,null,null,null,null,null,142,"000007144","PATABAMBA","02","06","04","07","0206","000007144 - PATABAMBA"]
[null,null,null,null,null,null,null,null,null,null,null,null,null,143,"000002515","PAROBAMBA","02","06","11","03","0206","000002515 - PAROBAMBA"]
[null,null,null,null,null,null,null,null,null,null,null,null,null,144,"000007143","OTOCANI","02","06","11","03","0206","000007143 - OTOCANI"]
[null,null,null,null,null,null,null,null,null,null,null,null,null,145,"000000000","(All)","02","07",null,null,"0207","000000000 - (All)"]
[null,null,null,null,null,null,null,null,null,null,null,null,null,146,"000002540","URUBAMBA","02","07","13","01","0207","000002540 - URUBAMBA"]
[null,null,null,null,null,null,null,null,null,null,null,null,null,147,"000002541","YANAHUARA","02","07","13","01","0207","000002541 - YANAHUARA"]
[null,null,null,null,null,null,null,null,null,null,null,null,null,148,"000010060","CAS URUBAMBA -ESSALUD","02","07","13","01","0207","000010060 - CAS URUBAMBA -ESSALUD"]
[null,null,null,null,null,null,null,null,null,null,null,null,null,149,"000030666","MENTAL COMUNITARIO URUBAMBA","02","07","13","01","0207","000030666 - MENTAL COMUNITARIO URUBAMBA"]
[null,null,null,null,null,null,null,null,null,null,null,null,null,150,"000035851","URUBAMBA - ESSALUD","02","07","13","01","0207","000035851 - URUBAMBA - ESSALUD"]
[null,null,null,null,null,null,null,null,null,null,null,null,null,151,"000002543","CHINCHERO","02","07","13","02","0207","000002543 - CHINCHERO"]
[null,null,null,null,null,null,null,null,null,null,null,null,null,152,"000002544","OCCOTUAN","02","07","13","02","0207","000002544 - OCCOTUAN"]
[null,null,null,null,null,null,null,null,null,null,null,null,null,153,"000002545","HUAYLLABAMBA","02","07","13","03","0207","000002545 - HUAYLLABAMBA"]
[null,null,null,null,null,null,null,null,null,null,null,null,null,154,"000002546","MACHUPICCHU","02","07","13","04","0207","000002546 - MACHUPICCHU"]
[null,null,null,null,null,null,null,null,null,null,null,null,null,155,"000002547","COLLPANI","02","07","13","04","0207","000002547 - COLLPANI"]
[null,null,null,null,null,null,null,null,null,null,null,null,null,156,"000006974","CAMINO INCA HUAYLLABAMBA","02","07","13","04","0207","000006974 - CAMINO INCA HUAYLLABAMBA"]
[null,null,null,null,null,null,null,null,null,null,null,null,null,157,"000010073","MACHU PICCHU - ESSALUD","02","07","13","04","0207","000010073 - MACHU PICCHU - ESSALUD"]
[null,null,null,null,null,null,null,null,null,null,null,null,null,158,"000002548","MARAS","02","07","13","05","0207","000002548 - MARAS"]
[null,null,null,null,null,null,null,null,null,null,null,null,null,159,"000010758","CRUZPATA","02","07","13","05","0207","000010758 - CRUZPATA"]
[null,null,null,null,null,null,null,null,null,null,null,null,null,160,"000002549","OLLANTAYTAMBO","02","07","13","06","0207","000002549 - OLLANTAYTAMBO"]
[null,null,null,null,null,null,null,null,null,null,null,null,null,161,"000002550","CHILLCA","02","07","13","06","0207","000002550 - CHILLCA"]
[null,null,null,null,null,null,null,null,null,null,null,null,null,162,"000010760","PATACANCHA","02","07","13","06","0207","000010760 - PATACANCHA"]
[null,null,null,null,null,null,null,null,null,null,null,null,null,163,"000002551","YUCAY","02","07","13","07","0207","000002551 - YUCAY"]
[null,null,null,null,null,null,null,null,null,null,null,null,null,164,"000000000","(All)","02","08",null,null,"0208","000000000 - (All)"]
[null,null,null,null,null,null,null,null,null,null,null,null,null,165,"000002355","LA QUEBRADA","02","08","04","08","0208","000002355 - LA QUEBRADA"]
[null,null,null,null,null,null,null,null,null,null,null,null,null,166,"000002356","CCORIMAYO","02","08","04","08","0208","000002356 - CCORIMAYO"]
[null,null,null,null,null,null,null,null,null,null,null,null,null,167,"000002357","COLCCA YANATILE","02","08","04","08","0208","000002357 - COLCCA YANATILE"]
[null,null,null,null,null,null,null,null,null,null,null,null,null,168,"000002358","MUYUPAY","02","08","04","08","0208","000002358 - MUYUPAY"]
[null,null,null,null,null,null,null,null,null,null,null,null,null,169,"000002359","PUTUCUSI","02","08","04","08","0208","000002359 - PUTUCUSI"]
[null,null,null,null,null,null,null,null,null,null,null,null,null,170,"000002360","QUESQUENTO","02","08","04","08","0208","000002360 - QUESQUENTO"]
[null,null,null,null,null,null,null,null,null,null,null,null,null,171,"000002362","HUACHIBAMBA","02","08","04","08","0208","000002362 - HUACHIBAMBA"]
[null,null,null,null,null,null,null,null,null,null,null,null,null,172,"000006971","COMBAPATA YANATILE","02","08","04","08","0208","000006971 - COMBAPATA YANATILE"]
[null,null,null,null,null,null,null,null,null,null,null,null,null,173,"000006973","BELLAVISTA","02","08","04","08","0208","000006973 - BELLAVISTA"]
[null,null,null,null,null,null,null,null,null,null,null,null,null,174,"000007142","CHANCAMAYO","02","08","04","08","0208","000007142 - CHANCAMAYO"]
[null,null,null,null,null,null,null,null,null,null,null,null,null,175,"000002464","VERSALLES","02","08","09","05","0208","000002464 - VERSALLES"]
[null,null,null,null,null,null,null,null,null,null,null,null,null,176,"000002467","PUENTE SANTIAGO","02","08","09","06","0208","000002467 - PUENTE SANTIAGO"]
[null,null,null,null,null,null,null,null,null,null,null,null,null,177,"000000000","(All)","02","09",null,null,"0209","000000000 - (All)"]
[null,null,null,null,null,null,null,null,null,null,null,null,null,178,"000002290","SAN PEDRO CUSCO","02","09","01","01","0209","000002290 - SAN PEDRO CUSCO"]
[null,null,null,null,null,null,null,null,null,null,null,null,null,179,"000002291","SIETE CUARTONES","02","09","01","01","0209","000002291 - SIETE CUARTONES"]
[null,null,null,null,null,null,null,null,null,null,null,null,null,180,"000002293","MIRAFLORES","02","09","01","01","0209","000002293 - MIRAFLORES"]
[null,null,null,null,null,null,null,null,null,null,null,null,null,{"$f":"+N204+1","v":181},"000002294","PICCHU LA RINCONADA","02","09","01","01","0209","000002294 - PICCHU LA RINCONADA"]
[null,null,null,null,null,null,null,null,null,null,null,null,null,182,"000002295","BUENA VISTA","02","09","01","01","0209","000002295 - BUENA VISTA"]
[null,null,null,null,null,null,null,null,null,null,null,null,null,183,"000002299","POROY","02","09","01","03","0209","000002299 - POROY"]
[null,null,null,null,null,null,null,null,null,null,null,null,null,184,"999999999","(All)","02","99",null,null,"0299","999999999 - (All)"]
[null,null,null,null,null,null,null,null,null,null,null,null,null,185,"000002421","QUILLABAMBA","03","00","09","01","0300","000002421 - QUILLABAMBA"]
[null,null,null,null,null,null,null,null,null,null,null,null,null,186,"000000000","(All)","03","01",null,null,"0301","000000000 - (All)"]
[null,null,null,null,null,null,null,null,null,null,null,null,null,187,"000002422","HUAYANAY","03","01","09","01","0301","000002422 - HUAYANAY"]
[null,null,null,null,null,null,null,null,null,null,null,null,null,188,"000002423","IDMA","03","01","09","01","0301","000002423 - IDMA"]
[null,null,null,null,null,null,null,null,null,null,null,null,null,189,"000002424","POTRERO","03","01","09","01","0301","000002424 - POTRERO"]
[null,null,null,null,null,null,null,null,null,null,null,null,null,190,"000008910","SANTA ANA","03","01","09","01","0301","000008910 - SANTA ANA"]
[null,null,null,null,null,null,null,null,null,null,null,null,null,191,"000010062","QUILLABAMBA - ESSALUD","03","01","09","01","0301","000010062 - QUILLABAMBA - ESSALUD"]
[null,null,null,null,null,null,null,null,null,null,null,null,null,192,"000011744","POSTA MEDICO POLICIAL LA CONVENCION - QUILLABAMBA","03","01","09","01","0301","000011744 - POSTA MEDICO POLICIAL LA CONVENCION - QUILLABAMBA"]
[null,null,null,null,null,null,null,null,null,null,null,null,null,193,"000015842","PAVAYOC","03","01","09","01",{"$f":"CONCATENATE(Q217,R217)","v":"0301"},{"$f":"CONCATENATE(O217,\" - \",P217)","v":"000015842 - PAVAYOC"}]
[null,null,null,null,null,null,null,null,null,null,null,null,null,194,"000024653","INPE QUILLABAMBA","03","01","09","01","0301","000024653 - INPE QUILLABAMBA"]
[null,null,null,null,null,null,null,null,null,null,null,null,null,195,"000026386","MENTAL QUILLABAMBA","03","01","09","01","0301","000026386 - MENTAL QUILLABAMBA"]
[null,null,null,null,null,null,null,null,null,null,null,null,null,196,"000002425","ECHARATE","03","01","09","02","0301","000002425 - ECHARATE"]
[null,null,null,null,null,null,null,null,null,null,null,null,null,197,"000002430","PAMPA CONCEPCION","03","01","09","02","0301","000002430 - PAMPA CONCEPCION"]
[null,null,null,null,null,null,null,null,null,null,null,null,null,198,"000002446","CHACCO","03","01","09","02","0301","000002446 - CHACCO"]
[null,null,null,null,null,null,null,null,null,null,null,null,null,199,"000002451","CHAHUARES","03","01","09","02","0301","000002451 - CHAHUARES"]
[null,null,null,null,null,null,null,null,null,null,null,null,null,200,"000033273","SAN ISIDRO LABRADOR - ECHARATI","03","01","09","02","0301","000033273 - SAN ISIDRO LABRADOR - ECHARATI"]
[null,null,null,null,null,null,null,null,null,null,null,null,null,201,"000024296","EJERCITO-MIARIA 334","03","01","09","02","0301","000024296 - EJERCITO-MIARIA 334"]
[null,null,null,null,null,null,null,null,null,null,null,null,null,202,"000000000","(All)","03","02",null,null,"0302","000000000 - (All)"]
[null,null,null,null,null,null,null,null,null,null,null,null,null,203,"000002453","HUYRO","03","02","09","03","0302","000002453 - HUYRO"]
[null,null,null,null,null,null,null,null,null,null,null,null,null,204,"000002454","ALFAMAYO","03","02","09","03","0302","000002454 - ALFAMAYO"]
[null,null,null,null,null,null,null,null,null,null,null,null,null,205,"000002455","HUAYOPATA","03","02","09","03","0302","000002455 - HUAYOPATA"]
[null,null,null,null,null,null,null,null,null,null,null,null,null,206,"000002456","AMAYBAMBA","03","02","09","03","0302","000002456 - AMAYBAMBA"]
[null,null,null,null,null,null,null,null,null,null,null,null,null,207,"000002457","SAN PABLO HUAYOPATA","03","02","09","03","0302","000002457 - SAN PABLO HUAYOPATA"]
[null,null,null,null,null,null,null,null,null,null,null,null,null,208,"000010075","CAP HUYRO - ESSALUD","03","02","09","03","0302","000010075 - CAP HUYRO - ESSALUD"]
[null,null,null,null,null,null,null,null,null,null,null,null,null,209,"000002458","MARANURA","03","02","09","04","0302","000002458 - MARANURA"]
[null,null,null,null,null,null,null,null,null,null,null,null,null,210,"000002460","SANTA MARIA","03","02","09","04","0302","000002460 - SANTA MARIA"]
[null,null,null,null,null,null,null,null,null,null,null,null,null,211,"000002461","UCHUMAYO","03","02","09","04","0302","000002461 - UCHUMAYO"]
[null,null,null,null,null,null,null,null,null,null,null,null,null,212,"000002476","SANTA TERESA","03","02","09","08","0302","000002476 - SANTA TERESA"]
[null,null,null,null,null,null,null,null,null,null,null,null,null,213,"000002477","SULLUCUYOC","03","02","09","08","0302","000002477 - SULLUCUYOC"]
[null,null,null,null,null,null,null,null,null,null,null,null,null,214,"000002478","TOTORA","03","02","09","08","0302","000002478 - TOTORA"]
[null,null,null,null,null,null,null,null,null,null,null,null,null,215,"000000000","(All)","03","03",null,null,"0303","000000000 - (All)"]
[null,null,null,null,null,null,null,null,null,null,null,null,null,216,"000002363","TUPAC AMARU QUELLOUNO","03","03","04","08","0303","000002363 - TUPAC AMARU QUELLOUNO"]
[null,null,null,null,null,null,null,null,null,null,null,null,null,217,"000002462","OCCOBAMBA LACONVENCION","03","03","09","05","0303","000002462 - OCCOBAMBA LACONVENCION"]
[null,null,null,null,null,null,null,null,null,null,null,null,null,218,"000002463","CHINGANILLA","03","03","09","05","0303","000002463 - CHINGANILLA"]
[null,null,null,null,null,null,null,null,null,null,null,null,null,219,"000002465","QUELLOUNO","03","03","09","06","0303","000002465 - QUELLOUNO"]
[null,null,null,null,null,null,null,null,null,null,null,null,null,220,"000002466","HUILLCAPAMPA","03","03","09","06","0303","000002466 - HUILLCAPAMPA"]
[null,null,null,null,null,null,null,null,null,null,null,null,null,221,"000002468","SAN MARTIN","03","03","09","06","0303","000002468 - SAN MARTIN"]
[null,null,null,null,null,null,null,null,null,null,null,null,null,222,"000008906","ESTRELLA","03","03","09","06","0303","000008906 - ESTRELLA"]
[null,null,null,null,null,null,null,null,null,null,null,null,null,223,"000008907","MATORIATO","03","03","09","06","0303","000008907 - MATORIATO"]
[null,null,null,null,null,null,null,null,null,null,null,null,null,224,"000008908","CHIRUMBIA","03","03","09","06","0303","000008908 - CHIRUMBIA"]
[null,null,null,null,null,null,null,null,null,null,null,null,null,225,"000008909","CHAPO BOYERO","03","03","09","06","0303","000008909 - CHAPO BOYERO"]
[null,null,null,null,null,null,null,null,null,null,null,null,null,226,"000000000","(All)","03","04",null,null,"0304","000000000 - (All)"]
[null,null,null,null,null,null,null,null,null,null,null,null,null,227,"000002427","KITENI","03","04","09","02","0304","000002427 - KITENI"]
[null,null,null,null,null,null,null,null,null,null,null,null,null,228,"000002431","IVOCHOTE","03","04","09","02","0304","000002431 - IVOCHOTE"]
[null,null,null,null,null,null,null,null,null,null,null,null,null,229,"000002438","PACHIRI","03","04","09","02","0304","000002438 - PACHIRI"]
[null,null,null,null,null,null,null,null,null,null,null,null,null,230,"000002440","PANGOA","03","04","09","02","0304","000002440 - PANGOA"]
[null,null,null,null,null,null,null,null,null,null,null,null,null,231,"000002443","SANIRIATO","03","04","09","02","0304","000002443 - SANIRIATO"]
[null,null,null,null,null,null,null,null,null,null,null,null,null,232,"000002447","KAMANQUIRIATO","03","04","09","02","0304","000002447 - KAMANQUIRIATO"]
[null,null,null,null,null,null,null,null,null,null,null,null,null,233,"000014531","CAP I ECHARATE - KITENI","03","04","09","02","0304","000014531 - CAP I ECHARATE - KITENI"]
[null,null,null,null,null,null,null,null,null,null,null,null,null,234,"000024583","BCT N° 314 - KEPASHIATO","03","04","09","02","0304","000024583 - BCT N° 314 - KEPASHIATO"]
[null,null,null,null,null,null,null,null,null,null,null,null,null,235,"000002489","YUVENI","03","04","09","09","0304","000002489 - YUVENI"]
[null,null,null,null,null,null,null,null,null,null,null,null,null,236,"000002493","SELVA ALEGRE","03","04","09","09","0304","000002493 - SELVA ALEGRE"]
[null,null,null,null,null,null,null,null,null,null,null,null,null,237,"000006976","CHONTABAMBA","03","04","09","09","0304","000006976 - CHONTABAMBA"]
[null,null,null,null,null,null,null,null,null,null,null,null,null,238,"000002432","KEPASHIATO","03","04","09","15","0304","000002432 - KEPASHIATO"]
[null,null,null,null,null,null,null,null,null,null,null,null,null,239,"000002434","MATERIATO","03","04","09","15","0304","000002434 - MATERIATO"]
[null,null,null,null,null,null,null,null,null,null,null,null,null,240,"000013068","TRIO RIO","03","04","09","15","0304","000013068 - TRIO RIO"]
[null,null,null,null,null,null,null,null,null,null,null,null,null,241,"000013069","PUGUIENTIMARI","03","04","09","15","0304","000013069 - PUGUIENTIMARI"]
[null,null,null,null,null,null,null,null,null,null,null,null,null,242,"000000000","(All)","03","05",null,null,"0305","000000000 - (All)"]
[null,null,null,null,null,null,null,null,null,null,null,null,null,243,"000002426","KIRIGUETI","03","05","09","14","0305","000002426 - KIRIGUETI"]
[null,null,null,null,null,null,null,null,null,null,null,null,null,244,"000002428","CHOCORIARI","03","05","09","14","0305","000002428 - CHOCORIARI"]
[null,null,null,null,null,null,null,null,null,null,null,null,null,{"$f":"+N268+1","v":245},"000002435","MIARIA","03","05","09","14","0305","000002435 - MIARIA"]
[null,null,null,null,null,null,null,null,null,null,null,null,null,246,"000002436","NUEVA LUZ","03","05","09","14","0305","000002436 - NUEVA LUZ"]
[null,null,null,null,null,null,null,null,null,null,null,null,null,247,"000002437","NUEVO MUNDO","03","05","09","14","0305","000002437 - NUEVO MUNDO"]
[null,null,null,null,null,null,null,null,null,null,null,null,null,248,"000002441","PUERTO HUALLANA","03","05","09","14","0305","000002441 - PUERTO HUALLANA"]
[null,null,null,null,null,null,null,null,null,null,null,null,null,249,"000002442","PUERTO RICO","03","05","09","14","0305","000002442 - PUERTO RICO"]
[null,null,null,null,null,null,null,null,null,null,null,null,null,250,"000002444","SENSA","03","05","09","14","0305","000002444 - SENSA"]
[null,null,null,null,null,null,null,null,null,null,null,null,null,251,"000002445","TIMPIA","03","05","09","14","0305","000002445 - TIMPIA"]
[null,null,null,null,null,null,null,null,null,null,null,null,null,252,"000002448","KAMISEA","03","05","09","14","0305","000002448 - KAMISEA"]
[null,null,null,null,null,null,null,null,null,null,null,null,null,253,"000002452","SHIVANKORENI","03","05","09","14","0305","000002452 - SHIVANKORENI"]
[null,null,null,null,null,null,null,null,null,null,null,null,null,254,"000013066","MONTETONI","03","05","09","14","0305","000013066 - MONTETONI"]
[null,null,null,null,null,null,null,null,null,null,null,null,null,255,"000013067","TANGOSHIARI","03","05","09","14","0305","000013067 - TANGOSHIARI"]
[null,null,null,null,null,null,null,null,null,null,null,null,null,256,"000015235","NUEVA VIDA","03","05","09","14","0305","000015235 - NUEVA VIDA"]
[null,null,null,null,null,null,null,null,null,null,null,null,null,257,"000015843","CASHIRIARI","03","05","09","14",{"$f":"CONCATENATE(Q281,R281)","v":"0305"},{"$f":"CONCATENATE(O281,\" - \",P281)","v":"000015843 - CASHIRIARI"}]
[null,null,null,null,null,null,null,null,null,null,null,null,null,258,"000015844","CAMANA","03","05","09","14","0305","000015844 - CAMANA"]
[null,null,null,null,null,null,null,null,null,null,null,null,null,259,"000000000","(All)","03","06",null,null,"0306","000000000 - (All)"]
[null,null,null,null,null,null,null,null,null,null,null,null,null,260,"000002480","PUCYURA","03","06","09","09","0306","000002480 - PUCYURA"]
[null,null,null,null,null,null,null,null,null,null,null,null,null,261,"000002484","OYARA","03","06","09","09","0306","000002484 - OYARA"]
[null,null,null,null,null,null,null,null,null,null,null,null,null,262,"000002486","PAMPACONAS","03","06","09","09","0306","000002486 - PAMPACONAS"]
[null,null,null,null,null,null,null,null,null,null,null,null,null,263,"000002490","ARMA","03","06","09","09","0306","000002490 - ARMA"]
[null,null,null,null,null,null,null,null,null,null,null,null,null,264,"000002492","PALTAYBAMBA","03","06","09","09","0306","000002492 - PALTAYBAMBA"]
[null,null,null,null,null,null,null,null,null,null,null,null,null,265,"000002481","CCARCCO","03","06","09","11","0306","000002481 - CCARCCO"]
[null,null,null,null,null,null,null,null,null,null,null,null,null,266,"000002482","INCAHUASI","03","06","09","11","0306","000002482 - INCAHUASI"]
[null,null,null,null,null,null,null,null,null,null,null,null,null,267,"000002485","PACCAYBAMBA","03","06","09","11","0306","000002485 - PACCAYBAMBA"]
[null,null,null,null,null,null,null,null,null,null,null,null,null,268,"000002487","CHOQUETIRA","03","06","09","11","0306","000002487 - CHOQUETIRA"]
[null,null,null,null,null,null,null,null,null,null,null,null,null,269,"000002491","LUCMAHUAYCO","03","06","09","11","0306","000002491 - LUCMAHUAYCO"]
[null,null,null,null,null,null,null,null,null,null,null,null,null,270,"000035520","CHANCAVINE","03","06","09","12","0306","000035520 - CHANCAVINE"]
[null,null,null,null,null,null,null,null,null,null,null,null,null,271,"000000000","(All)","03","07",null,null,"0307","000000000 - (All)"]
[null,null,null,null,null,null,null,null,null,null,null,null,null,272,"000002429","CIRIALO","03","07","09","02","0307","000002429 - CIRIALO"]
[null,null,null,null,null,null,null,null,null,null,null,null,null,273,"000002433","KORIBENI","03","07","09","02","0307","000002433 - KORIBENI"]
[null,null,null,null,null,null,null,null,null,null,null,null,null,274,"000002439","PALMA REAL","03","07","09","02","0307","000002439 - PALMA REAL"]
[null,null,null,null,null,null,null,null,null,null,null,null,null,275,"000002449","ICHIQUIATO","03","07","09","02","0307","000002449 - ICHIQUIATO"]
[null,null,null,null,null,null,null,null,null,null,null,null,null,276,"000002450","SAN ANTONIO","03","07","09","02","0307","000002450 - SAN ANTONIO"]
[null,null,null,null,null,null,null,null,null,null,null,null,null,277,"999999999","(All)","03","99",null,null,"0399","999999999 - (All)"]
[null,null,null,null,null,null,null,null,null,null,null,null,null,278,"000000000","(All)","04","00",null,null,"0400","000000000 - (All)"]
[null,null,null,null,null,null,null,null,null,null,null,null,null,279,"000002378","SICUANI","04","00","06","01","0400","000002378 - SICUANI"]
[null,null,null,null,null,null,null,null,null,null,null,null,null,280,"000007135","ESPINAR","04","00","08","01","0400","000007135 - ESPINAR"]
[null,null,null,null,null,null,null,null,null,null,null,null,null,281,"000000000","(All)","04","01",null,null,"0401","000000000 - (All)"]
[null,null,null,null,null,null,null,null,null,null,null,null,null,282,"000002364","YANAOCA","04","01","05","01","0401","000002364 - YANAOCA"]
[null,null,null,null,null,null,null,null,null,null,null,null,null,283,"000002365","PONGOÑA","04","01","05","01","0401","000002365 - PONGOÑA"]
[null,null,null,null,null,null,null,null,null,null,null,null,null,284,"000018241","HAMPATURA","04","01","05","01","0401","000018241 - HAMPATURA"]
[null,null,null,null,null,null,null,null,null,null,null,null,null,285,"000002367","CHITIBAMBA","04","01","05","02","0401","000002367 - CHITIBAMBA"]
[null,null,null,null,null,null,null,null,null,null,null,null,null,286,"000002372","PAMPAMARCA","04","01","05","06","0401","000002372 - PAMPAMARCA"]
[null,null,null,null,null,null,null,null,null,null,null,null,null,287,"000002373","QUEHUE","04","01","05","07","0401","000002373 - QUEHUE"]
[null,null,null,null,null,null,null,null,null,null,null,null,null,288,"000002374","HUINCHIRI","04","01","05","07","0401","000002374 - HUINCHIRI"]
[null,null,null,null,null,null,null,null,null,null,null,null,null,289,"000034449","CHAUPIBANDA","04","01","05","07","0401","000034449 - CHAUPIBANDA"]
[null,null,null,null,null,null,null,null,null,null,null,null,null,290,"000002375","SURIMANA","04","01","05","08","0401","000002375 - SURIMANA"]
[null,null,null,null,null,null,null,null,null,null,null,null,null,291,"000002376","TUNGASUCA","04","01","05","08","0401","000002376 - TUNGASUCA"]
[null,null,null,null,null,null,null,null,null,null,null,null,null,292,"000002377","TOCCOCCORI","04","01","05","08","0401","000002377 - TOCCOCCORI"]
[null,null,null,null,null,null,null,null,null,null,null,null,null,293,"000032339","CCOCHAPATA","04","01","05","08","0401","000032339 - CCOCHAPATA"]
[null,null,null,null,null,null,null,null,null,null,null,null,null,294,"000000000","(All)","04","02",null,null,"0402","000000000 - (All)"]
[null,null,null,null,null,null,null,null,null,null,null,null,null,295,"000002366","CHECCA","04","02","05","02","0402","000002366 - CHECCA"]
[null,null,null,null,null,null,null,null,null,null,null,null,null,296,"000007700","EL DESCANSO","04","02","05","03","0402","000007700 - EL DESCANSO"]
[null,null,null,null,null,null,null,null,null,null,null,null,null,297,"000002369","LANGUI","04","02","05","04","0402","000002369 - LANGUI"]
[null,null,null,null,null,null,null,null,null,null,null,null,null,298,"000002370","CONDEVILUYO","04","02","05","04","0402","000002370 - CONDEVILUYO"]
[null,null,null,null,null,null,null,null,null,null,null,null,null,299,"000002371","LAYO","04","02","05","05","0402","000002371 - LAYO"]
[null,null,null,null,null,null,null,null,null,null,null,null,null,300,"000000000","(All)","04","03",null,null,"0403","000000000 - (All)"]
[null,null,null,null,null,null,null,null,null,null,null,null,null,301,"000002320","MOSOCLLACTA","04","03","02","04","0403","000002320 - MOSOCLLACTA"]
[null,null,null,null,null,null,null,null,null,null,null,null,null,302,"000034929","CHECACUPE","04","03","06","02","0403","000034929 - CHECACUPE"]
[null,null,null,null,null,null,null,null,null,null,null,null,null,303,"000002386","COMBAPATA CANCHIS","04","03","06","03","0403","000002386 - COMBAPATA CANCHIS"]
[null,null,null,null,null,null,null,null,null,null,null,null,null,304,"000034448","CHIARA","04","03","06","03","0403","000034448 - CHIARA"]
[null,null,null,null,null,null,null,null,null,null,null,null,null,305,"000034887","PITUMARCA","04","03","06","05","0403","000034887 - PITUMARCA"]
[null,null,null,null,null,null,null,null,null,null,null,null,null,306,"000002397","TINTA","04","03","06","08","0403","000002397 - TINTA"]
[null,null,null,null,null,null,null,null,null,null,null,null,null,307,"000000000","(All)","04","04",null,null,"0404","000000000 - (All)"]
[null,null,null,null,null,null,null,null,null,null,null,null,null,308,"000002379","HERCCA","04","04","06","01","0404","000002379 - HERCCA"]
[null,null,null,null,null,null,null,null,null,null,null,null,null,{"$f":"+N332+1","v":309},"000002380","TECHO OBRERO","04","04","06","01","0404","000002380 - TECHO OBRERO"]
[null,null,null,null,null,null,null,null,null,null,null,null,null,310,"000010063","ESSALUD SICUANI","04","04","06","01","0404","000010063 - ESSALUD SICUANI"]
[null,null,null,null,null,null,null,null,null,null,null,null,null,311,"000024639","INPE SICUANI","04","04","06","01","0404","000024639 - INPE SICUANI"]
[null,null,null,null,null,null,null,null,null,null,null,null,null,312,"000024663","SANIDAD PNP  SICUANI","04","04","06","01","0404","000024663 - SANIDAD PNP  SICUANI"]
[null,null,null,null,null,null,null,null,null,null,null,null,null,313,"000002388","MARANGANI","04","04","06","04","0404","000002388 - MARANGANI"]
[null,null,null,null,null,null,null,null,null,null,null,null,null,314,"000002389","CHECTUYOC","04","04","06","04","0404","000002389 - CHECTUYOC"]
[null,null,null,null,null,null,null,null,null,null,null,null,null,315,"000002390","CCUYO","04","04","06","04","0404","000002390 - CCUYO"]
[null,null,null,null,null,null,null,null,null,null,null,null,null,316,"000002391","OCCOBAMBA MARANGANI","04","04","06","04","0404","000002391 - OCCOBAMBA MARANGANI"]
[null,null,null,null,null,null,null,null,null,null,null,null,null,317,"000000000","(All)","04","05",null,null,"0405","000000000 - (All)"]
[null,null,null,null,null,null,null,null,null,null,null,null,null,318,"000002381","QUEHUAR","04","05","06","01","0405","000002381 - QUEHUAR"]
[null,null,null,null,null,null,null,null,null,null,null,null,null,319,"000002382","UZCUPATA","04","05","06","01","0405","000002382 - UZCUPATA"]
[null,null,null,null,null,null,null,null,null,null,null,null,null,320,"000002383","LA FLORIDA","04","05","06","01","0405","000002383 - LA FLORIDA"]
[null,null,null,null,null,null,null,null,null,null,null,null,null,321,"000026387","MENTAL COMUNITARIO SICUANI","04","05","06","01","0405","000026387 - MENTAL COMUNITARIO SICUANI"]
[null,null,null,null,null,null,null,null,null,null,null,null,null,322,"000032923","SR DE PAMPACUCHO-SICUANI","04","05","06","01","0405","000032923 - SR DE PAMPACUCHO-SICUANI"]
[null,null,null,null,null,null,null,null,null,null,null,null,null,323,"000035845","PAMPAPHALLA","04","05","06","01","0405","000035845 - PAMPAPHALLA"]
[null,null,null,null,null,null,null,null,null,null,null,null,null,324,"000035848","MENTAL COMUNITARIO SICUANI","04","05","06","01",{"$f":"CONCATENATE(Q348,R348)","v":"0405"},{"$f":"CONCATENATE(O348,\" - \",P348)","v":"000035848 - MENTAL COMUNITARIO SICUANI"}]
[null,null,null,null,null,null,null,null,null,null,null,null,null,325,"000002393","PHINAYA","04","05","06","05","0405","000002393 - PHINAYA"]
[null,null,null,null,null,null,null,null,null,null,null,null,null,326,"000002394","SAN PABLO CANCHIS","04","05","06","06","0405","000002394 - SAN PABLO CANCHIS"]
[null,null,null,null,null,null,null,null,null,null,null,null,null,327,"000002395","SANTA BARBARA","04","05","06","06","0405","000002395 - SANTA BARBARA"]
[null,null,null,null,null,null,null,null,null,null,null,null,null,328,"000002396","SAN PEDRO CANCHIS","04","05","06","07","0405","000002396 - SAN PEDRO CANCHIS"]
[null,null,null,null,null,null,null,null,null,null,null,null,null,329,"000000000","(All)","04","06",null,null,"0406","000000000 - (All)"]
[null,null,null,null,null,null,null,null,null,null,null,null,null,330,"000002410","YAURI","04","06","08","01","0406","000002410 - YAURI"]
[null,null,null,null,null,null,null,null,null,null,null,null,null,331,"000006745","TINTAYA MARQUIRI","04","06","08","01","0406","000006745 - TINTAYA MARQUIRI"]
[null,null,null,null,null,null,null,null,null,null,null,null,null,332,"000010061","ESPINAR - ESSALUD","04","06","08","01","0406","000010061 - ESPINAR - ESSALUD"]
[null,null,null,null,null,null,null,null,null,null,null,null,null,333,"000030366","MENTAL COMUNITARIO ESPINAR \"MUSUQ KAWSAY\"","04","06","08","01","0406","000030366 - MENTAL COMUNITARIO ESPINAR \"MUSUQ KAWSAY\""]
[null,null,null,null,null,null,null,null,null,null,null,null,null,334,"000002411","CONDOROMA","04","06","08","02","0406","000002411 - CONDOROMA"]
[null,null,null,null,null,null,null,null,null,null,null,null,null,335,"000002412","COPORAQUE","04","06","08","03","0406","000002412 - COPORAQUE"]
[null,null,null,null,null,null,null,null,null,null,null,null,null,336,"000002413","URINSAYA","04","06","08","03","0406","000002413 - URINSAYA"]
[null,null,null,null,null,null,null,null,null,null,null,null,null,337,"000002414","HUAYHUAHUASI","04","06","08","03","0406","000002414 - HUAYHUAHUASI"]
[null,null,null,null,null,null,null,null,null,null,null,null,null,338,"000002415","OCCORURO","04","06","08","04","0406","000002415 - OCCORURO"]
[null,null,null,null,null,null,null,null,null,null,null,null,null,339,"000002416","PALLPATA","04","06","08","05","0406","000002416 - PALLPATA"]
[null,null,null,null,null,null,null,null,null,null,null,null,null,340,"000002418","SAN MIGUEL","04","06","08","06","0406","000002418 - SAN MIGUEL"]
[null,null,null,null,null,null,null,null,null,null,null,null,null,341,"000034450","PICHIGUA ESPINAR","04","06","08","06","0406","000034450 - PICHIGUA ESPINAR"]
[null,null,null,null,null,null,null,null,null,null,null,null,null,342,"000002419","SUYKUTAMBO","04","06","08","07","0406","000002419 - SUYKUTAMBO"]
[null,null,null,null,null,null,null,null,null,null,null,null,null,343,"000002420","ACCOCUNCA","04","06","08","08","0406","000002420 - ACCOCUNCA"]
[null,null,null,null,null,null,null,null,null,null,null,null,null,344,"999999999","(All)","04","99",null,null,"0499","999999999 - (All)"]
[null,null,null,null,null,null,null,null,null,null,null,null,null,345,"000002469","SAN JUAN DE KIMBIRI-VRAEM","05","00","09","07","0500","000002469 - SAN JUAN DE KIMBIRI-VRAEM"]
[null,null,null,null,null,null,null,null,null,null,null,null,null,346,"000000000","(All)","05","01",null,null,"0501","000000000 - (All)"]
[null,null,null,null,null,null,null,null,null,null,null,null,null,347,"000002472","MAPITUNARI","05","01","09","07","0501","000002472 - MAPITUNARI"]
[null,null,null,null,null,null,null,null,null,null,null,null,null,348,"000002474","SAMANIATO","05","01","09","07","0501","000002474 - SAMANIATO"]
[null,null,null,null,null,null,null,null,null,null,null,null,null,349,"000002475","KIMBIRI ALTO","05","01","09","07","0501","000002475 - KIMBIRI ALTO"]
[null,null,null,null,null,null,null,null,null,null,null,null,null,350,"000008285","ANGELES","05","01","09","07","0501","000008285 - ANGELES"]
[null,null,null,null,null,null,null,null,null,null,null,null,null,351,"000002479","VILLA VIRGEN","05","01","09","12","0501","000002479 - VILLA VIRGEN"]
[null,null,null,null,null,null,null,null,null,null,null,null,null,352,"000024957","BTC LA OROYA  N°34 VILLA VIRGEN","05","01","09","12","0501","000024957 - BTC LA OROYA  N°34 VILLA VIRGEN"]
[null,null,null,null,null,null,null,null,null,null,null,null,null,353,"000002488","VILLA KINTIARINA","05","01","09","13","0501","000002488 - VILLA KINTIARINA"]
[null,null,null,null,null,null,null,null,null,null,null,null,null,354,"000008283","PUEBLO LIBRE","05","01","09","13","0501","000008283 - PUEBLO LIBRE"]
[null,null,null,null,null,null,null,null,null,null,null,null,null,355,"000002470","CHIRUMPIARI","05","01","09","16","0501","000002470 - CHIRUMPIARI"]
[null,null,null,null,null,null,null,null,null,null,null,null,null,356,"000002471","LOBO TAHUANTINSUYO","05","01","09","17","0501","000002471 - LOBO TAHUANTINSUYO"]
[null,null,null,null,null,null,null,null,null,null,null,null,null,357,"000002473","UNION ROSALES","05","01","09","17","0501","000002473 - UNION ROSALES"]
[null,null,null,null,null,null,null,null,null,null,null,null,null,358,"000008284","MANITEA ALTA","05","01","09","17","0501","000008284 - MANITEA ALTA"]
[null,null,null,null,null,null,null,null,null,null,null,null,null,359,"000000000","(All)","05","02",null,null,"0502","000000000 - (All)"]
[null,null,null,null,null,null,null,null,null,null,null,null,null,360,"000002496","OMAYA","05","02","09","10","0502","000002496 - OMAYA"]
[null,null,null,null,null,null,null,null,null,null,null,null,null,361,"000002497","OTARI","05","02","09","10","0502","000002497 - OTARI"]
[null,null,null,null,null,null,null,null,null,null,null,null,null,362,"000002498","PUERTO MAYO","05","02","09","10","0502","000002498 - PUERTO MAYO"]
[null,null,null,null,null,null,null,null,null,null,null,null,null,363,"000007113","NATIVIDAD","05","02","09","10","0502","000007113 - NATIVIDAD"]
[null,null,null,null,null,null,null,null,null,null,null,null,null,364,"000007114","QUISTO CENTRAL","05","02","09","10","0502","000007114 - QUISTO CENTRAL"]
[null,null,null,null,null,null,null,null,null,null,null,null,null,365,"000015104","TAMBO DEL ENE","05","02","09","10","0502","000015104 - TAMBO DEL ENE"]
[null,null,null,null,null,null,null,null,null,null,null,null,null,366,"000015170","PICHARI BAJA","05","02","09","10","0502","000015170 - PICHARI BAJA"]
[null,null,null,null,null,null,null,null,null,null,null,null,null,367,"000024638","MILITAR PICHARI","05","02","09","10","0502","000024638 - MILITAR PICHARI"]
[null,null,null,null,null,null,null,null,null,null,null,null,null,368,"000027230","MEDICA POLICIAL PICHARI","05","02","09","10","0502","000027230 - MEDICA POLICIAL PICHARI"]
[null,null,null,null,null,null,null,null,null,null,null,null,null,369,"000027948","ESSALUD PICHARI","05","02","09","10","0502","000027948 - ESSALUD PICHARI"]
[null,null,null,null,null,null,null,null,null,null,null,null,null,370,"000032211","NUEVO PROGRESO","05","02","09","10","0502","000032211 - NUEVO PROGRESO"]
[null,null,null,null,null,null,null,null,null,null,null,null,null,371,"000033988","MENTAL COMUNITARIO PICHARI","05","02","09","10","0502","000033988 - MENTAL COMUNITARIO PICHARI"]
[null,null,null,null,null,null,null,null,null,null,null,null,null,372,"000034418","PICHARI VRAEM","05","02","09","10","0502","000034418 - PICHARI VRAEM"]
[null,null,null,null,null,null,null,null,null,null,null,null,null,{"$f":"+N396+1","v":373},"000024637","EJERCITO-INCAHUASI 331","05","02","09","10","0502","000024637 - EJERCITO-INCAHUASI 331"]
[null,null,null,null,null,null,null,null,null,null,null,null,null,374,"000034417","CAP I ECHARATE - KITENI","05","02","09","10","0502","000034417 - CAP I ECHARATE - KITENI"]
[null,null,null,null,null,null,null,null,null,null,null,null,null,375,"000002495","MANTARO","05","02","09","18","0502","000002495 - MANTARO"]
[null,null,null,null,null,null,null,null,null,null,null,null,null,376,"000015169","PITIRINQUINI","05","02","09","18","0502","000015169 - PITIRINQUINI"]
[null,null,null,null,null,null,null,null,null,null,null,null,null,377,"999999999","(All)","05","99",null,null,"0599","999999999 - (All)"]
[null,null,null,null,null,null,null,null,null,null,null,null,null,378,"000002398","SANTO TOMAS","06","00","07","01","0600","000002398 - SANTO TOMAS"]
[null,null,null,null,null,null,null,null,null,null,null,null,null,379,"000000000","(All)","06","01",null,null,"0601","000000000 - (All)"]
[null,null,null,null,null,null,null,null,null,null,null,null,null,380,"000035864","CANGALLE","06","01","07","01","0601","000035864 - CANGALLE"]
[null,null,null,null,null,null,null,null,null,null,null,null,null,381,"000002402","CHAMACA","06","01","07","03","0601","000002402 - CHAMACA"]
[null,null,null,null,null,null,null,null,null,null,null,null,null,382,"000002403","AÑAHUICHI","06","01","07","03","0601","000002403 - AÑAHUICHI"]
[null,null,null,null,null,null,null,null,null,null,null,null,null,383,"000016328","UCCHUCCARCCO","06","01","07","03","0601","000016328 - UCCHUCCARCCO"]
[null,null,null,null,null,null,null,null,null,null,null,null,null,384,"000016329","INGATA","06","01","07","03","0601","000016329 - INGATA"]
[null,null,null,null,null,null,null,null,null,null,null,null,null,385,"000016330","CCONCHACCOLLO","06","01","07","03","0601","000016330 - CCONCHACCOLLO"]
[null,null,null,null,null,null,null,null,null,null,null,null,null,386,"000035861","CCACHO","06","01","07","03","0601","000035861 - CCACHO"]
[null,null,null,null,null,null,null,null,null,null,null,null,null,387,"000035863","TINCURCA","06","01","07","03","0601","000035863 - TINCURCA"]
[null,null,null,null,null,null,null,null,null,null,null,null,null,388,"000002406","LIVITACA","06","01","07","05","0601","000002406 - LIVITACA"]
[null,null,null,null,null,null,null,null,null,null,null,null,null,389,"000016325","CHILLOROYA - LIVITACA","06","01","07","05","0601","000016325 - CHILLOROYA - LIVITACA"]
[null,null,null,null,null,null,null,null,null,null,null,null,null,390,"000016327","AUSANTA","06","01","07","05","0601","000016327 - AUSANTA"]
[null,null,null,null,null,null,null,null,null,null,null,null,null,391,"000016332","PATAQUEÑA - LIVITACA","06","01","07","05","0601","000016332 - PATAQUEÑA - LIVITACA"]
[null,null,null,null,null,null,null,null,null,null,null,null,null,392,"000016334","KISIO","06","01","07","05","0601","000016334 - KISIO"]
[null,null,null,null,null,null,null,null,null,null,null,null,null,393,"000025739","PISQUICOCHA","06","01","07","05","0601","000025739 - PISQUICOCHA"]
[null,null,null,null,null,null,null,null,null,null,null,null,null,394,"000025740","TOTORA - REYNA DE LOS ANGELES","06","01","07","05","0601","000025740 - TOTORA - REYNA DE LOS ANGELES"]
[null,null,null,null,null,null,null,null,null,null,null,null,null,395,"000035860","KAYNO","06","01","07","05",{"$f":"CONCATENATE(Q419,R419)","v":"0601"},{"$f":"CONCATENATE(O419,\" - \",P419)","v":"000035860 - KAYNO"}]
[null,null,null,null,null,null,null,null,null,null,null,null,null,396,"000035862","SANTA ISABEL JALCCO","06","01","07","05","0601","000035862 - SANTA ISABEL JALCCO"]
[null,null,null,null,null,null,null,null,null,null,null,null,null,397,"000000000","(All)","06","09",null,null,"0609","000000000 - (All)"]
[null,null,null,null,null,null,null,null,null,null,null,null,null,398,"000002399","PULPERA","06","09","07","01","0609","000002399 - PULPERA"]
[null,null,null,null,null,null,null,null,null,null,null,null,null,399,"000002400","ALHUACCHULLO","06","09","07","01","0609","000002400 - ALHUACCHULLO"]
[null,null,null,null,null,null,null,null,null,null,null,null,null,400,"000006746","LLIQUE","06","09","07","01","0609","000006746 - LLIQUE"]
[null,null,null,null,null,null,null,null,null,null,null,null,null,401,"000006981","CCOYO","06","09","07","01","0609","000006981 - CCOYO"]
[null,null,null,null,null,null,null,null,null,null,null,null,null,402,"000006982","MELLOTOTORA","06","09","07","01","0609","000006982 - MELLOTOTORA"]
[null,null,null,null,null,null,null,null,null,null,null,null,null,403,"000006983","ORCCOMA","06","09","07","01","0609","000006983 - ORCCOMA"]
[null,null,null,null,null,null,null,null,null,null,null,null,null,404,"000007111","YAVINA","06","09","07","01","0609","000007111 - YAVINA"]
[null,null,null,null,null,null,null,null,null,null,null,null,null,405,"000008915","PFULLPURI CONDEPAMPA","06","09","07","01","0609","000008915 - PFULLPURI CONDEPAMPA"]
[null,null,null,null,null,null,null,null,null,null,null,null,null,406,"000013185","CAP I SANTO TOMÁS  ESSALUD","06","09","07","01","0609","000013185 - CAP I SANTO TOMÁS  ESSALUD"]
[null,null,null,null,null,null,null,null,null,null,null,null,null,407,"000030940","ARCANGEL SAN MIGUEL DE ESQUINA CONGUNYA","06","09","07","01","0609","000030940 - ARCANGEL SAN MIGUEL DE ESQUINA CONGUNYA"]
[null,null,null,null,null,null,null,null,null,null,null,null,null,408,"000002401","CCAPACMARCA","06","09","07","02","0609","000002401 - CCAPACMARCA"]
[null,null,null,null,null,null,null,null,null,null,null,null,null,409,"000009963","CANCAHUANI","06","09","07","02","0609","000009963 - CANCAHUANI"]
[null,null,null,null,null,null,null,null,null,null,null,null,null,410,"000027009","TAHUAY","06","09","07","02","0609","000027009 - TAHUAY"]
[null,null,null,null,null,null,null,null,null,null,null,null,null,411,"000002404","COLQUEMARCA","06","09","07","04","0609","000002404 - COLQUEMARCA"]
[null,null,null,null,null,null,null,null,null,null,null,null,null,412,"000002405","CHARAMURAY","06","09","07","04","0609","000002405 - CHARAMURAY"]
[null,null,null,null,null,null,null,null,null,null,null,null,null,413,"000008913","HUARACO","06","09","07","04","0609","000008913 - HUARACO"]
[null,null,null,null,null,null,null,null,null,null,null,null,null,414,"000008914","HUAYLLANI","06","09","07","04","0609","000008914 - HUAYLLANI"]
[null,null,null,null,null,null,null,null,null,null,null,null,null,415,"000012932","YANQUE","06","09","07","04","0609","000012932 - YANQUE"]
[null,null,null,null,null,null,null,null,null,null,null,null,null,416,"000002407","LLUSCO","06","09","07","06","0609","000002407 - LLUSCO"]
[null,null,null,null,null,null,null,null,null,null,null,null,null,417,"000006747","LUTTO","06","09","07","06","0609","000006747 - LUTTO"]
[null,null,null,null,null,null,null,null,null,null,null,null,null,418,"000006748","COLLPA","06","09","07","06","0609","000006748 - COLLPA"]
[null,null,null,null,null,null,null,null,null,null,null,null,null,419,"000006985","TOTORAPALLCA","06","09","07","06","0609","000006985 - TOTORAPALLCA"]
[null,null,null,null,null,null,null,null,null,null,null,null,null,420,"000027008","ANTUYO","06","09","07","06","0609","000027008 - ANTUYO"]
[null,null,null,null,null,null,null,null,null,null,null,null,null,421,"000002408","QUIÑOTA","06","09","07","07","0609","000002408 - QUIÑOTA"]
[null,null,null,null,null,null,null,null,null,null,null,null,null,422,"000006984","CCOLLANA","06","09","07","07","0609","000006984 - CCOLLANA"]
[null,null,null,null,null,null,null,null,null,null,null,null,null,423,"000007112","YORENCCA","06","09","07","07","0609","000007112 - YORENCCA"]
[null,null,null,null,null,null,null,null,null,null,null,null,null,424,"000025369","PUMALLACTA","06","09","07","07","0609","000025369 - PUMALLACTA"]
[null,null,null,null,null,null,null,null,null,null,null,null,null,425,"000002409","VELILLE","06","09","07","08","0609","000002409 - VELILLE"]
[null,null,null,null,null,null,null,null,null,null,null,null,null,426,"000008912","ALCCA VICTORIA","06","09","07","08","0609","000008912 - ALCCA VICTORIA"]
[null,null,null,null,null,null,null,null,null,null,null,null,null,427,"000025371","TUNTUMA","06","09","07","08","0609","000025371 - TUNTUMA"]
[null,null,null,null,null,null,null,null,null,null,null,null,null,428,"000027011","AYACCASI","06","09","07","08","0609","000027011 - AYACCASI"]
[null,null,null,null,null,null,null,null,null,null,null,null,null,429,"000027016","HUAYCUÑUTA - URCURUTA","06","09","07","08","0609","000027016 - HUAYCUÑUTA - URCURUTA"]
[null,null,null,null,null,null,null,null,null,null,null,null,null,430,"999999999","(All)","99","99",null,null,"9999","999999999 - (All)"]